[GUMP@vmgump-vm3]: Project poi (in module poi) failed

classic Classic list List threaded Threaded
1 message Options
Reply | Threaded
Open this post in threaded view
|

[GUMP@vmgump-vm3]: Project poi (in module poi) failed

Gump [HEAD] :-(
To whom it may engage...
       
This is an automated request, but not an unsolicited one. For
more information please visit http://gump.apache.org/nagged.html,
and/or contact the folk at [hidden email].

Project poi has an issue affecting its community integration.
This issue affects 3 projects.
The current state of this project is 'Failed', with reason 'Build Failed'.
For reference only, the following projects are affected by this:
    - org.apache.poi :  POI
    - poi :  POI
    - poi-test :  POI


Full details are available at:
    http://vmgump-vm3.apache.org/poi/poi/index.html

That said, some information snippets are provided here.

The following annotations (debug/informational/warning/error messages) were provided:
 -INFO- Failed with reason build failed
 -DEBUG- Extracted fallback artifacts from Gump Repository



The following work was performed:
http://vmgump-vm3.apache.org/poi/poi/gump_work/build_poi_poi.html
Work Name: build_poi_poi (Type: Build)
Work ended in a state of : Failed
Elapsed: 42 secs
Command Line: /usr/lib/jvm/java-8-oracle/bin/java -Djava.awt.headless=true -Dbuild.sysclasspath=only org.apache.tools.ant.Main -Dgump.merge=/srv/gump/public/gump/work/merge.xml -Djavax.xml.stream.XMLInputFactory=com.sun.xml.internal.stream.XMLInputFactoryImpl -Dversion.id=gump-20170516 -DDSTAMP=20170516 jar
[Working Directory: /srv/gump/public/workspace/poi]
CLASSPATH: /usr/lib/jvm/java-8-oracle/lib/tools.jar:/srv/gump/public/workspace/poi/build/classes:/srv/gump/public/workspace/poi/build/scratchpad-classes:/srv/gump/public/workspace/poi/build/ooxml-classes:/srv/gump/public/workspace/poi/build/excelant-classes:/srv/gump/public/workspace/poi/build/test-classes:/srv/gump/public/workspace/poi/build/scratchpad-test-classes:/srv/gump/public/workspace/poi/build/ooxml-test-classes:/srv/gump/public/workspace/poi/build/excelant-test-classes:/srv/gump/public/workspace/ant/dist/lib/ant.jar:/srv/gump/public/workspace/ant/dist/lib/ant-launcher.jar:/srv/gump/public/workspace/ant/dist/lib/ant-jmf.jar:/srv/gump/public/workspace/ant/dist/lib/ant-junit.jar:/srv/gump/public/workspace/ant/dist/lib/ant-junit4.jar:/srv/gump/public/workspace/ant/dist/lib/ant-swing.jar:/srv/gump/public/workspace/ant/dist/lib/ant-apache-resolver.jar:/srv/gump/public/workspace/ant/dist/lib/ant-apache-xalan2.jar:/srv/gump/public/workspace/logging-log4j-12/target/log4j-1.2.18-SNAP
 SHOT.jar:/srv/gump/public/workspace/apache-commons/logging/target/commons-logging-20170516.jar:/srv/gump/public/workspace/apache-commons/logging/target/commons-logging-api-20170516.jar:/srv/gump/public/workspace/commons-codec-1.x/dist/commons-codec-20170516.jar:/srv/gump/public/workspace/apache-commons/collections/target/commons-collections4-4.2-SNAPSHOT.jar:/srv/gump/public/workspace/xmlsec/target/xmlsec-2.1.0-SNAPSHOT.jar:/srv/gump/public/workspace/junit/target/junit-4.13-SNAPSHOT.jar:/srv/gump/packages/hamcrest/hamcrest-core-1.3.jar:/srv/gump/public/workspace/poi/ooxml-lib/curvesapi-1.04.jar:/srv/gump/public/workspace/poi/ooxml-lib/xmlbeans-2.6.0.jar.orig:/srv/gump/public/workspace/poi/compile-lib/bcpkix-jdk15on-1.54.jar:/srv/gump/public/workspace/poi/compile-lib/bcprov-ext-jdk15on-1.54.jar:/srv/gump/public/workspace/poi/compile-lib/slf4j-api-1.7.12.jar:/srv/gump/public/workspace/poi/ooxml-lib/ooxml-schemas-1.3.jar:/srv/gump/public/workspace/poi/ooxml-lib/ooxml-security-1.1.jar
---------------------------------------------
    [javac]  ^
    [javac]   symbol: class State
    [javac] /srv/gump/public/workspace/poi/src/ooxml/testcases/org/apache/poi/benchmark/AddImageBench.java:69: error: cannot find symbol
    [javac]     public static void main(String[] args) throws RunnerException {
    [javac]                                                   ^
    [javac]   symbol:   class RunnerException
    [javac]   location: class AddImageBench
    [javac] /srv/gump/public/workspace/poi/src/ooxml/testcases/org/apache/poi/benchmark/AddImageBench.java:48: error: cannot find symbol
    [javac]     @Setup(Level.Iteration)
    [javac]      ^
    [javac]   symbol:   class Setup
    [javac]   location: class AddImageBench
    [javac] /srv/gump/public/workspace/poi/src/ooxml/testcases/org/apache/poi/benchmark/AddImageBench.java:58: error: cannot find symbol
    [javac]     @Benchmark
    [javac]      ^
    [javac]   symbol:   class Benchmark
    [javac]   location: class AddImageBench
    [javac] /srv/gump/public/workspace/poi/src/ooxml/testcases/org/apache/poi/benchmark/AddImageBench.java:70: error: cannot find symbol
    [javac]         Options opt = new OptionsBuilder()
    [javac]         ^
    [javac]   symbol:   class Options
    [javac]   location: class AddImageBench
    [javac] /srv/gump/public/workspace/poi/src/ooxml/testcases/org/apache/poi/benchmark/AddImageBench.java:73: error: cannot find symbol
    [javac]                 .addProfiler(GCProfiler.class)
    [javac]                              ^
    [javac]   symbol:   class GCProfiler
    [javac]   location: class AddImageBench
    [javac] /srv/gump/public/workspace/poi/src/ooxml/testcases/org/apache/poi/benchmark/AddImageBench.java:72: error: cannot find symbol
    [javac]                 .addProfiler(StackProfiler.class)
    [javac]                              ^
    [javac]   symbol:   class StackProfiler
    [javac]   location: class AddImageBench
    [javac] /srv/gump/public/workspace/poi/src/ooxml/testcases/org/apache/poi/benchmark/AddImageBench.java:70: error: cannot find symbol
    [javac]         Options opt = new OptionsBuilder()
    [javac]                           ^
    [javac]   symbol:   class OptionsBuilder
    [javac]   location: class AddImageBench
    [javac] /srv/gump/public/workspace/poi/src/ooxml/testcases/org/apache/poi/benchmark/AddImageBench.java:77: error: cannot find symbol
    [javac]         new Runner(opt).run();
    [javac]             ^
    [javac]   symbol:   class Runner
    [javac]   location: class AddImageBench
    [javac] Note: Some input files use or override a deprecated API.
    [javac] Note: Recompile with -Xlint:deprecation for details.
    [javac] 20 errors

BUILD FAILED
/srv/gump/public/workspace/poi/build.xml:1034: Compile failed; see the compiler error output for details.

Total time: 41 seconds
---------------------------------------------

To subscribe to this information via syndicated feeds:
- RSS: http://vmgump-vm3.apache.org/poi/poi/rss.xml
- Atom: http://vmgump-vm3.apache.org/poi/poi/atom.xml

============================== Gump Tracking Only ===
Produced by Apache Gump(TM) version 2.3.
Gump Run 20170516060007, vmgump-vm3.apache.org:vmgump:20170516060007
Gump E-mail Identifier (unique within run) #1.

--
Apache Gump
http://gump.apache.org/ [Instance: vmgump-vm3]

---------------------------------------------------------------------
To unsubscribe, e-mail: [hidden email]
For additional commands, e-mail: [hidden email]