Build failed in Jenkins: POI » POI-XMLBeans-DSL-1.16 #1

classic Classic list List threaded Threaded
2 messages Options
Reply | Threaded
Open this post in threaded view
|

Build failed in Jenkins: POI » POI-XMLBeans-DSL-1.16 #1

Apache Jenkins Server
See <https://ci-builds.apache.org/job/POI/job/POI-XMLBeans-DSL-1.16/1/display/redirect>

Changes:


------------------------------------------
[...truncated 2.28 MB...]
 [spotbugs]   Couldn't get class info for java/util/Random
 [spotbugs]     java.lang.IllegalArgumentException: Unsupported class file major version 60
 [spotbugs]       At org.objectweb.asm.ClassReader.<init>(ClassReader.java:196)
 [spotbugs]       At org.objectweb.asm.ClassReader.<init>(ClassReader.java:177)
 [spotbugs]       At org.objectweb.asm.ClassReader.<init>(ClassReader.java:163)
 [spotbugs]       At edu.umd.cs.findbugs.asm.FBClassReader.<init>(FBClassReader.java:35)
 [spotbugs]       At edu.umd.cs.findbugs.classfile.engine.asm.ClassReaderAnalysisEngine.analyze(ClassReaderAnalysisEngine.java:48)
 [spotbugs]       At edu.umd.cs.findbugs.classfile.engine.asm.ClassReaderAnalysisEngine.analyze(ClassReaderAnalysisEngine.java:34)
 [spotbugs]       At edu.umd.cs.findbugs.classfile.impl.AnalysisCache.getClassAnalysis(AnalysisCache.java:261)
 [spotbugs]       At edu.umd.cs.findbugs.classfile.engine.ClassInfoAnalysisEngine.analyze(ClassInfoAnalysisEngine.java:75)
 [spotbugs]       At edu.umd.cs.findbugs.classfile.engine.ClassInfoAnalysisEngine.analyze(ClassInfoAnalysisEngine.java:38)
 [spotbugs]       At edu.umd.cs.findbugs.classfile.impl.AnalysisCache.getClassAnalysis(AnalysisCache.java:261)
 [spotbugs]       At edu.umd.cs.findbugs.ba.XFactory.getXClass(XFactory.java:685)
 [spotbugs]       At edu.umd.cs.findbugs.ba.AnalysisContext.setAppClassList(AnalysisContext.java:975)
 [spotbugs]       At edu.umd.cs.findbugs.FindBugs2.setAppClassList(FindBugs2.java:909)
 [spotbugs]       At edu.umd.cs.findbugs.FindBugs2.execute(FindBugs2.java:252)
 [spotbugs]       At edu.umd.cs.findbugs.FindBugs.runMain(FindBugs.java:395)
 [spotbugs]       At edu.umd.cs.findbugs.FindBugs2.main(FindBugs2.java:1231)
 [spotbugs]   Couldn't get class info for java/util/ArrayList
 [spotbugs]     java.lang.IllegalArgumentException: Unsupported class file major version 60
 [spotbugs]       At org.objectweb.asm.ClassReader.<init>(ClassReader.java:196)
 [spotbugs]       At org.objectweb.asm.ClassReader.<init>(ClassReader.java:177)
 [spotbugs]       At org.objectweb.asm.ClassReader.<init>(ClassReader.java:163)
 [spotbugs]       At edu.umd.cs.findbugs.asm.FBClassReader.<init>(FBClassReader.java:35)
 [spotbugs]       At edu.umd.cs.findbugs.classfile.engine.asm.ClassReaderAnalysisEngine.analyze(ClassReaderAnalysisEngine.java:48)
 [spotbugs]       At edu.umd.cs.findbugs.classfile.engine.asm.ClassReaderAnalysisEngine.analyze(ClassReaderAnalysisEngine.java:34)
 [spotbugs]       At edu.umd.cs.findbugs.classfile.impl.AnalysisCache.getClassAnalysis(AnalysisCache.java:261)
 [spotbugs]       At edu.umd.cs.findbugs.classfile.engine.ClassInfoAnalysisEngine.analyze(ClassInfoAnalysisEngine.java:75)
 [spotbugs]       At edu.umd.cs.findbugs.classfile.engine.ClassInfoAnalysisEngine.analyze(ClassInfoAnalysisEngine.java:38)
 [spotbugs]       At edu.umd.cs.findbugs.classfile.impl.AnalysisCache.getClassAnalysis(AnalysisCache.java:261)
 [spotbugs]       At edu.umd.cs.findbugs.ba.XFactory.getXClass(XFactory.java:685)
 [spotbugs]       At edu.umd.cs.findbugs.ba.AnalysisContext.setAppClassList(AnalysisContext.java:975)
 [spotbugs]       At edu.umd.cs.findbugs.FindBugs2.setAppClassList(FindBugs2.java:909)
 [spotbugs]       At edu.umd.cs.findbugs.FindBugs2.execute(FindBugs2.java:252)
 [spotbugs]       At edu.umd.cs.findbugs.FindBugs.runMain(FindBugs.java:395)
 [spotbugs]       At edu.umd.cs.findbugs.FindBugs2.main(FindBugs2.java:1231)
 [spotbugs]   Couldn't get class info for java/io/UnsupportedEncodingException
 [spotbugs]     java.lang.IllegalArgumentException: Unsupported class file major version 60
 [spotbugs]       At org.objectweb.asm.ClassReader.<init>(ClassReader.java:196)
 [spotbugs]       At org.objectweb.asm.ClassReader.<init>(ClassReader.java:177)
 [spotbugs]       At org.objectweb.asm.ClassReader.<init>(ClassReader.java:163)
 [spotbugs]       At edu.umd.cs.findbugs.asm.FBClassReader.<init>(FBClassReader.java:35)
 [spotbugs]       At edu.umd.cs.findbugs.classfile.engine.asm.ClassReaderAnalysisEngine.analyze(ClassReaderAnalysisEngine.java:48)
 [spotbugs]       At edu.umd.cs.findbugs.classfile.engine.asm.ClassReaderAnalysisEngine.analyze(ClassReaderAnalysisEngine.java:34)
 [spotbugs]       At edu.umd.cs.findbugs.classfile.impl.AnalysisCache.getClassAnalysis(AnalysisCache.java:261)
 [spotbugs]       At edu.umd.cs.findbugs.classfile.engine.ClassInfoAnalysisEngine.analyze(ClassInfoAnalysisEngine.java:75)
 [spotbugs]       At edu.umd.cs.findbugs.classfile.engine.ClassInfoAnalysisEngine.analyze(ClassInfoAnalysisEngine.java:38)
 [spotbugs]       At edu.umd.cs.findbugs.classfile.impl.AnalysisCache.getClassAnalysis(AnalysisCache.java:261)
 [spotbugs]       At edu.umd.cs.findbugs.ba.XFactory.getXClass(XFactory.java:685)
 [spotbugs]       At edu.umd.cs.findbugs.ba.AnalysisContext.setAppClassList(AnalysisContext.java:975)
 [spotbugs]       At edu.umd.cs.findbugs.FindBugs2.setAppClassList(FindBugs2.java:909)
 [spotbugs]       At edu.umd.cs.findbugs.FindBugs2.execute(FindBugs2.java:252)
 [spotbugs]       At edu.umd.cs.findbugs.FindBugs.runMain(FindBugs.java:395)
 [spotbugs]       At edu.umd.cs.findbugs.FindBugs2.main(FindBugs2.java:1231)
 [spotbugs]   Couldn't get class info for java/util/Locale
 [spotbugs]     java.lang.IllegalArgumentException: Unsupported class file major version 60
 [spotbugs]       At org.objectweb.asm.ClassReader.<init>(ClassReader.java:196)
 [spotbugs]       At org.objectweb.asm.ClassReader.<init>(ClassReader.java:177)
 [spotbugs]       At org.objectweb.asm.ClassReader.<init>(ClassReader.java:163)
 [spotbugs]       At edu.umd.cs.findbugs.asm.FBClassReader.<init>(FBClassReader.java:35)
 [spotbugs]       At edu.umd.cs.findbugs.classfile.engine.asm.ClassReaderAnalysisEngine.analyze(ClassReaderAnalysisEngine.java:48)
 [spotbugs]       At edu.umd.cs.findbugs.classfile.engine.asm.ClassReaderAnalysisEngine.analyze(ClassReaderAnalysisEngine.java:34)
 [spotbugs]       At edu.umd.cs.findbugs.classfile.impl.AnalysisCache.getClassAnalysis(AnalysisCache.java:261)
 [spotbugs]       At edu.umd.cs.findbugs.classfile.engine.ClassInfoAnalysisEngine.analyze(ClassInfoAnalysisEngine.java:75)
 [spotbugs]       At edu.umd.cs.findbugs.classfile.engine.ClassInfoAnalysisEngine.analyze(ClassInfoAnalysisEngine.java:38)
 [spotbugs]       At edu.umd.cs.findbugs.classfile.impl.AnalysisCache.getClassAnalysis(AnalysisCache.java:261)
 [spotbugs]       At edu.umd.cs.findbugs.ba.XFactory.getXClass(XFactory.java:685)
 [spotbugs]       At edu.umd.cs.findbugs.ba.AnalysisContext.setAppClassList(AnalysisContext.java:975)
 [spotbugs]       At edu.umd.cs.findbugs.FindBugs2.setAppClassList(FindBugs2.java:909)
 [spotbugs]       At edu.umd.cs.findbugs.FindBugs2.execute(FindBugs2.java:252)
 [spotbugs]       At edu.umd.cs.findbugs.FindBugs.runMain(FindBugs.java:395)
 [spotbugs]       At edu.umd.cs.findbugs.FindBugs2.main(FindBugs2.java:1231)
 [spotbugs]   Couldn't get class info for java/lang/AssertionError
 [spotbugs]     java.lang.IllegalArgumentException: Unsupported class file major version 60
 [spotbugs]       At org.objectweb.asm.ClassReader.<init>(ClassReader.java:196)
 [spotbugs]       At org.objectweb.asm.ClassReader.<init>(ClassReader.java:177)
 [spotbugs]       At org.objectweb.asm.ClassReader.<init>(ClassReader.java:163)
 [spotbugs]       At edu.umd.cs.findbugs.asm.FBClassReader.<init>(FBClassReader.java:35)
 [spotbugs]       At edu.umd.cs.findbugs.classfile.engine.asm.ClassReaderAnalysisEngine.analyze(ClassReaderAnalysisEngine.java:48)
 [spotbugs]       At edu.umd.cs.findbugs.classfile.engine.asm.ClassReaderAnalysisEngine.analyze(ClassReaderAnalysisEngine.java:34)
 [spotbugs]       At edu.umd.cs.findbugs.classfile.impl.AnalysisCache.getClassAnalysis(AnalysisCache.java:261)
 [spotbugs]       At edu.umd.cs.findbugs.classfile.engine.ClassInfoAnalysisEngine.analyze(ClassInfoAnalysisEngine.java:75)
 [spotbugs]       At edu.umd.cs.findbugs.classfile.engine.ClassInfoAnalysisEngine.analyze(ClassInfoAnalysisEngine.java:38)
 [spotbugs]       At edu.umd.cs.findbugs.classfile.impl.AnalysisCache.getClassAnalysis(AnalysisCache.java:261)
 [spotbugs]       At edu.umd.cs.findbugs.ba.XFactory.getXClass(XFactory.java:685)
 [spotbugs]       At edu.umd.cs.findbugs.ba.AnalysisContext.setAppClassList(AnalysisContext.java:975)
 [spotbugs]       At edu.umd.cs.findbugs.FindBugs2.setAppClassList(FindBugs2.java:909)
 [spotbugs]       At edu.umd.cs.findbugs.FindBugs2.execute(FindBugs2.java:252)
 [spotbugs]       At edu.umd.cs.findbugs.FindBugs.runMain(FindBugs.java:395)
 [spotbugs]       At edu.umd.cs.findbugs.FindBugs2.main(FindBugs2.java:1231)
 [spotbugs]   Couldn't get class info for java/util/Collections
 [spotbugs]     java.lang.IllegalArgumentException: Unsupported class file major version 60
 [spotbugs]       At org.objectweb.asm.ClassReader.<init>(ClassReader.java:196)
 [spotbugs]       At org.objectweb.asm.ClassReader.<init>(ClassReader.java:177)
 [spotbugs]       At org.objectweb.asm.ClassReader.<init>(ClassReader.java:163)
 [spotbugs]       At edu.umd.cs.findbugs.asm.FBClassReader.<init>(FBClassReader.java:35)
 [spotbugs]       At edu.umd.cs.findbugs.classfile.engine.asm.ClassReaderAnalysisEngine.analyze(ClassReaderAnalysisEngine.java:48)
 [spotbugs]       At edu.umd.cs.findbugs.classfile.engine.asm.ClassReaderAnalysisEngine.analyze(ClassReaderAnalysisEngine.java:34)
 [spotbugs]       At edu.umd.cs.findbugs.classfile.impl.AnalysisCache.getClassAnalysis(AnalysisCache.java:261)
 [spotbugs]       At edu.umd.cs.findbugs.classfile.engine.ClassInfoAnalysisEngine.analyze(ClassInfoAnalysisEngine.java:75)
 [spotbugs]       At edu.umd.cs.findbugs.classfile.engine.ClassInfoAnalysisEngine.analyze(ClassInfoAnalysisEngine.java:38)
 [spotbugs]       At edu.umd.cs.findbugs.classfile.impl.AnalysisCache.getClassAnalysis(AnalysisCache.java:261)
 [spotbugs]       At edu.umd.cs.findbugs.ba.XFactory.getXClass(XFactory.java:685)
 [spotbugs]       At edu.umd.cs.findbugs.ba.AnalysisContext.setAppClassList(AnalysisContext.java:975)
 [spotbugs]       At edu.umd.cs.findbugs.FindBugs2.setAppClassList(FindBugs2.java:909)
 [spotbugs]       At edu.umd.cs.findbugs.FindBugs2.execute(FindBugs2.java:252)
 [spotbugs]       At edu.umd.cs.findbugs.FindBugs.runMain(FindBugs.java:395)
 [spotbugs]       At edu.umd.cs.findbugs.FindBugs2.main(FindBugs2.java:1231)
 [spotbugs]   Couldn't get class info for java/util/stream/LongStream
 [spotbugs]     java.lang.IllegalArgumentException: Unsupported class file major version 60
 [spotbugs]       At org.objectweb.asm.ClassReader.<init>(ClassReader.java:196)
 [spotbugs]       At org.objectweb.asm.ClassReader.<init>(ClassReader.java:177)
 [spotbugs]       At org.objectweb.asm.ClassReader.<init>(ClassReader.java:163)
 [spotbugs]       At edu.umd.cs.findbugs.asm.FBClassReader.<init>(FBClassReader.java:35)
 [spotbugs]       At edu.umd.cs.findbugs.classfile.engine.asm.ClassReaderAnalysisEngine.analyze(ClassReaderAnalysisEngine.java:48)
 [spotbugs]       At edu.umd.cs.findbugs.classfile.engine.asm.ClassReaderAnalysisEngine.analyze(ClassReaderAnalysisEngine.java:34)
 [spotbugs]       At edu.umd.cs.findbugs.classfile.impl.AnalysisCache.getClassAnalysis(AnalysisCache.java:261)
 [spotbugs]       At edu.umd.cs.findbugs.classfile.engine.ClassInfoAnalysisEngine.analyze(ClassInfoAnalysisEngine.java:75)
 [spotbugs]       At edu.umd.cs.findbugs.classfile.engine.ClassInfoAnalysisEngine.analyze(ClassInfoAnalysisEngine.java:38)
 [spotbugs]       At edu.umd.cs.findbugs.classfile.impl.AnalysisCache.getClassAnalysis(AnalysisCache.java:261)
 [spotbugs]       At edu.umd.cs.findbugs.ba.XFactory.getXClass(XFactory.java:685)
 [spotbugs]       At edu.umd.cs.findbugs.ba.AnalysisContext.setAppClassList(AnalysisContext.java:975)
 [spotbugs]       At edu.umd.cs.findbugs.FindBugs2.setAppClassList(FindBugs2.java:909)
 [spotbugs]       At edu.umd.cs.findbugs.FindBugs2.execute(FindBugs2.java:252)
 [spotbugs]       At edu.umd.cs.findbugs.FindBugs.runMain(FindBugs.java:395)
 [spotbugs]       At edu.umd.cs.findbugs.FindBugs2.main(FindBugs2.java:1231)
 [spotbugs]   Couldn't get class info for java/lang/NoSuchFieldException
 [spotbugs]     java.lang.IllegalArgumentException: Unsupported class file major version 60
 [spotbugs]       At org.objectweb.asm.ClassReader.<init>(ClassReader.java:196)
 [spotbugs]       At org.objectweb.asm.ClassReader.<init>(ClassReader.java:177)
 [spotbugs]       At org.objectweb.asm.ClassReader.<init>(ClassReader.java:163)
 [spotbugs]       At edu.umd.cs.findbugs.asm.FBClassReader.<init>(FBClassReader.java:35)
 [spotbugs]       At edu.umd.cs.findbugs.classfile.engine.asm.ClassReaderAnalysisEngine.analyze(ClassReaderAnalysisEngine.java:48)
 [spotbugs]       At edu.umd.cs.findbugs.classfile.engine.asm.ClassReaderAnalysisEngine.analyze(ClassReaderAnalysisEngine.java:34)
 [spotbugs]       At edu.umd.cs.findbugs.classfile.impl.AnalysisCache.getClassAnalysis(AnalysisCache.java:261)
 [spotbugs]       At edu.umd.cs.findbugs.classfile.engine.ClassInfoAnalysisEngine.analyze(ClassInfoAnalysisEngine.java:75)
 [spotbugs]       At edu.umd.cs.findbugs.classfile.engine.ClassInfoAnalysisEngine.analyze(ClassInfoAnalysisEngine.java:38)
 [spotbugs]       At edu.umd.cs.findbugs.classfile.impl.AnalysisCache.getClassAnalysis(AnalysisCache.java:261)
 [spotbugs]       At edu.umd.cs.findbugs.ba.XFactory.getXClass(XFactory.java:685)
 [spotbugs]       At edu.umd.cs.findbugs.ba.AnalysisContext.setAppClassList(AnalysisContext.java:975)
 [spotbugs]       At edu.umd.cs.findbugs.FindBugs2.setAppClassList(FindBugs2.java:909)
 [spotbugs]       At edu.umd.cs.findbugs.FindBugs2.execute(FindBugs2.java:252)
 [spotbugs]       At edu.umd.cs.findbugs.FindBugs.runMain(FindBugs.java:395)
 [spotbugs]       At edu.umd.cs.findbugs.FindBugs2.main(FindBugs2.java:1231)
 [spotbugs]   Couldn't get class info for java/io/FileInputStream
 [spotbugs]     java.lang.IllegalArgumentException: Unsupported class file major version 60
 [spotbugs]       At org.objectweb.asm.ClassReader.<init>(ClassReader.java:196)
 [spotbugs]       At org.objectweb.asm.ClassReader.<init>(ClassReader.java:177)
 [spotbugs]       At org.objectweb.asm.ClassReader.<init>(ClassReader.java:163)
 [spotbugs]       At edu.umd.cs.findbugs.asm.FBClassReader.<init>(FBClassReader.java:35)
 [spotbugs]       At edu.umd.cs.findbugs.classfile.engine.asm.ClassReaderAnalysisEngine.analyze(ClassReaderAnalysisEngine.java:48)
 [spotbugs]       At edu.umd.cs.findbugs.classfile.engine.asm.ClassReaderAnalysisEngine.analyze(ClassReaderAnalysisEngine.java:34)
 [spotbugs]       At edu.umd.cs.findbugs.classfile.impl.AnalysisCache.getClassAnalysis(AnalysisCache.java:261)
 [spotbugs]       At edu.umd.cs.findbugs.classfile.engine.ClassInfoAnalysisEngine.analyze(ClassInfoAnalysisEngine.java:75)
 [spotbugs]       At edu.umd.cs.findbugs.classfile.engine.ClassInfoAnalysisEngine.analyze(ClassInfoAnalysisEngine.java:38)
 [spotbugs]       At edu.umd.cs.findbugs.classfile.impl.AnalysisCache.getClassAnalysis(AnalysisCache.java:261)
 [spotbugs]       At edu.umd.cs.findbugs.ba.XFactory.getXClass(XFactory.java:685)
 [spotbugs]       At edu.umd.cs.findbugs.ba.AnalysisContext.setAppClassList(AnalysisContext.java:975)
 [spotbugs]       At edu.umd.cs.findbugs.FindBugs2.setAppClassList(FindBugs2.java:909)
 [spotbugs]       At edu.umd.cs.findbugs.FindBugs2.execute(FindBugs2.java:252)
 [spotbugs]       At edu.umd.cs.findbugs.FindBugs.runMain(FindBugs.java:395)
 [spotbugs]       At edu.umd.cs.findbugs.FindBugs2.main(FindBugs2.java:1231)
 [spotbugs]   Couldn't get class info for java/util/Set
 [spotbugs]     java.lang.IllegalArgumentException: Unsupported class file major version 60
 [spotbugs]       At org.objectweb.asm.ClassReader.<init>(ClassReader.java:196)
 [spotbugs]       At org.objectweb.asm.ClassReader.<init>(ClassReader.java:177)
 [spotbugs]       At org.objectweb.asm.ClassReader.<init>(ClassReader.java:163)
 [spotbugs]       At edu.umd.cs.findbugs.asm.FBClassReader.<init>(FBClassReader.java:35)
 [spotbugs]       At edu.umd.cs.findbugs.classfile.engine.asm.ClassReaderAnalysisEngine.analyze(ClassReaderAnalysisEngine.java:48)
 [spotbugs]       At edu.umd.cs.findbugs.classfile.engine.asm.ClassReaderAnalysisEngine.analyze(ClassReaderAnalysisEngine.java:34)
 [spotbugs]       At edu.umd.cs.findbugs.classfile.impl.AnalysisCache.getClassAnalysis(AnalysisCache.java:261)
 [spotbugs]       At edu.umd.cs.findbugs.classfile.engine.ClassInfoAnalysisEngine.analyze(ClassInfoAnalysisEngine.java:75)
 [spotbugs]       At edu.umd.cs.findbugs.classfile.engine.ClassInfoAnalysisEngine.analyze(ClassInfoAnalysisEngine.java:38)
 [spotbugs]       At edu.umd.cs.findbugs.classfile.impl.AnalysisCache.getClassAnalysis(AnalysisCache.java:261)
 [spotbugs]       At edu.umd.cs.findbugs.ba.XFactory.getXClass(XFactory.java:685)
 [spotbugs]       At edu.umd.cs.findbugs.ba.AnalysisContext.setAppClassList(AnalysisContext.java:975)
 [spotbugs]       At edu.umd.cs.findbugs.FindBugs2.setAppClassList(FindBugs2.java:909)
 [spotbugs]       At edu.umd.cs.findbugs.FindBugs2.execute(FindBugs2.java:252)
 [spotbugs]       At edu.umd.cs.findbugs.FindBugs.runMain(FindBugs.java:395)
 [spotbugs]       At edu.umd.cs.findbugs.FindBugs2.main(FindBugs2.java:1231)
 [spotbugs]   Couldn't get class info for java/util/TimeZone
 [spotbugs]     java.lang.IllegalArgumentException: Unsupported class file major version 60
 [spotbugs]       At org.objectweb.asm.ClassReader.<init>(ClassReader.java:196)
 [spotbugs]       At org.objectweb.asm.ClassReader.<init>(ClassReader.java:177)
 [spotbugs]       At org.objectweb.asm.ClassReader.<init>(ClassReader.java:163)
 [spotbugs]       At edu.umd.cs.findbugs.asm.FBClassReader.<init>(FBClassReader.java:35)
 [spotbugs]       At edu.umd.cs.findbugs.classfile.engine.asm.ClassReaderAnalysisEngine.analyze(ClassReaderAnalysisEngine.java:48)
 [spotbugs]       At edu.umd.cs.findbugs.classfile.engine.asm.ClassReaderAnalysisEngine.analyze(ClassReaderAnalysisEngine.java:34)
 [spotbugs]       At edu.umd.cs.findbugs.classfile.impl.AnalysisCache.getClassAnalysis(AnalysisCache.java:261)
 [spotbugs]       At edu.umd.cs.findbugs.classfile.engine.ClassInfoAnalysisEngine.analyze(ClassInfoAnalysisEngine.java:75)
 [spotbugs]       At edu.umd.cs.findbugs.classfile.engine.ClassInfoAnalysisEngine.analyze(ClassInfoAnalysisEngine.java:38)
 [spotbugs]       At edu.umd.cs.findbugs.classfile.impl.AnalysisCache.getClassAnalysis(AnalysisCache.java:261)
 [spotbugs]       At edu.umd.cs.findbugs.ba.XFactory.getXClass(XFactory.java:685)
 [spotbugs]       At edu.umd.cs.findbugs.ba.AnalysisContext.setAppClassList(AnalysisContext.java:975)
 [spotbugs]       At edu.umd.cs.findbugs.FindBugs2.setAppClassList(FindBugs2.java:909)
 [spotbugs]       At edu.umd.cs.findbugs.FindBugs2.execute(FindBugs2.java:252)
 [spotbugs]       At edu.umd.cs.findbugs.FindBugs.runMain(FindBugs.java:395)
 [spotbugs]       At edu.umd.cs.findbugs.FindBugs2.main(FindBugs2.java:1231)
 [spotbugs]   Couldn't get class info for javax/xml/catalog/CatalogFeatures$Builder
 [spotbugs]     java.lang.IllegalArgumentException: Unsupported class file major version 60
 [spotbugs]       At org.objectweb.asm.ClassReader.<init>(ClassReader.java:196)
 [spotbugs]       At org.objectweb.asm.ClassReader.<init>(ClassReader.java:177)
 [spotbugs]       At org.objectweb.asm.ClassReader.<init>(ClassReader.java:163)
 [spotbugs]       At edu.umd.cs.findbugs.asm.FBClassReader.<init>(FBClassReader.java:35)
 [spotbugs]       At edu.umd.cs.findbugs.classfile.engine.asm.ClassReaderAnalysisEngine.analyze(ClassReaderAnalysisEngine.java:48)
 [spotbugs]       At edu.umd.cs.findbugs.classfile.engine.asm.ClassReaderAnalysisEngine.analyze(ClassReaderAnalysisEngine.java:34)
 [spotbugs]       At edu.umd.cs.findbugs.classfile.impl.AnalysisCache.getClassAnalysis(AnalysisCache.java:261)
 [spotbugs]       At edu.umd.cs.findbugs.classfile.engine.ClassInfoAnalysisEngine.analyze(ClassInfoAnalysisEngine.java:75)
 [spotbugs]       At edu.umd.cs.findbugs.classfile.engine.ClassInfoAnalysisEngine.analyze(ClassInfoAnalysisEngine.java:38)
 [spotbugs]       At edu.umd.cs.findbugs.classfile.impl.AnalysisCache.getClassAnalysis(AnalysisCache.java:261)
 [spotbugs]       At edu.umd.cs.findbugs.ba.XFactory.getXClass(XFactory.java:685)
 [spotbugs]       At edu.umd.cs.findbugs.ba.AnalysisContext.setAppClassList(AnalysisContext.java:975)
 [spotbugs]       At edu.umd.cs.findbugs.FindBugs2.setAppClassList(FindBugs2.java:909)
 [spotbugs]       At edu.umd.cs.findbugs.FindBugs2.execute(FindBugs2.java:252)
 [spotbugs]       At edu.umd.cs.findbugs.FindBugs.runMain(FindBugs.java:395)
 [spotbugs]       At edu.umd.cs.findbugs.FindBugs2.main(FindBugs2.java:1231)
 [spotbugs] The following classes needed for analysis were missing:
 [spotbugs]   org.apache.maven.plugin.AbstractMojo
 [spotbugs]
 [spotbugs] java.lang.IllegalArgumentException: Unsupported class file major version 60
 [spotbugs] at org.objectweb.asm.ClassReader.<init>(ClassReader.java:196)
 [spotbugs] at org.objectweb.asm.ClassReader.<init>(ClassReader.java:177)
 [spotbugs] at org.objectweb.asm.ClassReader.<init>(ClassReader.java:163)
 [spotbugs] at edu.umd.cs.findbugs.asm.FBClassReader.<init>(FBClassReader.java:35)
 [spotbugs] at edu.umd.cs.findbugs.classfile.engine.asm.ClassReaderAnalysisEngine.analyze(ClassReaderAnalysisEngine.java:48)
 [spotbugs] at edu.umd.cs.findbugs.classfile.engine.asm.ClassReaderAnalysisEngine.analyze(ClassReaderAnalysisEngine.java:34)
 [spotbugs] at edu.umd.cs.findbugs.classfile.impl.AnalysisCache.getClassAnalysis(AnalysisCache.java:261)
 [spotbugs] at edu.umd.cs.findbugs.classfile.engine.ClassInfoAnalysisEngine.analyze(ClassInfoAnalysisEngine.java:75)
 [spotbugs] at edu.umd.cs.findbugs.classfile.engine.ClassInfoAnalysisEngine.analyze(ClassInfoAnalysisEngine.java:38)
 [spotbugs] at edu.umd.cs.findbugs.classfile.impl.AnalysisCache.getClassAnalysis(AnalysisCache.java:261)
 [spotbugs] at edu.umd.cs.findbugs.ba.XFactory.getXClass(XFactory.java:685)
 [spotbugs] at edu.umd.cs.findbugs.ba.AnalysisContext.setAppClassList(AnalysisContext.java:975)
 [spotbugs] at edu.umd.cs.findbugs.FindBugs2.setAppClassList(FindBugs2.java:909)
 [spotbugs] at edu.umd.cs.findbugs.FindBugs2.execute(FindBugs2.java:252)
 [spotbugs] at edu.umd.cs.findbugs.FindBugs.runMain(FindBugs.java:395)
 [spotbugs] at edu.umd.cs.findbugs.FindBugs2.main(FindBugs2.java:1231)
 [spotbugs] Java Result: 4

BUILD FAILED
<https://ci-builds.apache.org/job/POI/job/POI-XMLBeans-DSL-1.16/ws/build.xml>:979: Execution of SpotBugs failed.

Total time: 14 minutes 50 seconds
Build step 'Invoke Ant' marked build as failure
Archiving artifacts
[Fast Archiver] No prior successful build to compare, so performing full copy of artifacts
Skipping publisher since build result is FAILURE
Recording test results
[Checks API] No suitable checks publisher found.
[SpotBugs] Skipping execution of recorder since overall result is 'FAILURE'

---------------------------------------------------------------------
To unsubscribe, e-mail: [hidden email]
For additional commands, e-mail: [hidden email]

Reply | Threaded
Open this post in threaded view
|

Jenkins build is back to normal : POI » POI-XMLBeans-DSL-1.16 #2

Apache Jenkins Server
See <https://ci-builds.apache.org/job/POI/job/POI-XMLBeans-DSL-1.16/2/display/redirect?page=changes>


---------------------------------------------------------------------
To unsubscribe, e-mail: [hidden email]
For additional commands, e-mail: [hidden email]