Build failed in Jenkins: POI » POI-DSL-Windows-1.8 #105

classic Classic list List threaded Threaded
11 messages Options
Reply | Threaded
Open this post in threaded view
|

Build failed in Jenkins: POI » POI-DSL-Windows-1.8 #105

Apache Jenkins Server
See <https://ci-builds.apache.org/job/POI/job/POI-DSL-Windows-1.8/105/display/redirect?page=changes>

Changes:

[Andreas Beeker] include externals on release build checkout

[Andreas Beeker] #65046 - Simplify integration tests

[Andreas Beeker] Sonar fixes
add asserts to tests


------------------------------------------
[...truncated 340.99 KB...]
     [echo] Tests run: 11, Failures: 0, Aborted: 0, Skipped: 0, Time elapsed: 0.008000 sec
     [echo] Ran org.apache.poi.ss.formula.functions.TestIntercept
     [echo] Tests run: 4, Failures: 0, Aborted: 0, Skipped: 0, Time elapsed: 0.004000 sec
     [echo] Ran org.apache.poi.ss.formula.functions.TestIrr
     [echo] Tests run: 3, Failures: 0, Aborted: 0, Skipped: 0, Time elapsed: 0.003000 sec
     [echo] Ran org.apache.poi.ss.formula.functions.TestIsBlank
     [echo] Tests run: 1, Failures: 0, Aborted: 0, Skipped: 0, Time elapsed: 0.001000 sec
     [echo] Ran org.apache.poi.ss.formula.functions.TestLeftRight
     [echo] Tests run: 2, Failures: 0, Aborted: 0, Skipped: 0, Time elapsed: 0.001000 sec
     [echo] Ran org.apache.poi.ss.formula.functions.TestLen
     [echo] Tests run: 3, Failures: 0, Aborted: 0, Skipped: 0, Time elapsed: 0.001000 sec
     [echo] Ran org.apache.poi.ss.formula.functions.TestLogicalFunction
     [echo] Tests run: 2, Failures: 0, Aborted: 0, Skipped: 0, Time elapsed: 0.001000 sec
     [echo] Ran org.apache.poi.ss.formula.functions.TestLogicalFunctionsFromSpreadsheet
     [echo] Tests run: 15, Failures: 0, Aborted: 0, Skipped: 0, Time elapsed: 0.009000 sec
     [echo] Ran org.apache.poi.ss.formula.functions.TestLookupFunctionsFromSpreadsheet
     [echo] Tests run: 205, Failures: 0, Aborted: 0, Skipped: 0, Time elapsed: 0.147000 sec
     [echo] Ran org.apache.poi.ss.formula.functions.TestMatch
     [echo] Tests run: 9, Failures: 0, Aborted: 0, Skipped: 0, Time elapsed: 0.005000 sec
     [echo] Ran org.apache.poi.ss.formula.functions.TestMatchFunctionsFromSpreadsheet
     [echo] Tests run: 14, Failures: 0, Aborted: 0, Skipped: 0, Time elapsed: 0.009000 sec
     [echo] Ran org.apache.poi.ss.formula.functions.TestMathX
     [echo] Tests run: 23, Failures: 0, Aborted: 0, Skipped: 0, Time elapsed: 0.007000 sec
     [echo] Ran org.apache.poi.ss.formula.functions.TestMid
     [echo] Tests run: 4, Failures: 0, Aborted: 0, Skipped: 0, Time elapsed: 0.001000 sec
     [echo] Ran org.apache.poi.ss.formula.functions.TestMirr
     [echo] Tests run: 4, Failures: 0, Aborted: 0, Skipped: 0, Time elapsed: 0.003000 sec
     [echo] Ran org.apache.poi.ss.formula.functions.TestMultiOperandNumericFunction
     [echo] Tests run: 3, Failures: 0, Aborted: 0, Skipped: 0, Time elapsed: 0.001000 sec
     [echo] Ran org.apache.poi.ss.formula.functions.TestNper
     [echo] Tests run: 2, Failures: 0, Aborted: 0, Skipped: 0, Time elapsed: 0.001000 sec
     [echo] Ran org.apache.poi.ss.formula.functions.TestNpv
     [echo] Tests run: 2, Failures: 0, Aborted: 0, Skipped: 0, Time elapsed: 0.002000 sec
     [echo] Ran org.apache.poi.ss.formula.functions.TestOct2Dec
     [echo] Tests run: 2, Failures: 0, Aborted: 0, Skipped: 0, Time elapsed: 0.001000 sec
     [echo] Ran org.apache.poi.ss.formula.functions.TestOffset
     [echo] Tests run: 21, Failures: 0, Aborted: 0, Skipped: 0, Time elapsed: 0.007000 sec
     [echo] Ran org.apache.poi.ss.formula.functions.TestPPMT
     [echo] Tests run: 1, Failures: 0, Aborted: 0, Skipped: 0, Time elapsed: 0.002000 sec
     [echo] Ran org.apache.poi.ss.formula.functions.TestPmt
     [echo] Tests run: 2, Failures: 0, Aborted: 0, Skipped: 0, Time elapsed: 0.000000 sec
     [echo] Ran org.apache.poi.ss.formula.functions.TestPoisson
     [echo] Tests run: 6, Failures: 0, Aborted: 0, Skipped: 0, Time elapsed: 0.001000 sec
     [echo] Ran org.apache.poi.ss.formula.functions.TestProduct
     [echo] Tests run: 4, Failures: 0, Aborted: 0, Skipped: 0, Time elapsed: 0.001000 sec
     [echo] Ran org.apache.poi.ss.formula.functions.TestQuotient
     [echo] Tests run: 2, Failures: 0, Aborted: 0, Skipped: 0, Time elapsed: 0.001000 sec
     [echo] Ran org.apache.poi.ss.formula.functions.TestQuotientFunctionsFromSpreadsheet
     [echo] Tests run: 8, Failures: 0, Aborted: 0, Skipped: 0, Time elapsed: 0.004000 sec
     [echo] Ran org.apache.poi.ss.formula.functions.TestRank
     [echo] Tests run: 1, Failures: 0, Aborted: 0, Skipped: 0, Time elapsed: 0.002000 sec
     [echo] Ran org.apache.poi.ss.formula.functions.TestRelationalOperations
     [echo] Tests run: 5, Failures: 0, Aborted: 0, Skipped: 0, Time elapsed: 0.001000 sec
     [echo] Ran org.apache.poi.ss.formula.functions.TestReptFunctionsFromSpreadsheet
     [echo] Tests run: 5, Failures: 0, Aborted: 0, Skipped: 0, Time elapsed: 0.008000 sec
     [echo] Ran org.apache.poi.ss.formula.functions.TestRomanFunctionsFromSpreadsheet
     [echo] Tests run: 35, Failures: 0, Aborted: 0, Skipped: 0, Time elapsed: 0.018000 sec
     [echo] Ran org.apache.poi.ss.formula.functions.TestRoundFuncs
     [echo] Tests run: 5, Failures: 0, Aborted: 0, Skipped: 1, Time elapsed: 0.001000 sec
     [echo] Ran org.apache.poi.ss.formula.functions.TestRowCol
     [echo] Tests run: 4, Failures: 0, Aborted: 0, Skipped: 0, Time elapsed: 0.002000 sec
     [echo] Ran org.apache.poi.ss.formula.functions.TestSlope
     [echo] Tests run: 3, Failures: 0, Aborted: 0, Skipped: 0, Time elapsed: 0.001000 sec
     [echo] Ran org.apache.poi.ss.formula.functions.TestStatsLib
     [echo] Tests run: 8, Failures: 0, Aborted: 0, Skipped: 0, Time elapsed: 0.001000 sec
     [echo] Ran org.apache.poi.ss.formula.functions.TestSubstitute
     [echo] Tests run: 5, Failures: 0, Aborted: 0, Skipped: 0, Time elapsed: 0.000000 sec
     [echo] Ran org.apache.poi.ss.formula.functions.TestSubtotal
     [echo] Tests run: 11, Failures: 0, Aborted: 0, Skipped: 0, Time elapsed: 0.009000 sec
     [echo] Ran org.apache.poi.ss.formula.functions.TestSumif
     [echo] Tests run: 3, Failures: 0, Aborted: 0, Skipped: 0, Time elapsed: 0.001000 sec
     [echo] Ran org.apache.poi.ss.formula.functions.TestSumifs
     [echo] Tests run: 7, Failures: 0, Aborted: 0, Skipped: 0, Time elapsed: 0.005000 sec
     [echo] Ran org.apache.poi.ss.formula.functions.TestSumproduct
     [echo] Tests run: 5, Failures: 0, Aborted: 0, Skipped: 0, Time elapsed: 0.001000 sec
     [echo] Ran org.apache.poi.ss.formula.functions.TestTFunc
     [echo] Tests run: 5, Failures: 0, Aborted: 0, Skipped: 0, Time elapsed: 0.001000 sec
     [echo] Ran org.apache.poi.ss.formula.functions.TestText
     [echo] Tests run: 4, Failures: 0, Aborted: 0, Skipped: 0, Time elapsed: 0.003000 sec
     [echo] Ran org.apache.poi.ss.formula.functions.TestTime
     [echo] Tests run: 2, Failures: 0, Aborted: 0, Skipped: 0, Time elapsed: 0.004000 sec
     [echo] Ran org.apache.poi.ss.formula.functions.TestTrendFunctionsFromSpreadsheet
     [echo] Tests run: 41, Failures: 0, Aborted: 0, Skipped: 0, Time elapsed: 0.052000 sec
     [echo] Ran org.apache.poi.ss.formula.functions.TestTrim
     [echo] Tests run: 3, Failures: 0, Aborted: 0, Skipped: 0, Time elapsed: 0.001000 sec
     [echo] Ran org.apache.poi.ss.formula.functions.TestTrunc
     [echo] Tests run: 7, Failures: 0, Aborted: 0, Skipped: 0, Time elapsed: 0.001000 sec
     [echo] Ran org.apache.poi.ss.formula.functions.TestTwoOperandNumericFunctionsFromSpreadsheet
     [echo] Tests run: 34, Failures: 0, Aborted: 0, Skipped: 0, Time elapsed: 0.020000 sec
     [echo] Ran org.apache.poi.ss.formula.functions.TestValue
     [echo] Tests run: 2, Failures: 0, Aborted: 0, Skipped: 0, Time elapsed: 0.001000 sec
     [echo] Ran org.apache.poi.ss.formula.functions.TestWeekNumFunctionsFromSpreadsheet
     [echo] Tests run: 7, Failures: 0, Aborted: 0, Skipped: 0, Time elapsed: 0.004000 sec
     [echo] Ran org.apache.poi.ss.formula.functions.TestWeekNumFunctionsFromSpreadsheet2013
     [echo] Tests run: 7, Failures: 0, Aborted: 0, Skipped: 0, Time elapsed: 0.006000 sec
     [echo] Ran org.apache.poi.ss.formula.functions.TestWeekdayFunc
     [echo] Tests run: 2, Failures: 0, Aborted: 0, Skipped: 0, Time elapsed: 0.001000 sec
     [echo] Ran org.apache.poi.ss.formula.functions.TestXYNumericFunction
     [echo] Tests run: 3, Failures: 0, Aborted: 0, Skipped: 0, Time elapsed: 0.002000 sec
     [echo] Ran org.apache.poi.ss.formula.ptg.TestAbstractFunctionPtg
     [echo] Tests run: 3, Failures: 0, Aborted: 0, Skipped: 0, Time elapsed: 0.001000 sec
     [echo] Ran org.apache.poi.ss.formula.ptg.TestArea3DPtg
     [echo] Tests run: 1, Failures: 0, Aborted: 0, Skipped: 0, Time elapsed: 0.000000 sec
     [echo] Ran org.apache.poi.ss.formula.ptg.TestAreaErrPtg
     [echo] Tests run: 1, Failures: 0, Aborted: 0, Skipped: 0, Time elapsed: 0.001000 sec
     [echo] Ran org.apache.poi.ss.formula.ptg.TestAreaPtg
     [echo] Tests run: 5, Failures: 0, Aborted: 0, Skipped: 0, Time elapsed: 0.001000 sec
     [echo] Ran org.apache.poi.ss.formula.ptg.TestArrayPtg
     [echo] Tests run: 5, Failures: 0, Aborted: 0, Skipped: 0, Time elapsed: 0.002000 sec
     [echo] Ran org.apache.poi.ss.formula.ptg.TestAttrPtg
     [echo] Tests run: 1, Failures: 0, Aborted: 0, Skipped: 0, Time elapsed: 0.001000 sec
     [echo] Ran org.apache.poi.ss.formula.ptg.TestErrPtg
     [echo] Tests run: 1, Failures: 0, Aborted: 0, Skipped: 0, Time elapsed: 0.001000 sec
     [echo] Ran org.apache.poi.ss.formula.ptg.TestExternalFunctionFormulas
     [echo] Tests run: 3, Failures: 0, Aborted: 0, Skipped: 0, Time elapsed: 0.002000 sec
     [echo] Ran org.apache.poi.ss.formula.ptg.TestExternalNameReference
     [echo] Tests run: 3, Failures: 0, Aborted: 0, Skipped: 0, Time elapsed: 0.004000 sec
     [echo] Ran org.apache.poi.ss.formula.ptg.TestFuncPtg
     [echo] Tests run: 2, Failures: 0, Aborted: 0, Skipped: 0, Time elapsed: 0.000000 sec
     [echo] Ran org.apache.poi.ss.formula.ptg.TestFuncVarPtg
     [echo] Tests run: 1, Failures: 0, Aborted: 0, Skipped: 0, Time elapsed: 0.001000 sec
     [echo] Ran org.apache.poi.ss.formula.ptg.TestIntersectionPtg
     [echo] Tests run: 1, Failures: 0, Aborted: 0, Skipped: 0, Time elapsed: 0.002000 sec
     [echo] Ran org.apache.poi.ss.formula.ptg.TestPercentPtg
     [echo] Tests run: 1, Failures: 0, Aborted: 0, Skipped: 0, Time elapsed: 0.001000 sec
     [echo] Ran org.apache.poi.ss.formula.ptg.TestRangePtg
     [echo] Tests run: 1, Failures: 0, Aborted: 0, Skipped: 0, Time elapsed: 0.001000 sec
     [echo] Ran org.apache.poi.ss.formula.ptg.TestRef3DPtg
     [echo] Tests run: 1, Failures: 0, Aborted: 0, Skipped: 0, Time elapsed: 0.001000 sec
     [echo] Ran org.apache.poi.ss.formula.ptg.TestReferencePtg
     [echo] Tests run: 4, Failures: 0, Aborted: 0, Skipped: 0, Time elapsed: 0.008000 sec
     [echo] Ran org.apache.poi.ss.formula.ptg.TestUnionPtg
     [echo] Tests run: 1, Failures: 0, Aborted: 0, Skipped: 0, Time elapsed: 0.001000 sec
     [echo] Ran org.apache.poi.ss.formula.udf.TestAggregatingUDFFinder
     [echo] Tests run: 2, Failures: 0, Aborted: 0, Skipped: 0, Time elapsed: 0.000000 sec
     [echo] Ran org.apache.poi.ss.formula.udf.TestDefaultUDFFinder
     [echo] Tests run: 1, Failures: 0, Aborted: 0, Skipped: 0, Time elapsed: 0.000000 sec
     [echo] Ran org.apache.poi.ss.usermodel.TestDataFormatter
     [echo] Tests run: 37, Failures: 0, Aborted: 0, Skipped: 1, Time elapsed: 0.346000 sec
     [echo] Ran org.apache.poi.ss.usermodel.TestDateUtil
     [echo] Tests run: 26, Failures: 0, Aborted: 0, Skipped: 0, Time elapsed: 0.018000 sec
     [echo] Ran org.apache.poi.ss.usermodel.TestExcelStyleDateFormatter
     [echo] Tests run: 4, Failures: 0, Aborted: 0, Skipped: 0, Time elapsed: 0.015000 sec
     [echo] Ran org.apache.poi.ss.usermodel.TestFractionFormat
     [echo] Tests run: 5, Failures: 0, Aborted: 0, Skipped: 1, Time elapsed: 0.187000 sec
     [echo] Ran org.apache.poi.ss.usermodel.TestHSSFBorderStyle
     [echo] Tests run: 1, Failures: 0, Aborted: 0, Skipped: 0, Time elapsed: 0.001000 sec
     [echo] Ran org.apache.poi.ss.usermodel.TestIndexedColors
     [echo] Tests run: 3, Failures: 0, Aborted: 0, Skipped: 0, Time elapsed: 0.001000 sec
     [echo] Ran org.apache.poi.ss.util.TestAreaReference
     [echo] Tests run: 3, Failures: 0, Aborted: 0, Skipped: 0, Time elapsed: 0.001000 sec
     [echo] Ran org.apache.poi.ss.util.TestCellAddress
     [echo] Tests run: 6, Failures: 0, Aborted: 0, Skipped: 0, Time elapsed: 0.001000 sec
     [echo] Ran org.apache.poi.ss.util.TestCellRangeAddress
     [echo] Tests run: 14, Failures: 0, Aborted: 0, Skipped: 0, Time elapsed: 0.005000 sec
     [echo] Ran org.apache.poi.ss.util.TestCellRangeUtil
     [echo] Tests run: 1, Failures: 0, Aborted: 0, Skipped: 0, Time elapsed: 0.001000 sec
     [echo] Ran org.apache.poi.ss.util.TestCellReference
     [echo] Tests run: 27, Failures: 0, Aborted: 0, Skipped: 0, Time elapsed: 0.344000 sec
     [echo] Ran org.apache.poi.ss.util.TestDateFormatConverter
     [echo] Tests run: 4, Failures: 0, Aborted: 0, Skipped: 0, Time elapsed: 1.306000 sec
     [echo] Ran org.apache.poi.ss.util.TestDateParser
     [echo] Tests run: 5, Failures: 0, Aborted: 0, Skipped: 0, Time elapsed: 0.005000 sec
     [echo] Ran org.apache.poi.ss.util.TestExpandedDouble
     [echo] Tests run: 3, Failures: 0, Aborted: 0, Skipped: 0, Time elapsed: 0.001000 sec
     [echo] Ran org.apache.poi.ss.util.TestHSSFCellUtil
     [echo] Tests run: 14, Failures: 0, Aborted: 0, Skipped: 0, Time elapsed: 0.014000 sec
     [echo] Ran org.apache.poi.ss.util.TestNumberComparer
     [echo] Tests run: 4, Failures: 0, Aborted: 0, Skipped: 0, Time elapsed: 0.032000 sec
     [echo] Ran org.apache.poi.ss.util.TestNumberToTextConverter
     [echo] Tests run: 2, Failures: 0, Aborted: 0, Skipped: 0, Time elapsed: 0.008000 sec
     [echo] Ran org.apache.poi.ss.util.TestPropertyTemplate
     [echo] Tests run: 8, Failures: 0, Aborted: 0, Skipped: 0, Time elapsed: 0.021000 sec
     [echo] Ran org.apache.poi.ss.util.TestRegionUtil
     [echo] Tests run: 10, Failures: 0, Aborted: 0, Skipped: 0, Time elapsed: 0.015000 sec
     [echo] Ran org.apache.poi.ss.util.TestSheetBuilder
     [echo] Tests run: 3, Failures: 0, Aborted: 0, Skipped: 0, Time elapsed: 0.002000 sec
     [echo] Ran org.apache.poi.ss.util.TestSheetUtil
     [echo] Tests run: 7, Failures: 0, Aborted: 0, Skipped: 0, Time elapsed: 0.003000 sec
     [echo] Ran org.apache.poi.ss.util.TestWorkbookUtil
     [echo] Tests run: 1, Failures: 0, Aborted: 0, Skipped: 0, Time elapsed: 0.000000 sec
     [echo] Ran org.apache.poi.ss.util.cellwalk.TestCellWalk
     [echo] Tests run: 1, Failures: 0, Aborted: 0, Skipped: 0, Time elapsed: 0.003000 sec
     [echo] Ran org.apache.poi.util.TestArrayUtil
     [echo] Tests run: 1, Failures: 0, Aborted: 0, Skipped: 0, Time elapsed: 0.002000 sec
     [echo] Ran org.apache.poi.util.TestBitField
     [echo] Tests run: 16, Failures: 0, Aborted: 0, Skipped: 0, Time elapsed: 0.003000 sec
     [echo] Ran org.apache.poi.util.TestByteField
     [echo] Tests run: 5, Failures: 0, Aborted: 0, Skipped: 0, Time elapsed: 0.001000 sec
     [echo] Ran org.apache.poi.util.TestHexDump
     [echo] Tests run: 6, Failures: 0, Aborted: 0, Skipped: 0, Time elapsed: 0.007000 sec
     [echo] Ran org.apache.poi.util.TestIOUtils
     [echo] Tests run: 36, Failures: 0, Aborted: 0, Skipped: 0, Time elapsed: 0.057000 sec
     [echo] Ran org.apache.poi.util.TestIntList
     [echo] Tests run: 19, Failures: 0, Aborted: 0, Skipped: 0, Time elapsed: 0.043000 sec
     [echo] Ran org.apache.poi.util.TestIntegerField
     [echo] Tests run: 5, Failures: 0, Aborted: 0, Skipped: 0, Time elapsed: 0.003000 sec
     [echo] Ran org.apache.poi.util.TestLittleEndian
     [echo] Tests run: 15, Failures: 0, Aborted: 0, Skipped: 0, Time elapsed: 0.003000 sec
     [echo] Ran org.apache.poi.util.TestLittleEndianStreams
     [echo] Tests run: 5, Failures: 0, Aborted: 0, Skipped: 0, Time elapsed: 0.002000 sec
     [echo] Ran org.apache.poi.util.TestLocaleUtil
     [echo] Tests run: 3, Failures: 0, Aborted: 0, Skipped: 0, Time elapsed: 0.001000 sec
     [echo] Ran org.apache.poi.util.TestLongField
     [echo] Tests run: 5, Failures: 0, Aborted: 0, Skipped: 0, Time elapsed: 0.001000 sec
     [echo] Ran org.apache.poi.util.TestPOILogFactory
     [echo] Tests run: 1, Failures: 0, Aborted: 0, Skipped: 0, Time elapsed: 0.000000 sec
     [echo] Ran org.apache.poi.util.TestPOILogger
     [echo] Tests run: 1, Failures: 0, Aborted: 0, Skipped: 0, Time elapsed: 0.000000 sec
     [echo] Ran org.apache.poi.util.TestRLEDecompressingInputStream
     [echo] Tests run: 4, Failures: 0, Aborted: 0, Skipped: 0, Time elapsed: 0.001000 sec
     [echo] Ran org.apache.poi.util.TestShortField
     [echo] Tests run: 5, Failures: 0, Aborted: 0, Skipped: 0, Time elapsed: 0.002000 sec
     [echo] Ran org.apache.poi.util.TestStringCodepointsIterable
     [echo] Tests run: 1, Failures: 0, Aborted: 0, Skipped: 0, Time elapsed: 0.001000 sec
     [echo] Ran org.apache.poi.util.TestStringUtil
     [echo] Tests run: 7, Failures: 0, Aborted: 0, Skipped: 0, Time elapsed: 0.002000 sec
     [echo] Ran org.apache.poi.util.TestTempFile
     [echo] Tests run: 4, Failures: 0, Aborted: 0, Skipped: 0, Time elapsed: 0.005000 sec
     [echo] Ran org.apache.poi.util.TestXMLHelper
     [echo] Tests run: 8, Failures: 0, Aborted: 0, Skipped: 0, Time elapsed: 0.247000 sec

-test-excelant-write-testfile:

test:

compile-integration:
    [javac] Compiling 25 source files to <https://ci-builds.apache.org/job/POI/job/POI-DSL-Windows-1.8/ws/build\integration-test-classes>
    [javac] Support for javac --release has been added in Java9 ignoring it
    [javac] Note: <https://ci-builds.apache.org/job/POI/job/POI-DSL-Windows-1.8/ws/src\integrationtest\org\apache\poi\stress\TestAllFiles.java> uses unchecked or unsafe operations.
    [javac] Note: Recompile with -Xlint:unchecked for details.
    [mkdir] Created dir: <https://ci-builds.apache.org/job/POI/job/POI-DSL-Windows-1.8/ws/build\integration-test-classes\META-INF\versions\9>
      [jar] Building jar: <https://ci-builds.apache.org/job/POI/job/POI-DSL-Windows-1.8/ws/build\dist\maven\poi-integration\poi-integration-5.0.1.jar>

-test-integration-check:

test-integration:

BUILD FAILED
<https://ci-builds.apache.org/job/POI/job/POI-DSL-Windows-1.8/ws/build.xml>:1709: The following error occurred while executing this line:
<https://ci-builds.apache.org/job/POI/job/POI-DSL-Windows-1.8/ws/build.xml>:1256: Some test(s) have failure(s)

Total time: 22 minutes 2 seconds
Build step 'Invoke Ant' marked build as failure
[SpotBugs] Skipping execution of recorder since overall result is 'FAILURE'
Archiving artifacts
[Fast Archiver] Compressed 10.02 MB of artifacts by 30.3% relative to #104
Skipping publisher since build result is FAILURE
Recording test results

---------------------------------------------------------------------
To unsubscribe, e-mail: [hidden email]
For additional commands, e-mail: [hidden email]

Reply | Threaded
Open this post in threaded view
|

Build failed in Jenkins: POI » POI-DSL-Windows-1.8 #106

Apache Jenkins Server
See <https://ci-builds.apache.org/job/POI/job/POI-DSL-Windows-1.8/106/display/redirect?page=changes>

Changes:

[Andreas Beeker] integration tests: Fix JDK version handling

[Andreas Beeker] integration tests: NullPointerExceptions contain now a description in Java 16+


------------------------------------------
[...truncated 288.94 KB...]
     [echo] Tests run: 11, Failures: 0, Aborted: 0, Skipped: 0, Time elapsed: 0.008000 sec
     [echo] Ran org.apache.poi.ss.formula.functions.TestIntercept
     [echo] Tests run: 4, Failures: 0, Aborted: 0, Skipped: 0, Time elapsed: 0.003000 sec
     [echo] Ran org.apache.poi.ss.formula.functions.TestIrr
     [echo] Tests run: 3, Failures: 0, Aborted: 0, Skipped: 0, Time elapsed: 0.004000 sec
     [echo] Ran org.apache.poi.ss.formula.functions.TestIsBlank
     [echo] Tests run: 1, Failures: 0, Aborted: 0, Skipped: 0, Time elapsed: 0.001000 sec
     [echo] Ran org.apache.poi.ss.formula.functions.TestLeftRight
     [echo] Tests run: 2, Failures: 0, Aborted: 0, Skipped: 0, Time elapsed: 0.000000 sec
     [echo] Ran org.apache.poi.ss.formula.functions.TestLen
     [echo] Tests run: 3, Failures: 0, Aborted: 0, Skipped: 0, Time elapsed: 0.000000 sec
     [echo] Ran org.apache.poi.ss.formula.functions.TestLogicalFunction
     [echo] Tests run: 2, Failures: 0, Aborted: 0, Skipped: 0, Time elapsed: 0.001000 sec
     [echo] Ran org.apache.poi.ss.formula.functions.TestLogicalFunctionsFromSpreadsheet
     [echo] Tests run: 15, Failures: 0, Aborted: 0, Skipped: 0, Time elapsed: 0.009000 sec
     [echo] Ran org.apache.poi.ss.formula.functions.TestLookupFunctionsFromSpreadsheet
     [echo] Tests run: 205, Failures: 0, Aborted: 0, Skipped: 0, Time elapsed: 0.168000 sec
     [echo] Ran org.apache.poi.ss.formula.functions.TestMatch
     [echo] Tests run: 9, Failures: 0, Aborted: 0, Skipped: 0, Time elapsed: 0.004000 sec
     [echo] Ran org.apache.poi.ss.formula.functions.TestMatchFunctionsFromSpreadsheet
     [echo] Tests run: 14, Failures: 0, Aborted: 0, Skipped: 0, Time elapsed: 0.008000 sec
     [echo] Ran org.apache.poi.ss.formula.functions.TestMathX
     [echo] Tests run: 23, Failures: 0, Aborted: 0, Skipped: 0, Time elapsed: 0.005000 sec
     [echo] Ran org.apache.poi.ss.formula.functions.TestMid
     [echo] Tests run: 4, Failures: 0, Aborted: 0, Skipped: 0, Time elapsed: 0.002000 sec
     [echo] Ran org.apache.poi.ss.formula.functions.TestMirr
     [echo] Tests run: 4, Failures: 0, Aborted: 0, Skipped: 0, Time elapsed: 0.004000 sec
     [echo] Ran org.apache.poi.ss.formula.functions.TestMultiOperandNumericFunction
     [echo] Tests run: 3, Failures: 0, Aborted: 0, Skipped: 0, Time elapsed: 0.001000 sec
     [echo] Ran org.apache.poi.ss.formula.functions.TestNper
     [echo] Tests run: 2, Failures: 0, Aborted: 0, Skipped: 0, Time elapsed: 0.001000 sec
     [echo] Ran org.apache.poi.ss.formula.functions.TestNpv
     [echo] Tests run: 2, Failures: 0, Aborted: 0, Skipped: 0, Time elapsed: 0.002000 sec
     [echo] Ran org.apache.poi.ss.formula.functions.TestOct2Dec
     [echo] Tests run: 2, Failures: 0, Aborted: 0, Skipped: 0, Time elapsed: 0.000000 sec
     [echo] Ran org.apache.poi.ss.formula.functions.TestOffset
     [echo] Tests run: 21, Failures: 0, Aborted: 0, Skipped: 0, Time elapsed: 0.007000 sec
     [echo] Ran org.apache.poi.ss.formula.functions.TestPPMT
     [echo] Tests run: 1, Failures: 0, Aborted: 0, Skipped: 0, Time elapsed: 0.001000 sec
     [echo] Ran org.apache.poi.ss.formula.functions.TestPmt
     [echo] Tests run: 2, Failures: 0, Aborted: 0, Skipped: 0, Time elapsed: 0.000000 sec
     [echo] Ran org.apache.poi.ss.formula.functions.TestPoisson
     [echo] Tests run: 6, Failures: 0, Aborted: 0, Skipped: 0, Time elapsed: 0.001000 sec
     [echo] Ran org.apache.poi.ss.formula.functions.TestProduct
     [echo] Tests run: 4, Failures: 0, Aborted: 0, Skipped: 0, Time elapsed: 0.001000 sec
     [echo] Ran org.apache.poi.ss.formula.functions.TestQuotient
     [echo] Tests run: 2, Failures: 0, Aborted: 0, Skipped: 0, Time elapsed: 0.001000 sec
     [echo] Ran org.apache.poi.ss.formula.functions.TestQuotientFunctionsFromSpreadsheet
     [echo] Tests run: 8, Failures: 0, Aborted: 0, Skipped: 0, Time elapsed: 0.006000 sec
     [echo] Ran org.apache.poi.ss.formula.functions.TestRank
     [echo] Tests run: 1, Failures: 0, Aborted: 0, Skipped: 0, Time elapsed: 0.002000 sec
     [echo] Ran org.apache.poi.ss.formula.functions.TestRelationalOperations
     [echo] Tests run: 5, Failures: 0, Aborted: 0, Skipped: 0, Time elapsed: 0.001000 sec
     [echo] Ran org.apache.poi.ss.formula.functions.TestReptFunctionsFromSpreadsheet
     [echo] Tests run: 5, Failures: 0, Aborted: 0, Skipped: 0, Time elapsed: 0.006000 sec
     [echo] Ran org.apache.poi.ss.formula.functions.TestRomanFunctionsFromSpreadsheet
     [echo] Tests run: 35, Failures: 0, Aborted: 0, Skipped: 0, Time elapsed: 0.018000 sec
     [echo] Ran org.apache.poi.ss.formula.functions.TestRoundFuncs
     [echo] Tests run: 5, Failures: 0, Aborted: 0, Skipped: 1, Time elapsed: 0.002000 sec
     [echo] Ran org.apache.poi.ss.formula.functions.TestRowCol
     [echo] Tests run: 4, Failures: 0, Aborted: 0, Skipped: 0, Time elapsed: 0.002000 sec
     [echo] Ran org.apache.poi.ss.formula.functions.TestSlope
     [echo] Tests run: 3, Failures: 0, Aborted: 0, Skipped: 0, Time elapsed: 0.001000 sec
     [echo] Ran org.apache.poi.ss.formula.functions.TestStatsLib
     [echo] Tests run: 8, Failures: 0, Aborted: 0, Skipped: 0, Time elapsed: 0.002000 sec
     [echo] Ran org.apache.poi.ss.formula.functions.TestSubstitute
     [echo] Tests run: 5, Failures: 0, Aborted: 0, Skipped: 0, Time elapsed: 0.001000 sec
     [echo] Ran org.apache.poi.ss.formula.functions.TestSubtotal
     [echo] Tests run: 11, Failures: 0, Aborted: 0, Skipped: 0, Time elapsed: 0.008000 sec
     [echo] Ran org.apache.poi.ss.formula.functions.TestSumif
     [echo] Tests run: 3, Failures: 0, Aborted: 0, Skipped: 0, Time elapsed: 0.001000 sec
     [echo] Ran org.apache.poi.ss.formula.functions.TestSumifs
     [echo] Tests run: 7, Failures: 0, Aborted: 0, Skipped: 0, Time elapsed: 0.004000 sec
     [echo] Ran org.apache.poi.ss.formula.functions.TestSumproduct
     [echo] Tests run: 5, Failures: 0, Aborted: 0, Skipped: 0, Time elapsed: 0.002000 sec
     [echo] Ran org.apache.poi.ss.formula.functions.TestTFunc
     [echo] Tests run: 5, Failures: 0, Aborted: 0, Skipped: 0, Time elapsed: 0.001000 sec
     [echo] Ran org.apache.poi.ss.formula.functions.TestText
     [echo] Tests run: 4, Failures: 0, Aborted: 0, Skipped: 0, Time elapsed: 0.003000 sec
     [echo] Ran org.apache.poi.ss.formula.functions.TestTime
     [echo] Tests run: 2, Failures: 0, Aborted: 0, Skipped: 0, Time elapsed: 0.005000 sec
     [echo] Ran org.apache.poi.ss.formula.functions.TestTrendFunctionsFromSpreadsheet
     [echo] Tests run: 41, Failures: 0, Aborted: 0, Skipped: 0, Time elapsed: 0.082000 sec
     [echo] Ran org.apache.poi.ss.formula.functions.TestTrim
     [echo] Tests run: 3, Failures: 0, Aborted: 0, Skipped: 0, Time elapsed: 0.001000 sec
     [echo] Ran org.apache.poi.ss.formula.functions.TestTrunc
     [echo] Tests run: 7, Failures: 0, Aborted: 0, Skipped: 0, Time elapsed: 0.002000 sec
     [echo] Ran org.apache.poi.ss.formula.functions.TestTwoOperandNumericFunctionsFromSpreadsheet
     [echo] Tests run: 34, Failures: 0, Aborted: 0, Skipped: 0, Time elapsed: 0.027000 sec
     [echo] Ran org.apache.poi.ss.formula.functions.TestValue
     [echo] Tests run: 2, Failures: 0, Aborted: 0, Skipped: 0, Time elapsed: 0.001000 sec
     [echo] Ran org.apache.poi.ss.formula.functions.TestWeekNumFunctionsFromSpreadsheet
     [echo] Tests run: 7, Failures: 0, Aborted: 0, Skipped: 0, Time elapsed: 0.006000 sec
     [echo] Ran org.apache.poi.ss.formula.functions.TestWeekNumFunctionsFromSpreadsheet2013
     [echo] Tests run: 7, Failures: 0, Aborted: 0, Skipped: 0, Time elapsed: 0.006000 sec
     [echo] Ran org.apache.poi.ss.formula.functions.TestWeekdayFunc
     [echo] Tests run: 2, Failures: 0, Aborted: 0, Skipped: 0, Time elapsed: 0.002000 sec
     [echo] Ran org.apache.poi.ss.formula.functions.TestXYNumericFunction
     [echo] Tests run: 3, Failures: 0, Aborted: 0, Skipped: 0, Time elapsed: 0.001000 sec
     [echo] Ran org.apache.poi.ss.formula.ptg.TestAbstractFunctionPtg
     [echo] Tests run: 3, Failures: 0, Aborted: 0, Skipped: 0, Time elapsed: 0.002000 sec
     [echo] Ran org.apache.poi.ss.formula.ptg.TestArea3DPtg
     [echo] Tests run: 1, Failures: 0, Aborted: 0, Skipped: 0, Time elapsed: 0.001000 sec
     [echo] Ran org.apache.poi.ss.formula.ptg.TestAreaErrPtg
     [echo] Tests run: 1, Failures: 0, Aborted: 0, Skipped: 0, Time elapsed: 0.001000 sec
     [echo] Ran org.apache.poi.ss.formula.ptg.TestAreaPtg
     [echo] Tests run: 5, Failures: 0, Aborted: 0, Skipped: 0, Time elapsed: 0.002000 sec
     [echo] Ran org.apache.poi.ss.formula.ptg.TestArrayPtg
     [echo] Tests run: 5, Failures: 0, Aborted: 0, Skipped: 0, Time elapsed: 0.002000 sec
     [echo] Ran org.apache.poi.ss.formula.ptg.TestAttrPtg
     [echo] Tests run: 1, Failures: 0, Aborted: 0, Skipped: 0, Time elapsed: 0.001000 sec
     [echo] Ran org.apache.poi.ss.formula.ptg.TestErrPtg
     [echo] Tests run: 1, Failures: 0, Aborted: 0, Skipped: 0, Time elapsed: 0.001000 sec
     [echo] Ran org.apache.poi.ss.formula.ptg.TestExternalFunctionFormulas
     [echo] Tests run: 3, Failures: 0, Aborted: 0, Skipped: 0, Time elapsed: 0.003000 sec
     [echo] Ran org.apache.poi.ss.formula.ptg.TestExternalNameReference
     [echo] Tests run: 3, Failures: 0, Aborted: 0, Skipped: 0, Time elapsed: 0.004000 sec
     [echo] Ran org.apache.poi.ss.formula.ptg.TestFuncPtg
     [echo] Tests run: 2, Failures: 0, Aborted: 0, Skipped: 0, Time elapsed: 0.000000 sec
     [echo] Ran org.apache.poi.ss.formula.ptg.TestFuncVarPtg
     [echo] Tests run: 1, Failures: 0, Aborted: 0, Skipped: 0, Time elapsed: 0.000000 sec
     [echo] Ran org.apache.poi.ss.formula.ptg.TestIntersectionPtg
     [echo] Tests run: 1, Failures: 0, Aborted: 0, Skipped: 0, Time elapsed: 0.001000 sec
     [echo] Ran org.apache.poi.ss.formula.ptg.TestPercentPtg
     [echo] Tests run: 1, Failures: 0, Aborted: 0, Skipped: 0, Time elapsed: 0.001000 sec
     [echo] Ran org.apache.poi.ss.formula.ptg.TestRangePtg
     [echo] Tests run: 1, Failures: 0, Aborted: 0, Skipped: 0, Time elapsed: 0.001000 sec
     [echo] Ran org.apache.poi.ss.formula.ptg.TestRef3DPtg
     [echo] Tests run: 1, Failures: 0, Aborted: 0, Skipped: 0, Time elapsed: 0.000000 sec
     [echo] Ran org.apache.poi.ss.formula.ptg.TestReferencePtg
     [echo] Tests run: 4, Failures: 0, Aborted: 0, Skipped: 0, Time elapsed: 0.010000 sec
     [echo] Ran org.apache.poi.ss.formula.ptg.TestUnionPtg
     [echo] Tests run: 1, Failures: 0, Aborted: 0, Skipped: 0, Time elapsed: 0.001000 sec
     [echo] Ran org.apache.poi.ss.formula.udf.TestAggregatingUDFFinder
     [echo] Tests run: 2, Failures: 0, Aborted: 0, Skipped: 0, Time elapsed: 0.001000 sec
     [echo] Ran org.apache.poi.ss.formula.udf.TestDefaultUDFFinder
     [echo] Tests run: 1, Failures: 0, Aborted: 0, Skipped: 0, Time elapsed: 0.000000 sec
     [echo] Ran org.apache.poi.ss.usermodel.TestDataFormatter
     [echo] Tests run: 37, Failures: 0, Aborted: 0, Skipped: 1, Time elapsed: 0.333000 sec
     [echo] Ran org.apache.poi.ss.usermodel.TestDateUtil
     [echo] Tests run: 26, Failures: 0, Aborted: 0, Skipped: 0, Time elapsed: 0.014000 sec
     [echo] Ran org.apache.poi.ss.usermodel.TestExcelStyleDateFormatter
     [echo] Tests run: 4, Failures: 0, Aborted: 0, Skipped: 0, Time elapsed: 0.028000 sec
     [echo] Ran org.apache.poi.ss.usermodel.TestFractionFormat
     [echo] Tests run: 5, Failures: 0, Aborted: 0, Skipped: 1, Time elapsed: 0.307000 sec
     [echo] Ran org.apache.poi.ss.usermodel.TestHSSFBorderStyle
     [echo] Tests run: 1, Failures: 0, Aborted: 0, Skipped: 0, Time elapsed: 0.001000 sec
     [echo] Ran org.apache.poi.ss.usermodel.TestIndexedColors
     [echo] Tests run: 3, Failures: 0, Aborted: 0, Skipped: 0, Time elapsed: 0.001000 sec
     [echo] Ran org.apache.poi.ss.util.TestAreaReference
     [echo] Tests run: 3, Failures: 0, Aborted: 0, Skipped: 0, Time elapsed: 0.001000 sec
     [echo] Ran org.apache.poi.ss.util.TestCellAddress
     [echo] Tests run: 6, Failures: 0, Aborted: 0, Skipped: 0, Time elapsed: 0.001000 sec
     [echo] Ran org.apache.poi.ss.util.TestCellRangeAddress
     [echo] Tests run: 14, Failures: 0, Aborted: 0, Skipped: 0, Time elapsed: 0.006000 sec
     [echo] Ran org.apache.poi.ss.util.TestCellRangeUtil
     [echo] Tests run: 1, Failures: 0, Aborted: 0, Skipped: 0, Time elapsed: 0.001000 sec
     [echo] Ran org.apache.poi.ss.util.TestCellReference
     [echo] Tests run: 27, Failures: 0, Aborted: 0, Skipped: 0, Time elapsed: 0.345000 sec
     [echo] Ran org.apache.poi.ss.util.TestDateFormatConverter
     [echo] Tests run: 4, Failures: 0, Aborted: 0, Skipped: 0, Time elapsed: 1.440000 sec
     [echo] Ran org.apache.poi.ss.util.TestDateParser
     [echo] Tests run: 5, Failures: 0, Aborted: 0, Skipped: 0, Time elapsed: 0.005000 sec
     [echo] Ran org.apache.poi.ss.util.TestExpandedDouble
     [echo] Tests run: 3, Failures: 0, Aborted: 0, Skipped: 0, Time elapsed: 0.001000 sec
     [echo] Ran org.apache.poi.ss.util.TestHSSFCellUtil
     [echo] Tests run: 14, Failures: 0, Aborted: 0, Skipped: 0, Time elapsed: 0.015000 sec
     [echo] Ran org.apache.poi.ss.util.TestNumberComparer
     [echo] Tests run: 4, Failures: 0, Aborted: 0, Skipped: 0, Time elapsed: 0.052000 sec
     [echo] Ran org.apache.poi.ss.util.TestNumberToTextConverter
     [echo] Tests run: 2, Failures: 0, Aborted: 0, Skipped: 0, Time elapsed: 0.009000 sec
     [echo] Ran org.apache.poi.ss.util.TestPropertyTemplate
     [echo] Tests run: 8, Failures: 0, Aborted: 0, Skipped: 0, Time elapsed: 0.022000 sec
     [echo] Ran org.apache.poi.ss.util.TestRegionUtil
     [echo] Tests run: 10, Failures: 0, Aborted: 0, Skipped: 0, Time elapsed: 0.012000 sec
     [echo] Ran org.apache.poi.ss.util.TestSheetBuilder
     [echo] Tests run: 3, Failures: 0, Aborted: 0, Skipped: 0, Time elapsed: 0.002000 sec
     [echo] Ran org.apache.poi.ss.util.TestSheetUtil
     [echo] Tests run: 7, Failures: 0, Aborted: 0, Skipped: 0, Time elapsed: 0.003000 sec
     [echo] Ran org.apache.poi.ss.util.TestWorkbookUtil
     [echo] Tests run: 1, Failures: 0, Aborted: 0, Skipped: 0, Time elapsed: 0.000000 sec
     [echo] Ran org.apache.poi.ss.util.cellwalk.TestCellWalk
     [echo] Tests run: 1, Failures: 0, Aborted: 0, Skipped: 0, Time elapsed: 0.003000 sec
     [echo] Ran org.apache.poi.util.TestArrayUtil
     [echo] Tests run: 1, Failures: 0, Aborted: 0, Skipped: 0, Time elapsed: 0.001000 sec
     [echo] Ran org.apache.poi.util.TestBitField
     [echo] Tests run: 16, Failures: 0, Aborted: 0, Skipped: 0, Time elapsed: 0.002000 sec
     [echo] Ran org.apache.poi.util.TestByteField
     [echo] Tests run: 5, Failures: 0, Aborted: 0, Skipped: 0, Time elapsed: 0.000000 sec
     [echo] Ran org.apache.poi.util.TestHexDump
     [echo] Tests run: 6, Failures: 0, Aborted: 0, Skipped: 0, Time elapsed: 0.012000 sec
     [echo] Ran org.apache.poi.util.TestIOUtils
     [echo] Tests run: 36, Failures: 0, Aborted: 0, Skipped: 0, Time elapsed: 0.073000 sec
     [echo] Ran org.apache.poi.util.TestIntList
     [echo] Tests run: 19, Failures: 0, Aborted: 0, Skipped: 0, Time elapsed: 0.040000 sec
     [echo] Ran org.apache.poi.util.TestIntegerField
     [echo] Tests run: 5, Failures: 0, Aborted: 0, Skipped: 0, Time elapsed: 0.003000 sec
     [echo] Ran org.apache.poi.util.TestLittleEndian
     [echo] Tests run: 15, Failures: 0, Aborted: 0, Skipped: 0, Time elapsed: 0.004000 sec
     [echo] Ran org.apache.poi.util.TestLittleEndianStreams
     [echo] Tests run: 5, Failures: 0, Aborted: 0, Skipped: 0, Time elapsed: 0.003000 sec
     [echo] Ran org.apache.poi.util.TestLocaleUtil
     [echo] Tests run: 3, Failures: 0, Aborted: 0, Skipped: 0, Time elapsed: 0.001000 sec
     [echo] Ran org.apache.poi.util.TestLongField
     [echo] Tests run: 5, Failures: 0, Aborted: 0, Skipped: 0, Time elapsed: 0.003000 sec
     [echo] Ran org.apache.poi.util.TestPOILogFactory
     [echo] Tests run: 1, Failures: 0, Aborted: 0, Skipped: 0, Time elapsed: 0.001000 sec
     [echo] Ran org.apache.poi.util.TestPOILogger
     [echo] Tests run: 1, Failures: 0, Aborted: 0, Skipped: 0, Time elapsed: 0.001000 sec
     [echo] Ran org.apache.poi.util.TestRLEDecompressingInputStream
     [echo] Tests run: 4, Failures: 0, Aborted: 0, Skipped: 0, Time elapsed: 0.001000 sec
     [echo] Ran org.apache.poi.util.TestShortField
     [echo] Tests run: 5, Failures: 0, Aborted: 0, Skipped: 0, Time elapsed: 0.003000 sec
     [echo] Ran org.apache.poi.util.TestStringCodepointsIterable
     [echo] Tests run: 1, Failures: 0, Aborted: 0, Skipped: 0, Time elapsed: 0.001000 sec
     [echo] Ran org.apache.poi.util.TestStringUtil
     [echo] Tests run: 7, Failures: 0, Aborted: 0, Skipped: 0, Time elapsed: 0.002000 sec
     [echo] Ran org.apache.poi.util.TestTempFile
     [echo] Tests run: 4, Failures: 0, Aborted: 0, Skipped: 0, Time elapsed: 0.012000 sec
     [echo] Ran org.apache.poi.util.TestXMLHelper
     [echo] Tests run: 8, Failures: 0, Aborted: 0, Skipped: 0, Time elapsed: 0.327000 sec

-test-excelant-write-testfile:

test:

compile-integration:
    [javac] Compiling 25 source files to <https://ci-builds.apache.org/job/POI/job/POI-DSL-Windows-1.8/ws/build\integration-test-classes>
    [javac] Support for javac --release has been added in Java9 ignoring it
    [javac] Note: <https://ci-builds.apache.org/job/POI/job/POI-DSL-Windows-1.8/ws/src\integrationtest\org\apache\poi\stress\TestAllFiles.java> uses unchecked or unsafe operations.
    [javac] Note: Recompile with -Xlint:unchecked for details.
    [mkdir] Created dir: <https://ci-builds.apache.org/job/POI/job/POI-DSL-Windows-1.8/ws/build\integration-test-classes\META-INF\versions\9>
      [jar] Building jar: <https://ci-builds.apache.org/job/POI/job/POI-DSL-Windows-1.8/ws/build\dist\maven\poi-integration\poi-integration-5.0.1.jar>

-test-integration-check:

test-integration:

BUILD FAILED
<https://ci-builds.apache.org/job/POI/job/POI-DSL-Windows-1.8/ws/build.xml>:1709: The following error occurred while executing this line:
<https://ci-builds.apache.org/job/POI/job/POI-DSL-Windows-1.8/ws/build.xml>:1256: Some test(s) have failure(s)

Total time: 29 minutes 35 seconds
Build step 'Invoke Ant' marked build as failure
[SpotBugs] Skipping execution of recorder since overall result is 'FAILURE'
Archiving artifacts
[Fast Archiver] Compressed 9.50 MB of artifacts by 31.9% relative to #104
Skipping publisher since build result is FAILURE
Recording test results

---------------------------------------------------------------------
To unsubscribe, e-mail: [hidden email]
For additional commands, e-mail: [hidden email]

Reply | Threaded
Open this post in threaded view
|

Build failed in Jenkins: POI » POI-DSL-Windows-1.8 #107

Apache Jenkins Server
See <https://ci-builds.apache.org/job/POI/job/POI-DSL-Windows-1.8/107/display/redirect?page=changes>

Changes:

[Andreas Beeker] Remove superfluous test

[Andreas Beeker] Sonar fixes
add asserts to tests

[Andreas Beeker] integration tests: Fix handling of NullPointerExceptions for Java 16+ (again ...)
Refactor TestAllFiles to provide an API for mass testing


------------------------------------------
[...truncated 318.54 KB...]
     [echo] Tests run: 98, Failures: 0, Aborted: 0, Skipped: 0, Time elapsed: 0.043000 sec
     [echo] Ran org.apache.poi.ss.formula.functions.TestIndirect
     [echo] Tests run: 3, Failures: 0, Aborted: 0, Skipped: 0, Time elapsed: 0.004000 sec
     [echo] Ran org.apache.poi.ss.formula.functions.TestIndirectFunctionFromSpreadsheet
     [echo] Tests run: 11, Failures: 0, Aborted: 0, Skipped: 0, Time elapsed: 0.006000 sec
     [echo] Ran org.apache.poi.ss.formula.functions.TestIntercept
     [echo] Tests run: 4, Failures: 0, Aborted: 0, Skipped: 0, Time elapsed: 0.002000 sec
     [echo] Ran org.apache.poi.ss.formula.functions.TestIrr
     [echo] Tests run: 3, Failures: 0, Aborted: 0, Skipped: 0, Time elapsed: 0.002000 sec
     [echo] Ran org.apache.poi.ss.formula.functions.TestIsBlank
     [echo] Tests run: 1, Failures: 0, Aborted: 0, Skipped: 0, Time elapsed: 0.001000 sec
     [echo] Ran org.apache.poi.ss.formula.functions.TestLeftRight
     [echo] Tests run: 2, Failures: 0, Aborted: 0, Skipped: 0, Time elapsed: 0.001000 sec
     [echo] Ran org.apache.poi.ss.formula.functions.TestLen
     [echo] Tests run: 3, Failures: 0, Aborted: 0, Skipped: 0, Time elapsed: 0.000000 sec
     [echo] Ran org.apache.poi.ss.formula.functions.TestLogicalFunction
     [echo] Tests run: 2, Failures: 0, Aborted: 0, Skipped: 0, Time elapsed: 0.001000 sec
     [echo] Ran org.apache.poi.ss.formula.functions.TestLogicalFunctionsFromSpreadsheet
     [echo] Tests run: 15, Failures: 0, Aborted: 0, Skipped: 0, Time elapsed: 0.005000 sec
     [echo] Ran org.apache.poi.ss.formula.functions.TestLookupFunctionsFromSpreadsheet
     [echo] Tests run: 205, Failures: 0, Aborted: 0, Skipped: 0, Time elapsed: 0.090000 sec
     [echo] Ran org.apache.poi.ss.formula.functions.TestMatch
     [echo] Tests run: 9, Failures: 0, Aborted: 0, Skipped: 0, Time elapsed: 0.005000 sec
     [echo] Ran org.apache.poi.ss.formula.functions.TestMatchFunctionsFromSpreadsheet
     [echo] Tests run: 14, Failures: 0, Aborted: 0, Skipped: 0, Time elapsed: 0.007000 sec
     [echo] Ran org.apache.poi.ss.formula.functions.TestMathX
     [echo] Tests run: 23, Failures: 0, Aborted: 0, Skipped: 0, Time elapsed: 0.007000 sec
     [echo] Ran org.apache.poi.ss.formula.functions.TestMid
     [echo] Tests run: 4, Failures: 0, Aborted: 0, Skipped: 0, Time elapsed: 0.002000 sec
     [echo] Ran org.apache.poi.ss.formula.functions.TestMirr
     [echo] Tests run: 4, Failures: 0, Aborted: 0, Skipped: 0, Time elapsed: 0.004000 sec
     [echo] Ran org.apache.poi.ss.formula.functions.TestMultiOperandNumericFunction
     [echo] Tests run: 3, Failures: 0, Aborted: 0, Skipped: 0, Time elapsed: 0.001000 sec
     [echo] Ran org.apache.poi.ss.formula.functions.TestNper
     [echo] Tests run: 2, Failures: 0, Aborted: 0, Skipped: 0, Time elapsed: 0.001000 sec
     [echo] Ran org.apache.poi.ss.formula.functions.TestNpv
     [echo] Tests run: 2, Failures: 0, Aborted: 0, Skipped: 0, Time elapsed: 0.002000 sec
     [echo] Ran org.apache.poi.ss.formula.functions.TestOct2Dec
     [echo] Tests run: 2, Failures: 0, Aborted: 0, Skipped: 0, Time elapsed: 0.001000 sec
     [echo] Ran org.apache.poi.ss.formula.functions.TestOffset
     [echo] Tests run: 21, Failures: 0, Aborted: 0, Skipped: 0, Time elapsed: 0.009000 sec
     [echo] Ran org.apache.poi.ss.formula.functions.TestPPMT
     [echo] Tests run: 1, Failures: 0, Aborted: 0, Skipped: 0, Time elapsed: 0.001000 sec
     [echo] Ran org.apache.poi.ss.formula.functions.TestPmt
     [echo] Tests run: 2, Failures: 0, Aborted: 0, Skipped: 0, Time elapsed: 0.001000 sec
     [echo] Ran org.apache.poi.ss.formula.functions.TestPoisson
     [echo] Tests run: 6, Failures: 0, Aborted: 0, Skipped: 0, Time elapsed: 0.001000 sec
     [echo] Ran org.apache.poi.ss.formula.functions.TestProduct
     [echo] Tests run: 4, Failures: 0, Aborted: 0, Skipped: 0, Time elapsed: 0.001000 sec
     [echo] Ran org.apache.poi.ss.formula.functions.TestQuotient
     [echo] Tests run: 2, Failures: 0, Aborted: 0, Skipped: 0, Time elapsed: 0.001000 sec
     [echo] Ran org.apache.poi.ss.formula.functions.TestQuotientFunctionsFromSpreadsheet
     [echo] Tests run: 8, Failures: 0, Aborted: 0, Skipped: 0, Time elapsed: 0.004000 sec
     [echo] Ran org.apache.poi.ss.formula.functions.TestRank
     [echo] Tests run: 1, Failures: 0, Aborted: 0, Skipped: 0, Time elapsed: 0.002000 sec
     [echo] Ran org.apache.poi.ss.formula.functions.TestRelationalOperations
     [echo] Tests run: 5, Failures: 0, Aborted: 0, Skipped: 0, Time elapsed: 0.001000 sec
     [echo] Ran org.apache.poi.ss.formula.functions.TestReptFunctionsFromSpreadsheet
     [echo] Tests run: 5, Failures: 0, Aborted: 0, Skipped: 0, Time elapsed: 0.004000 sec
     [echo] Ran org.apache.poi.ss.formula.functions.TestRomanFunctionsFromSpreadsheet
     [echo] Tests run: 35, Failures: 0, Aborted: 0, Skipped: 0, Time elapsed: 0.011000 sec
     [echo] Ran org.apache.poi.ss.formula.functions.TestRoundFuncs
     [echo] Tests run: 5, Failures: 0, Aborted: 0, Skipped: 1, Time elapsed: 0.002000 sec
     [echo] Ran org.apache.poi.ss.formula.functions.TestRowCol
     [echo] Tests run: 4, Failures: 0, Aborted: 0, Skipped: 0, Time elapsed: 0.001000 sec
     [echo] Ran org.apache.poi.ss.formula.functions.TestSlope
     [echo] Tests run: 3, Failures: 0, Aborted: 0, Skipped: 0, Time elapsed: 0.001000 sec
     [echo] Ran org.apache.poi.ss.formula.functions.TestStatsLib
     [echo] Tests run: 8, Failures: 0, Aborted: 0, Skipped: 0, Time elapsed: 0.002000 sec
     [echo] Ran org.apache.poi.ss.formula.functions.TestSubstitute
     [echo] Tests run: 5, Failures: 0, Aborted: 0, Skipped: 0, Time elapsed: 0.001000 sec
     [echo] Ran org.apache.poi.ss.formula.functions.TestSubtotal
     [echo] Tests run: 11, Failures: 0, Aborted: 0, Skipped: 0, Time elapsed: 0.009000 sec
     [echo] Ran org.apache.poi.ss.formula.functions.TestSumif
     [echo] Tests run: 3, Failures: 0, Aborted: 0, Skipped: 0, Time elapsed: 0.002000 sec
     [echo] Ran org.apache.poi.ss.formula.functions.TestSumifs
     [echo] Tests run: 7, Failures: 0, Aborted: 0, Skipped: 0, Time elapsed: 0.004000 sec
     [echo] Ran org.apache.poi.ss.formula.functions.TestSumproduct
     [echo] Tests run: 5, Failures: 0, Aborted: 0, Skipped: 0, Time elapsed: 0.002000 sec
     [echo] Ran org.apache.poi.ss.formula.functions.TestTFunc
     [echo] Tests run: 5, Failures: 0, Aborted: 0, Skipped: 0, Time elapsed: 0.001000 sec
     [echo] Ran org.apache.poi.ss.formula.functions.TestText
     [echo] Tests run: 4, Failures: 0, Aborted: 0, Skipped: 0, Time elapsed: 0.004000 sec
     [echo] Ran org.apache.poi.ss.formula.functions.TestTime
     [echo] Tests run: 2, Failures: 0, Aborted: 0, Skipped: 0, Time elapsed: 0.005000 sec
     [echo] Ran org.apache.poi.ss.formula.functions.TestTrendFunctionsFromSpreadsheet
     [echo] Tests run: 41, Failures: 0, Aborted: 0, Skipped: 0, Time elapsed: 0.081000 sec
     [echo] Ran org.apache.poi.ss.formula.functions.TestTrim
     [echo] Tests run: 3, Failures: 0, Aborted: 0, Skipped: 0, Time elapsed: 0.001000 sec
     [echo] Ran org.apache.poi.ss.formula.functions.TestTrunc
     [echo] Tests run: 7, Failures: 0, Aborted: 0, Skipped: 0, Time elapsed: 0.001000 sec
     [echo] Ran org.apache.poi.ss.formula.functions.TestTwoOperandNumericFunctionsFromSpreadsheet
     [echo] Tests run: 34, Failures: 0, Aborted: 0, Skipped: 0, Time elapsed: 0.020000 sec
     [echo] Ran org.apache.poi.ss.formula.functions.TestValue
     [echo] Tests run: 2, Failures: 0, Aborted: 0, Skipped: 0, Time elapsed: 0.001000 sec
     [echo] Ran org.apache.poi.ss.formula.functions.TestWeekNumFunctionsFromSpreadsheet
     [echo] Tests run: 7, Failures: 0, Aborted: 0, Skipped: 0, Time elapsed: 0.009000 sec
     [echo] Ran org.apache.poi.ss.formula.functions.TestWeekNumFunctionsFromSpreadsheet2013
     [echo] Tests run: 7, Failures: 0, Aborted: 0, Skipped: 0, Time elapsed: 0.004000 sec
     [echo] Ran org.apache.poi.ss.formula.functions.TestWeekdayFunc
     [echo] Tests run: 2, Failures: 0, Aborted: 0, Skipped: 0, Time elapsed: 0.001000 sec
     [echo] Ran org.apache.poi.ss.formula.functions.TestXYNumericFunction
     [echo] Tests run: 3, Failures: 0, Aborted: 0, Skipped: 0, Time elapsed: 0.001000 sec
     [echo] Ran org.apache.poi.ss.formula.ptg.TestAbstractFunctionPtg
     [echo] Tests run: 3, Failures: 0, Aborted: 0, Skipped: 0, Time elapsed: 0.001000 sec
     [echo] Ran org.apache.poi.ss.formula.ptg.TestArea3DPtg
     [echo] Tests run: 1, Failures: 0, Aborted: 0, Skipped: 0, Time elapsed: 0.001000 sec
     [echo] Ran org.apache.poi.ss.formula.ptg.TestAreaErrPtg
     [echo] Tests run: 1, Failures: 0, Aborted: 0, Skipped: 0, Time elapsed: 0.001000 sec
     [echo] Ran org.apache.poi.ss.formula.ptg.TestAreaPtg
     [echo] Tests run: 5, Failures: 0, Aborted: 0, Skipped: 0, Time elapsed: 0.001000 sec
     [echo] Ran org.apache.poi.ss.formula.ptg.TestArrayPtg
     [echo] Tests run: 5, Failures: 0, Aborted: 0, Skipped: 0, Time elapsed: 0.002000 sec
     [echo] Ran org.apache.poi.ss.formula.ptg.TestAttrPtg
     [echo] Tests run: 1, Failures: 0, Aborted: 0, Skipped: 0, Time elapsed: 0.000000 sec
     [echo] Ran org.apache.poi.ss.formula.ptg.TestErrPtg
     [echo] Tests run: 1, Failures: 0, Aborted: 0, Skipped: 0, Time elapsed: 0.001000 sec
     [echo] Ran org.apache.poi.ss.formula.ptg.TestExternalFunctionFormulas
     [echo] Tests run: 3, Failures: 0, Aborted: 0, Skipped: 0, Time elapsed: 0.002000 sec
     [echo] Ran org.apache.poi.ss.formula.ptg.TestExternalNameReference
     [echo] Tests run: 3, Failures: 0, Aborted: 0, Skipped: 0, Time elapsed: 0.002000 sec
     [echo] Ran org.apache.poi.ss.formula.ptg.TestFuncPtg
     [echo] Tests run: 2, Failures: 0, Aborted: 0, Skipped: 0, Time elapsed: 0.000000 sec
     [echo] Ran org.apache.poi.ss.formula.ptg.TestFuncVarPtg
     [echo] Tests run: 1, Failures: 0, Aborted: 0, Skipped: 0, Time elapsed: 0.000000 sec
     [echo] Ran org.apache.poi.ss.formula.ptg.TestIntersectionPtg
     [echo] Tests run: 1, Failures: 0, Aborted: 0, Skipped: 0, Time elapsed: 0.001000 sec
     [echo] Ran org.apache.poi.ss.formula.ptg.TestPercentPtg
     [echo] Tests run: 1, Failures: 0, Aborted: 0, Skipped: 0, Time elapsed: 0.001000 sec
     [echo] Ran org.apache.poi.ss.formula.ptg.TestRangePtg
     [echo] Tests run: 1, Failures: 0, Aborted: 0, Skipped: 0, Time elapsed: 0.000000 sec
     [echo] Ran org.apache.poi.ss.formula.ptg.TestRef3DPtg
     [echo] Tests run: 1, Failures: 0, Aborted: 0, Skipped: 0, Time elapsed: 0.000000 sec
     [echo] Ran org.apache.poi.ss.formula.ptg.TestReferencePtg
     [echo] Tests run: 4, Failures: 0, Aborted: 0, Skipped: 0, Time elapsed: 0.006000 sec
     [echo] Ran org.apache.poi.ss.formula.ptg.TestUnionPtg
     [echo] Tests run: 1, Failures: 0, Aborted: 0, Skipped: 0, Time elapsed: 0.001000 sec
     [echo] Ran org.apache.poi.ss.formula.udf.TestAggregatingUDFFinder
     [echo] Tests run: 2, Failures: 0, Aborted: 0, Skipped: 0, Time elapsed: 0.001000 sec
     [echo] Ran org.apache.poi.ss.formula.udf.TestDefaultUDFFinder
     [echo] Tests run: 1, Failures: 0, Aborted: 0, Skipped: 0, Time elapsed: 0.000000 sec
     [echo] Ran org.apache.poi.ss.usermodel.TestDataFormatter
     [echo] Tests run: 37, Failures: 0, Aborted: 0, Skipped: 1, Time elapsed: 0.400000 sec
     [echo] Ran org.apache.poi.ss.usermodel.TestDateUtil
     [echo] Tests run: 26, Failures: 0, Aborted: 0, Skipped: 0, Time elapsed: 0.013000 sec
     [echo] Ran org.apache.poi.ss.usermodel.TestExcelStyleDateFormatter
     [echo] Tests run: 123, Failures: 0, Aborted: 0, Skipped: 0, Time elapsed: 0.062000 sec
     [echo] Ran org.apache.poi.ss.usermodel.TestFractionFormat
     [echo] Tests run: 5, Failures: 0, Aborted: 0, Skipped: 1, Time elapsed: 0.283000 sec
     [echo] Ran org.apache.poi.ss.usermodel.TestHSSFBorderStyle
     [echo] Tests run: 1, Failures: 0, Aborted: 0, Skipped: 0, Time elapsed: 0.002000 sec
     [echo] Ran org.apache.poi.ss.usermodel.TestIndexedColors
     [echo] Tests run: 3, Failures: 0, Aborted: 0, Skipped: 0, Time elapsed: 0.002000 sec
     [echo] Ran org.apache.poi.ss.util.TestAreaReference
     [echo] Tests run: 3, Failures: 0, Aborted: 0, Skipped: 0, Time elapsed: 0.001000 sec
     [echo] Ran org.apache.poi.ss.util.TestCellAddress
     [echo] Tests run: 6, Failures: 0, Aborted: 0, Skipped: 0, Time elapsed: 0.002000 sec
     [echo] Ran org.apache.poi.ss.util.TestCellRangeAddress
     [echo] Tests run: 14, Failures: 0, Aborted: 0, Skipped: 0, Time elapsed: 0.005000 sec
     [echo] Ran org.apache.poi.ss.util.TestCellRangeUtil
     [echo] Tests run: 1, Failures: 0, Aborted: 0, Skipped: 0, Time elapsed: 0.000000 sec
     [echo] Ran org.apache.poi.ss.util.TestCellReference
     [echo] Tests run: 27, Failures: 0, Aborted: 0, Skipped: 0, Time elapsed: 0.313000 sec
     [echo] Ran org.apache.poi.ss.util.TestDateFormatConverter
     [echo] Tests run: 18, Failures: 0, Aborted: 0, Skipped: 0, Time elapsed: 1.718000 sec
     [echo] Ran org.apache.poi.ss.util.TestDateParser
     [echo] Tests run: 5, Failures: 0, Aborted: 0, Skipped: 0, Time elapsed: 0.007000 sec
     [echo] Ran org.apache.poi.ss.util.TestExpandedDouble
     [echo] Tests run: 18, Failures: 0, Aborted: 0, Skipped: 0, Time elapsed: 0.014000 sec
     [echo] Ran org.apache.poi.ss.util.TestHSSFCellUtil
     [echo] Tests run: 14, Failures: 0, Aborted: 0, Skipped: 0, Time elapsed: 0.030000 sec
     [echo] Ran org.apache.poi.ss.util.TestNumberComparer
     [echo] Tests run: 115, Failures: 0, Aborted: 0, Skipped: 0, Time elapsed: 0.101000 sec
     [echo] Ran org.apache.poi.ss.util.TestNumberToTextConverter
     [echo] Tests run: 2, Failures: 0, Aborted: 0, Skipped: 0, Time elapsed: 0.009000 sec
     [echo] Ran org.apache.poi.ss.util.TestPropertyTemplate
     [echo] Tests run: 8, Failures: 0, Aborted: 0, Skipped: 0, Time elapsed: 0.024000 sec
     [echo] Ran org.apache.poi.ss.util.TestRegionUtil
     [echo] Tests run: 10, Failures: 0, Aborted: 0, Skipped: 0, Time elapsed: 0.013000 sec
     [echo] Ran org.apache.poi.ss.util.TestSheetBuilder
     [echo] Tests run: 3, Failures: 0, Aborted: 0, Skipped: 0, Time elapsed: 0.002000 sec
     [echo] Ran org.apache.poi.ss.util.TestSheetUtil
     [echo] Tests run: 7, Failures: 0, Aborted: 0, Skipped: 0, Time elapsed: 0.003000 sec
     [echo] Ran org.apache.poi.ss.util.TestWorkbookUtil
     [echo] Tests run: 1, Failures: 0, Aborted: 0, Skipped: 0, Time elapsed: 0.000000 sec
     [echo] Ran org.apache.poi.ss.util.cellwalk.TestCellWalk
     [echo] Tests run: 1, Failures: 0, Aborted: 0, Skipped: 0, Time elapsed: 0.003000 sec
     [echo] Ran org.apache.poi.util.TestArrayUtil
     [echo] Tests run: 1, Failures: 0, Aborted: 0, Skipped: 0, Time elapsed: 0.002000 sec
     [echo] Ran org.apache.poi.util.TestBitField
     [echo] Tests run: 16, Failures: 0, Aborted: 0, Skipped: 0, Time elapsed: 0.003000 sec
     [echo] Ran org.apache.poi.util.TestByteField
     [echo] Tests run: 5, Failures: 0, Aborted: 0, Skipped: 0, Time elapsed: 0.002000 sec
     [echo] Ran org.apache.poi.util.TestHexDump
     [echo] Tests run: 8, Failures: 0, Aborted: 0, Skipped: 0, Time elapsed: 0.011000 sec
     [echo] Ran org.apache.poi.util.TestIOUtils
     [echo] Tests run: 36, Failures: 0, Aborted: 0, Skipped: 0, Time elapsed: 0.069000 sec
     [echo] Ran org.apache.poi.util.TestIntList
     [echo] Tests run: 19, Failures: 0, Aborted: 0, Skipped: 0, Time elapsed: 0.049000 sec
     [echo] Ran org.apache.poi.util.TestIntegerField
     [echo] Tests run: 5, Failures: 0, Aborted: 0, Skipped: 0, Time elapsed: 0.002000 sec
     [echo] Ran org.apache.poi.util.TestLittleEndian
     [echo] Tests run: 15, Failures: 0, Aborted: 0, Skipped: 0, Time elapsed: 0.003000 sec
     [echo] Ran org.apache.poi.util.TestLittleEndianStreams
     [echo] Tests run: 5, Failures: 0, Aborted: 0, Skipped: 0, Time elapsed: 0.002000 sec
     [echo] Ran org.apache.poi.util.TestLocaleUtil
     [echo] Tests run: 3, Failures: 0, Aborted: 0, Skipped: 0, Time elapsed: 0.002000 sec
     [echo] Ran org.apache.poi.util.TestLongField
     [echo] Tests run: 5, Failures: 0, Aborted: 0, Skipped: 0, Time elapsed: 0.002000 sec
     [echo] Ran org.apache.poi.util.TestPOILogger
     [echo] Tests run: 1, Failures: 0, Aborted: 0, Skipped: 0, Time elapsed: 0.000000 sec
     [echo] Ran org.apache.poi.util.TestRLEDecompressingInputStream
     [echo] Tests run: 4, Failures: 0, Aborted: 0, Skipped: 0, Time elapsed: 0.001000 sec
     [echo] Ran org.apache.poi.util.TestShortField
     [echo] Tests run: 5, Failures: 0, Aborted: 0, Skipped: 0, Time elapsed: 0.002000 sec
     [echo] Ran org.apache.poi.util.TestStringCodepointsIterable
     [echo] Tests run: 1, Failures: 0, Aborted: 0, Skipped: 0, Time elapsed: 0.001000 sec
     [echo] Ran org.apache.poi.util.TestStringUtil
     [echo] Tests run: 7, Failures: 0, Aborted: 0, Skipped: 0, Time elapsed: 0.003000 sec
     [echo] Ran org.apache.poi.util.TestTempFile
     [echo] Tests run: 4, Failures: 0, Aborted: 0, Skipped: 0, Time elapsed: 0.009000 sec
     [echo] Ran org.apache.poi.util.TestXMLHelper
     [echo] Tests run: 8, Failures: 0, Aborted: 0, Skipped: 0, Time elapsed: 0.328000 sec

-test-excelant-write-testfile:

test:

compile-integration:
    [javac] Compiling 28 source files to <https://ci-builds.apache.org/job/POI/job/POI-DSL-Windows-1.8/ws/build\integration-test-classes>
    [javac] Support for javac --release has been added in Java9 ignoring it
    [mkdir] Created dir: <https://ci-builds.apache.org/job/POI/job/POI-DSL-Windows-1.8/ws/build\integration-test-classes\META-INF\versions\9>
      [jar] Building jar: <https://ci-builds.apache.org/job/POI/job/POI-DSL-Windows-1.8/ws/build\dist\maven\poi-integration\poi-integration-5.0.1.jar>

-test-integration-check:

test-integration:

BUILD FAILED
<https://ci-builds.apache.org/job/POI/job/POI-DSL-Windows-1.8/ws/build.xml>:1709: The following error occurred while executing this line:
<https://ci-builds.apache.org/job/POI/job/POI-DSL-Windows-1.8/ws/build.xml>:1256: Some test(s) have failure(s)

Total time: 23 minutes 21 seconds
Build step 'Invoke Ant' marked build as failure
[SpotBugs] Skipping execution of recorder since overall result is 'FAILURE'
Archiving artifacts
[Fast Archiver] Compressed 10.45 MB of artifacts by 29.0% relative to #104
Skipping publisher since build result is FAILURE
Recording test results

---------------------------------------------------------------------
To unsubscribe, e-mail: [hidden email]
For additional commands, e-mail: [hidden email]

Reply | Threaded
Open this post in threaded view
|

Build failed in Jenkins: POI » POI-DSL-Windows-1.8 #108

Apache Jenkins Server
See <https://ci-builds.apache.org/job/POI/job/POI-DSL-Windows-1.8/108/display/redirect?page=changes>

Changes:

[Andreas Beeker] Integration test - fix filenames with windows path separator


------------------------------------------
[...truncated 286.68 KB...]
     [echo] Tests run: 98, Failures: 0, Aborted: 0, Skipped: 0, Time elapsed: 0.043000 sec
     [echo] Ran org.apache.poi.ss.formula.functions.TestIndirect
     [echo] Tests run: 3, Failures: 0, Aborted: 0, Skipped: 0, Time elapsed: 0.003000 sec
     [echo] Ran org.apache.poi.ss.formula.functions.TestIndirectFunctionFromSpreadsheet
     [echo] Tests run: 11, Failures: 0, Aborted: 0, Skipped: 0, Time elapsed: 0.007000 sec
     [echo] Ran org.apache.poi.ss.formula.functions.TestIntercept
     [echo] Tests run: 4, Failures: 0, Aborted: 0, Skipped: 0, Time elapsed: 0.004000 sec
     [echo] Ran org.apache.poi.ss.formula.functions.TestIrr
     [echo] Tests run: 3, Failures: 0, Aborted: 0, Skipped: 0, Time elapsed: 0.003000 sec
     [echo] Ran org.apache.poi.ss.formula.functions.TestIsBlank
     [echo] Tests run: 1, Failures: 0, Aborted: 0, Skipped: 0, Time elapsed: 0.001000 sec
     [echo] Ran org.apache.poi.ss.formula.functions.TestLeftRight
     [echo] Tests run: 2, Failures: 0, Aborted: 0, Skipped: 0, Time elapsed: 0.000000 sec
     [echo] Ran org.apache.poi.ss.formula.functions.TestLen
     [echo] Tests run: 3, Failures: 0, Aborted: 0, Skipped: 0, Time elapsed: 0.001000 sec
     [echo] Ran org.apache.poi.ss.formula.functions.TestLogicalFunction
     [echo] Tests run: 2, Failures: 0, Aborted: 0, Skipped: 0, Time elapsed: 0.002000 sec
     [echo] Ran org.apache.poi.ss.formula.functions.TestLogicalFunctionsFromSpreadsheet
     [echo] Tests run: 15, Failures: 0, Aborted: 0, Skipped: 0, Time elapsed: 0.008000 sec
     [echo] Ran org.apache.poi.ss.formula.functions.TestLookupFunctionsFromSpreadsheet
     [echo] Tests run: 205, Failures: 0, Aborted: 0, Skipped: 0, Time elapsed: 0.129000 sec
     [echo] Ran org.apache.poi.ss.formula.functions.TestMatch
     [echo] Tests run: 9, Failures: 0, Aborted: 0, Skipped: 0, Time elapsed: 0.004000 sec
     [echo] Ran org.apache.poi.ss.formula.functions.TestMatchFunctionsFromSpreadsheet
     [echo] Tests run: 14, Failures: 0, Aborted: 0, Skipped: 0, Time elapsed: 0.007000 sec
     [echo] Ran org.apache.poi.ss.formula.functions.TestMathX
     [echo] Tests run: 23, Failures: 0, Aborted: 0, Skipped: 0, Time elapsed: 0.007000 sec
     [echo] Ran org.apache.poi.ss.formula.functions.TestMid
     [echo] Tests run: 4, Failures: 0, Aborted: 0, Skipped: 0, Time elapsed: 0.001000 sec
     [echo] Ran org.apache.poi.ss.formula.functions.TestMirr
     [echo] Tests run: 4, Failures: 0, Aborted: 0, Skipped: 0, Time elapsed: 0.009000 sec
     [echo] Ran org.apache.poi.ss.formula.functions.TestMultiOperandNumericFunction
     [echo] Tests run: 3, Failures: 0, Aborted: 0, Skipped: 0, Time elapsed: 0.000000 sec
     [echo] Ran org.apache.poi.ss.formula.functions.TestNper
     [echo] Tests run: 2, Failures: 0, Aborted: 0, Skipped: 0, Time elapsed: 0.001000 sec
     [echo] Ran org.apache.poi.ss.formula.functions.TestNpv
     [echo] Tests run: 2, Failures: 0, Aborted: 0, Skipped: 0, Time elapsed: 0.002000 sec
     [echo] Ran org.apache.poi.ss.formula.functions.TestOct2Dec
     [echo] Tests run: 2, Failures: 0, Aborted: 0, Skipped: 0, Time elapsed: 0.000000 sec
     [echo] Ran org.apache.poi.ss.formula.functions.TestOffset
     [echo] Tests run: 21, Failures: 0, Aborted: 0, Skipped: 0, Time elapsed: 0.007000 sec
     [echo] Ran org.apache.poi.ss.formula.functions.TestPPMT
     [echo] Tests run: 1, Failures: 0, Aborted: 0, Skipped: 0, Time elapsed: 0.001000 sec
     [echo] Ran org.apache.poi.ss.formula.functions.TestPmt
     [echo] Tests run: 2, Failures: 0, Aborted: 0, Skipped: 0, Time elapsed: 0.001000 sec
     [echo] Ran org.apache.poi.ss.formula.functions.TestPoisson
     [echo] Tests run: 6, Failures: 0, Aborted: 0, Skipped: 0, Time elapsed: 0.000000 sec
     [echo] Ran org.apache.poi.ss.formula.functions.TestProduct
     [echo] Tests run: 4, Failures: 0, Aborted: 0, Skipped: 0, Time elapsed: 0.000000 sec
     [echo] Ran org.apache.poi.ss.formula.functions.TestQuotient
     [echo] Tests run: 2, Failures: 0, Aborted: 0, Skipped: 0, Time elapsed: 0.000000 sec
     [echo] Ran org.apache.poi.ss.formula.functions.TestQuotientFunctionsFromSpreadsheet
     [echo] Tests run: 8, Failures: 0, Aborted: 0, Skipped: 0, Time elapsed: 0.005000 sec
     [echo] Ran org.apache.poi.ss.formula.functions.TestRank
     [echo] Tests run: 1, Failures: 0, Aborted: 0, Skipped: 0, Time elapsed: 0.002000 sec
     [echo] Ran org.apache.poi.ss.formula.functions.TestRelationalOperations
     [echo] Tests run: 5, Failures: 0, Aborted: 0, Skipped: 0, Time elapsed: 0.001000 sec
     [echo] Ran org.apache.poi.ss.formula.functions.TestReptFunctionsFromSpreadsheet
     [echo] Tests run: 5, Failures: 0, Aborted: 0, Skipped: 0, Time elapsed: 0.006000 sec
     [echo] Ran org.apache.poi.ss.formula.functions.TestRomanFunctionsFromSpreadsheet
     [echo] Tests run: 35, Failures: 0, Aborted: 0, Skipped: 0, Time elapsed: 0.016000 sec
     [echo] Ran org.apache.poi.ss.formula.functions.TestRoundFuncs
     [echo] Tests run: 5, Failures: 0, Aborted: 0, Skipped: 1, Time elapsed: 0.001000 sec
     [echo] Ran org.apache.poi.ss.formula.functions.TestRowCol
     [echo] Tests run: 4, Failures: 0, Aborted: 0, Skipped: 0, Time elapsed: 0.001000 sec
     [echo] Ran org.apache.poi.ss.formula.functions.TestSlope
     [echo] Tests run: 3, Failures: 0, Aborted: 0, Skipped: 0, Time elapsed: 0.001000 sec
     [echo] Ran org.apache.poi.ss.formula.functions.TestStatsLib
     [echo] Tests run: 8, Failures: 0, Aborted: 0, Skipped: 0, Time elapsed: 0.001000 sec
     [echo] Ran org.apache.poi.ss.formula.functions.TestSubstitute
     [echo] Tests run: 5, Failures: 0, Aborted: 0, Skipped: 0, Time elapsed: 0.001000 sec
     [echo] Ran org.apache.poi.ss.formula.functions.TestSubtotal
     [echo] Tests run: 11, Failures: 0, Aborted: 0, Skipped: 0, Time elapsed: 0.008000 sec
     [echo] Ran org.apache.poi.ss.formula.functions.TestSumif
     [echo] Tests run: 3, Failures: 0, Aborted: 0, Skipped: 0, Time elapsed: 0.001000 sec
     [echo] Ran org.apache.poi.ss.formula.functions.TestSumifs
     [echo] Tests run: 7, Failures: 0, Aborted: 0, Skipped: 0, Time elapsed: 0.006000 sec
     [echo] Ran org.apache.poi.ss.formula.functions.TestSumproduct
     [echo] Tests run: 5, Failures: 0, Aborted: 0, Skipped: 0, Time elapsed: 0.002000 sec
     [echo] Ran org.apache.poi.ss.formula.functions.TestTFunc
     [echo] Tests run: 5, Failures: 0, Aborted: 0, Skipped: 0, Time elapsed: 0.001000 sec
     [echo] Ran org.apache.poi.ss.formula.functions.TestText
     [echo] Tests run: 4, Failures: 0, Aborted: 0, Skipped: 0, Time elapsed: 0.003000 sec
     [echo] Ran org.apache.poi.ss.formula.functions.TestTime
     [echo] Tests run: 2, Failures: 0, Aborted: 0, Skipped: 0, Time elapsed: 0.004000 sec
     [echo] Ran org.apache.poi.ss.formula.functions.TestTrendFunctionsFromSpreadsheet
     [echo] Tests run: 41, Failures: 0, Aborted: 0, Skipped: 0, Time elapsed: 0.058000 sec
     [echo] Ran org.apache.poi.ss.formula.functions.TestTrim
     [echo] Tests run: 3, Failures: 0, Aborted: 0, Skipped: 0, Time elapsed: 0.001000 sec
     [echo] Ran org.apache.poi.ss.formula.functions.TestTrunc
     [echo] Tests run: 7, Failures: 0, Aborted: 0, Skipped: 0, Time elapsed: 0.001000 sec
     [echo] Ran org.apache.poi.ss.formula.functions.TestTwoOperandNumericFunctionsFromSpreadsheet
     [echo] Tests run: 34, Failures: 0, Aborted: 0, Skipped: 0, Time elapsed: 0.025000 sec
     [echo] Ran org.apache.poi.ss.formula.functions.TestValue
     [echo] Tests run: 2, Failures: 0, Aborted: 0, Skipped: 0, Time elapsed: 0.002000 sec
     [echo] Ran org.apache.poi.ss.formula.functions.TestWeekNumFunctionsFromSpreadsheet
     [echo] Tests run: 7, Failures: 0, Aborted: 0, Skipped: 0, Time elapsed: 0.006000 sec
     [echo] Ran org.apache.poi.ss.formula.functions.TestWeekNumFunctionsFromSpreadsheet2013
     [echo] Tests run: 7, Failures: 0, Aborted: 0, Skipped: 0, Time elapsed: 0.004000 sec
     [echo] Ran org.apache.poi.ss.formula.functions.TestWeekdayFunc
     [echo] Tests run: 2, Failures: 0, Aborted: 0, Skipped: 0, Time elapsed: 0.001000 sec
     [echo] Ran org.apache.poi.ss.formula.functions.TestXYNumericFunction
     [echo] Tests run: 3, Failures: 0, Aborted: 0, Skipped: 0, Time elapsed: 0.001000 sec
     [echo] Ran org.apache.poi.ss.formula.ptg.TestAbstractFunctionPtg
     [echo] Tests run: 3, Failures: 0, Aborted: 0, Skipped: 0, Time elapsed: 0.001000 sec
     [echo] Ran org.apache.poi.ss.formula.ptg.TestArea3DPtg
     [echo] Tests run: 1, Failures: 0, Aborted: 0, Skipped: 0, Time elapsed: 0.000000 sec
     [echo] Ran org.apache.poi.ss.formula.ptg.TestAreaErrPtg
     [echo] Tests run: 1, Failures: 0, Aborted: 0, Skipped: 0, Time elapsed: 0.001000 sec
     [echo] Ran org.apache.poi.ss.formula.ptg.TestAreaPtg
     [echo] Tests run: 5, Failures: 0, Aborted: 0, Skipped: 0, Time elapsed: 0.001000 sec
     [echo] Ran org.apache.poi.ss.formula.ptg.TestArrayPtg
     [echo] Tests run: 5, Failures: 0, Aborted: 0, Skipped: 0, Time elapsed: 0.001000 sec
     [echo] Ran org.apache.poi.ss.formula.ptg.TestAttrPtg
     [echo] Tests run: 1, Failures: 0, Aborted: 0, Skipped: 0, Time elapsed: 0.001000 sec
     [echo] Ran org.apache.poi.ss.formula.ptg.TestErrPtg
     [echo] Tests run: 1, Failures: 0, Aborted: 0, Skipped: 0, Time elapsed: 0.001000 sec
     [echo] Ran org.apache.poi.ss.formula.ptg.TestExternalFunctionFormulas
     [echo] Tests run: 3, Failures: 0, Aborted: 0, Skipped: 0, Time elapsed: 0.002000 sec
     [echo] Ran org.apache.poi.ss.formula.ptg.TestExternalNameReference
     [echo] Tests run: 3, Failures: 0, Aborted: 0, Skipped: 0, Time elapsed: 0.002000 sec
     [echo] Ran org.apache.poi.ss.formula.ptg.TestFuncPtg
     [echo] Tests run: 2, Failures: 0, Aborted: 0, Skipped: 0, Time elapsed: 0.001000 sec
     [echo] Ran org.apache.poi.ss.formula.ptg.TestFuncVarPtg
     [echo] Tests run: 1, Failures: 0, Aborted: 0, Skipped: 0, Time elapsed: 0.001000 sec
     [echo] Ran org.apache.poi.ss.formula.ptg.TestIntersectionPtg
     [echo] Tests run: 1, Failures: 0, Aborted: 0, Skipped: 0, Time elapsed: 0.000000 sec
     [echo] Ran org.apache.poi.ss.formula.ptg.TestPercentPtg
     [echo] Tests run: 1, Failures: 0, Aborted: 0, Skipped: 0, Time elapsed: 0.001000 sec
     [echo] Ran org.apache.poi.ss.formula.ptg.TestRangePtg
     [echo] Tests run: 1, Failures: 0, Aborted: 0, Skipped: 0, Time elapsed: 0.001000 sec
     [echo] Ran org.apache.poi.ss.formula.ptg.TestRef3DPtg
     [echo] Tests run: 1, Failures: 0, Aborted: 0, Skipped: 0, Time elapsed: 0.001000 sec
     [echo] Ran org.apache.poi.ss.formula.ptg.TestReferencePtg
     [echo] Tests run: 4, Failures: 0, Aborted: 0, Skipped: 0, Time elapsed: 0.006000 sec
     [echo] Ran org.apache.poi.ss.formula.ptg.TestUnionPtg
     [echo] Tests run: 1, Failures: 0, Aborted: 0, Skipped: 0, Time elapsed: 0.001000 sec
     [echo] Ran org.apache.poi.ss.formula.udf.TestAggregatingUDFFinder
     [echo] Tests run: 2, Failures: 0, Aborted: 0, Skipped: 0, Time elapsed: 0.001000 sec
     [echo] Ran org.apache.poi.ss.formula.udf.TestDefaultUDFFinder
     [echo] Tests run: 1, Failures: 0, Aborted: 0, Skipped: 0, Time elapsed: 0.000000 sec
     [echo] Ran org.apache.poi.ss.usermodel.TestDataFormatter
     [echo] Tests run: 37, Failures: 0, Aborted: 0, Skipped: 1, Time elapsed: 0.299000 sec
     [echo] Ran org.apache.poi.ss.usermodel.TestDateUtil
     [echo] Tests run: 26, Failures: 0, Aborted: 0, Skipped: 0, Time elapsed: 0.012000 sec
     [echo] Ran org.apache.poi.ss.usermodel.TestExcelStyleDateFormatter
     [echo] Tests run: 123, Failures: 0, Aborted: 0, Skipped: 0, Time elapsed: 0.044000 sec
     [echo] Ran org.apache.poi.ss.usermodel.TestFractionFormat
     [echo] Tests run: 5, Failures: 0, Aborted: 0, Skipped: 1, Time elapsed: 0.248000 sec
     [echo] Ran org.apache.poi.ss.usermodel.TestHSSFBorderStyle
     [echo] Tests run: 1, Failures: 0, Aborted: 0, Skipped: 0, Time elapsed: 0.001000 sec
     [echo] Ran org.apache.poi.ss.usermodel.TestIndexedColors
     [echo] Tests run: 3, Failures: 0, Aborted: 0, Skipped: 0, Time elapsed: 0.001000 sec
     [echo] Ran org.apache.poi.ss.util.TestAreaReference
     [echo] Tests run: 3, Failures: 0, Aborted: 0, Skipped: 0, Time elapsed: 0.001000 sec
     [echo] Ran org.apache.poi.ss.util.TestCellAddress
     [echo] Tests run: 6, Failures: 0, Aborted: 0, Skipped: 0, Time elapsed: 0.001000 sec
     [echo] Ran org.apache.poi.ss.util.TestCellRangeAddress
     [echo] Tests run: 14, Failures: 0, Aborted: 0, Skipped: 0, Time elapsed: 0.003000 sec
     [echo] Ran org.apache.poi.ss.util.TestCellRangeUtil
     [echo] Tests run: 1, Failures: 0, Aborted: 0, Skipped: 0, Time elapsed: 0.000000 sec
     [echo] Ran org.apache.poi.ss.util.TestCellReference
     [echo] Tests run: 27, Failures: 0, Aborted: 0, Skipped: 0, Time elapsed: 0.282000 sec
     [echo] Ran org.apache.poi.ss.util.TestDateFormatConverter
     [echo] Tests run: 18, Failures: 0, Aborted: 0, Skipped: 0, Time elapsed: 1.548000 sec
     [echo] Ran org.apache.poi.ss.util.TestDateParser
     [echo] Tests run: 5, Failures: 0, Aborted: 0, Skipped: 0, Time elapsed: 0.005000 sec
     [echo] Ran org.apache.poi.ss.util.TestExpandedDouble
     [echo] Tests run: 18, Failures: 0, Aborted: 0, Skipped: 0, Time elapsed: 0.010000 sec
     [echo] Ran org.apache.poi.ss.util.TestHSSFCellUtil
     [echo] Tests run: 14, Failures: 0, Aborted: 0, Skipped: 0, Time elapsed: 0.015000 sec
     [echo] Ran org.apache.poi.ss.util.TestNumberComparer
     [echo] Tests run: 115, Failures: 0, Aborted: 0, Skipped: 0, Time elapsed: 0.042000 sec
     [echo] Ran org.apache.poi.ss.util.TestNumberToTextConverter
     [echo] Tests run: 2, Failures: 0, Aborted: 0, Skipped: 0, Time elapsed: 0.008000 sec
     [echo] Ran org.apache.poi.ss.util.TestPropertyTemplate
     [echo] Tests run: 8, Failures: 0, Aborted: 0, Skipped: 0, Time elapsed: 0.024000 sec
     [echo] Ran org.apache.poi.ss.util.TestRegionUtil
     [echo] Tests run: 10, Failures: 0, Aborted: 0, Skipped: 0, Time elapsed: 0.014000 sec
     [echo] Ran org.apache.poi.ss.util.TestSheetBuilder
     [echo] Tests run: 3, Failures: 0, Aborted: 0, Skipped: 0, Time elapsed: 0.002000 sec
     [echo] Ran org.apache.poi.ss.util.TestSheetUtil
     [echo] Tests run: 7, Failures: 0, Aborted: 0, Skipped: 0, Time elapsed: 0.004000 sec
     [echo] Ran org.apache.poi.ss.util.TestWorkbookUtil
     [echo] Tests run: 1, Failures: 0, Aborted: 0, Skipped: 0, Time elapsed: 0.001000 sec
     [echo] Ran org.apache.poi.ss.util.cellwalk.TestCellWalk
     [echo] Tests run: 1, Failures: 0, Aborted: 0, Skipped: 0, Time elapsed: 0.002000 sec
     [echo] Ran org.apache.poi.util.TestArrayUtil
     [echo] Tests run: 1, Failures: 0, Aborted: 0, Skipped: 0, Time elapsed: 0.002000 sec
     [echo] Ran org.apache.poi.util.TestBitField
     [echo] Tests run: 16, Failures: 0, Aborted: 0, Skipped: 0, Time elapsed: 0.003000 sec
     [echo] Ran org.apache.poi.util.TestByteField
     [echo] Tests run: 5, Failures: 0, Aborted: 0, Skipped: 0, Time elapsed: 0.001000 sec
     [echo] Ran org.apache.poi.util.TestHexDump
     [echo] Tests run: 8, Failures: 0, Aborted: 0, Skipped: 0, Time elapsed: 0.008000 sec
     [echo] Ran org.apache.poi.util.TestIOUtils
     [echo] Tests run: 36, Failures: 0, Aborted: 0, Skipped: 0, Time elapsed: 0.041000 sec
     [echo] Ran org.apache.poi.util.TestIntList
     [echo] Tests run: 19, Failures: 0, Aborted: 0, Skipped: 0, Time elapsed: 0.043000 sec
     [echo] Ran org.apache.poi.util.TestIntegerField
     [echo] Tests run: 5, Failures: 0, Aborted: 0, Skipped: 0, Time elapsed: 0.003000 sec
     [echo] Ran org.apache.poi.util.TestLittleEndian
     [echo] Tests run: 15, Failures: 0, Aborted: 0, Skipped: 0, Time elapsed: 0.003000 sec
     [echo] Ran org.apache.poi.util.TestLittleEndianStreams
     [echo] Tests run: 5, Failures: 0, Aborted: 0, Skipped: 0, Time elapsed: 0.002000 sec
     [echo] Ran org.apache.poi.util.TestLocaleUtil
     [echo] Tests run: 3, Failures: 0, Aborted: 0, Skipped: 0, Time elapsed: 0.001000 sec
     [echo] Ran org.apache.poi.util.TestLongField
     [echo] Tests run: 5, Failures: 0, Aborted: 0, Skipped: 0, Time elapsed: 0.002000 sec
     [echo] Ran org.apache.poi.util.TestPOILogger
     [echo] Tests run: 1, Failures: 0, Aborted: 0, Skipped: 0, Time elapsed: 0.001000 sec
     [echo] Ran org.apache.poi.util.TestRLEDecompressingInputStream
     [echo] Tests run: 4, Failures: 0, Aborted: 0, Skipped: 0, Time elapsed: 0.000000 sec
     [echo] Ran org.apache.poi.util.TestShortField
     [echo] Tests run: 5, Failures: 0, Aborted: 0, Skipped: 0, Time elapsed: 0.002000 sec
     [echo] Ran org.apache.poi.util.TestStringCodepointsIterable
     [echo] Tests run: 1, Failures: 0, Aborted: 0, Skipped: 0, Time elapsed: 0.001000 sec
     [echo] Ran org.apache.poi.util.TestStringUtil
     [echo] Tests run: 7, Failures: 0, Aborted: 0, Skipped: 0, Time elapsed: 0.003000 sec
     [echo] Ran org.apache.poi.util.TestTempFile
     [echo] Tests run: 4, Failures: 0, Aborted: 0, Skipped: 0, Time elapsed: 0.010000 sec
     [echo] Ran org.apache.poi.util.TestXMLHelper
     [echo] Tests run: 8, Failures: 0, Aborted: 0, Skipped: 0, Time elapsed: 0.280000 sec

-test-excelant-write-testfile:

test:

compile-integration:
    [javac] Compiling 28 source files to <https://ci-builds.apache.org/job/POI/job/POI-DSL-Windows-1.8/ws/build\integration-test-classes>
    [javac] Support for javac --release has been added in Java9 ignoring it
    [mkdir] Created dir: <https://ci-builds.apache.org/job/POI/job/POI-DSL-Windows-1.8/ws/build\integration-test-classes\META-INF\versions\9>
      [jar] Building jar: <https://ci-builds.apache.org/job/POI/job/POI-DSL-Windows-1.8/ws/build\dist\maven\poi-integration\poi-integration-5.0.1.jar>

-test-integration-check:

test-integration:

BUILD FAILED
<https://ci-builds.apache.org/job/POI/job/POI-DSL-Windows-1.8/ws/build.xml>:1709: The following error occurred while executing this line:
<https://ci-builds.apache.org/job/POI/job/POI-DSL-Windows-1.8/ws/build.xml>:1256: Some test(s) have failure(s)

Total time: 22 minutes 44 seconds
Build step 'Invoke Ant' marked build as failure
[SpotBugs] Skipping execution of recorder since overall result is 'FAILURE'
Archiving artifacts
[Fast Archiver] Compressed 7.39 MB of artifacts by 41.0% relative to #104
Skipping publisher since build result is FAILURE
Recording test results

---------------------------------------------------------------------
To unsubscribe, e-mail: [hidden email]
For additional commands, e-mail: [hidden email]

Reply | Threaded
Open this post in threaded view
|

Build failed in Jenkins: POI » POI-DSL-Windows-1.8 #109

Apache Jenkins Server
See <https://ci-builds.apache.org/job/POI/job/POI-DSL-Windows-1.8/109/display/redirect?page=changes>

Changes:

[Andreas Beeker] Integration tests - try to fix Oracle/OpenJDK vs IBM-JDK error message differences on XXE files

[Andreas Beeker] Update docs to 5.0.0

[Andreas Beeker] Bump versions to 5.0.1-SNAPSHOT

[Andreas Beeker] Sonar fixes
constant name to match the regular expression '^[A-Z][A-Z0-9]*(_[A-Z0-9]+)*$'
reorder "final static" -> "static final"

[Andreas Beeker] integration tests: ignore hsmf/lots-of-recipients.msg because of concurrent test errors - also takes too long to process


------------------------------------------
[...truncated 309.86 KB...]
     [echo] Tests run: 98, Failures: 0, Aborted: 0, Skipped: 0, Time elapsed: 0.065000 sec
     [echo] Ran org.apache.poi.ss.formula.functions.TestIndirect
     [echo] Tests run: 3, Failures: 0, Aborted: 0, Skipped: 0, Time elapsed: 0.006000 sec
     [echo] Ran org.apache.poi.ss.formula.functions.TestIndirectFunctionFromSpreadsheet
     [echo] Tests run: 11, Failures: 0, Aborted: 0, Skipped: 0, Time elapsed: 0.009000 sec
     [echo] Ran org.apache.poi.ss.formula.functions.TestIntercept
     [echo] Tests run: 4, Failures: 0, Aborted: 0, Skipped: 0, Time elapsed: 0.003000 sec
     [echo] Ran org.apache.poi.ss.formula.functions.TestIrr
     [echo] Tests run: 3, Failures: 0, Aborted: 0, Skipped: 0, Time elapsed: 0.003000 sec
     [echo] Ran org.apache.poi.ss.formula.functions.TestIsBlank
     [echo] Tests run: 1, Failures: 0, Aborted: 0, Skipped: 0, Time elapsed: 0.001000 sec
     [echo] Ran org.apache.poi.ss.formula.functions.TestLeftRight
     [echo] Tests run: 2, Failures: 0, Aborted: 0, Skipped: 0, Time elapsed: 0.001000 sec
     [echo] Ran org.apache.poi.ss.formula.functions.TestLen
     [echo] Tests run: 3, Failures: 0, Aborted: 0, Skipped: 0, Time elapsed: 0.000000 sec
     [echo] Ran org.apache.poi.ss.formula.functions.TestLogicalFunction
     [echo] Tests run: 2, Failures: 0, Aborted: 0, Skipped: 0, Time elapsed: 0.002000 sec
     [echo] Ran org.apache.poi.ss.formula.functions.TestLogicalFunctionsFromSpreadsheet
     [echo] Tests run: 15, Failures: 0, Aborted: 0, Skipped: 0, Time elapsed: 0.009000 sec
     [echo] Ran org.apache.poi.ss.formula.functions.TestLookupFunctionsFromSpreadsheet
     [echo] Tests run: 205, Failures: 0, Aborted: 0, Skipped: 0, Time elapsed: 0.126000 sec
     [echo] Ran org.apache.poi.ss.formula.functions.TestMatch
     [echo] Tests run: 9, Failures: 0, Aborted: 0, Skipped: 0, Time elapsed: 0.004000 sec
     [echo] Ran org.apache.poi.ss.formula.functions.TestMatchFunctionsFromSpreadsheet
     [echo] Tests run: 14, Failures: 0, Aborted: 0, Skipped: 0, Time elapsed: 0.009000 sec
     [echo] Ran org.apache.poi.ss.formula.functions.TestMathX
     [echo] Tests run: 23, Failures: 0, Aborted: 0, Skipped: 0, Time elapsed: 0.006000 sec
     [echo] Ran org.apache.poi.ss.formula.functions.TestMid
     [echo] Tests run: 4, Failures: 0, Aborted: 0, Skipped: 0, Time elapsed: 0.002000 sec
     [echo] Ran org.apache.poi.ss.formula.functions.TestMirr
     [echo] Tests run: 4, Failures: 0, Aborted: 0, Skipped: 0, Time elapsed: 0.004000 sec
     [echo] Ran org.apache.poi.ss.formula.functions.TestMultiOperandNumericFunction
     [echo] Tests run: 3, Failures: 0, Aborted: 0, Skipped: 0, Time elapsed: 0.001000 sec
     [echo] Ran org.apache.poi.ss.formula.functions.TestNper
     [echo] Tests run: 2, Failures: 0, Aborted: 0, Skipped: 0, Time elapsed: 0.001000 sec
     [echo] Ran org.apache.poi.ss.formula.functions.TestNpv
     [echo] Tests run: 2, Failures: 0, Aborted: 0, Skipped: 0, Time elapsed: 0.003000 sec
     [echo] Ran org.apache.poi.ss.formula.functions.TestOct2Dec
     [echo] Tests run: 2, Failures: 0, Aborted: 0, Skipped: 0, Time elapsed: 0.001000 sec
     [echo] Ran org.apache.poi.ss.formula.functions.TestOffset
     [echo] Tests run: 21, Failures: 0, Aborted: 0, Skipped: 0, Time elapsed: 0.008000 sec
     [echo] Ran org.apache.poi.ss.formula.functions.TestPPMT
     [echo] Tests run: 1, Failures: 0, Aborted: 0, Skipped: 0, Time elapsed: 0.001000 sec
     [echo] Ran org.apache.poi.ss.formula.functions.TestPmt
     [echo] Tests run: 2, Failures: 0, Aborted: 0, Skipped: 0, Time elapsed: 0.001000 sec
     [echo] Ran org.apache.poi.ss.formula.functions.TestPoisson
     [echo] Tests run: 6, Failures: 0, Aborted: 0, Skipped: 0, Time elapsed: 0.001000 sec
     [echo] Ran org.apache.poi.ss.formula.functions.TestProduct
     [echo] Tests run: 4, Failures: 0, Aborted: 0, Skipped: 0, Time elapsed: 0.001000 sec
     [echo] Ran org.apache.poi.ss.formula.functions.TestQuotient
     [echo] Tests run: 2, Failures: 0, Aborted: 0, Skipped: 0, Time elapsed: 0.001000 sec
     [echo] Ran org.apache.poi.ss.formula.functions.TestQuotientFunctionsFromSpreadsheet
     [echo] Tests run: 8, Failures: 0, Aborted: 0, Skipped: 0, Time elapsed: 0.005000 sec
     [echo] Ran org.apache.poi.ss.formula.functions.TestRank
     [echo] Tests run: 1, Failures: 0, Aborted: 0, Skipped: 0, Time elapsed: 0.003000 sec
     [echo] Ran org.apache.poi.ss.formula.functions.TestRelationalOperations
     [echo] Tests run: 5, Failures: 0, Aborted: 0, Skipped: 0, Time elapsed: 0.001000 sec
     [echo] Ran org.apache.poi.ss.formula.functions.TestReptFunctionsFromSpreadsheet
     [echo] Tests run: 5, Failures: 0, Aborted: 0, Skipped: 0, Time elapsed: 0.006000 sec
     [echo] Ran org.apache.poi.ss.formula.functions.TestRomanFunctionsFromSpreadsheet
     [echo] Tests run: 35, Failures: 0, Aborted: 0, Skipped: 0, Time elapsed: 0.013000 sec
     [echo] Ran org.apache.poi.ss.formula.functions.TestRoundFuncs
     [echo] Tests run: 5, Failures: 0, Aborted: 0, Skipped: 1, Time elapsed: 0.001000 sec
     [echo] Ran org.apache.poi.ss.formula.functions.TestRowCol
     [echo] Tests run: 4, Failures: 0, Aborted: 0, Skipped: 0, Time elapsed: 0.001000 sec
     [echo] Ran org.apache.poi.ss.formula.functions.TestSlope
     [echo] Tests run: 3, Failures: 0, Aborted: 0, Skipped: 0, Time elapsed: 0.001000 sec
     [echo] Ran org.apache.poi.ss.formula.functions.TestStatsLib
     [echo] Tests run: 8, Failures: 0, Aborted: 0, Skipped: 0, Time elapsed: 0.001000 sec
     [echo] Ran org.apache.poi.ss.formula.functions.TestSubstitute
     [echo] Tests run: 5, Failures: 0, Aborted: 0, Skipped: 0, Time elapsed: 0.001000 sec
     [echo] Ran org.apache.poi.ss.formula.functions.TestSubtotal
     [echo] Tests run: 11, Failures: 0, Aborted: 0, Skipped: 0, Time elapsed: 0.006000 sec
     [echo] Ran org.apache.poi.ss.formula.functions.TestSumif
     [echo] Tests run: 3, Failures: 0, Aborted: 0, Skipped: 0, Time elapsed: 0.002000 sec
     [echo] Ran org.apache.poi.ss.formula.functions.TestSumifs
     [echo] Tests run: 7, Failures: 0, Aborted: 0, Skipped: 0, Time elapsed: 0.004000 sec
     [echo] Ran org.apache.poi.ss.formula.functions.TestSumproduct
     [echo] Tests run: 5, Failures: 0, Aborted: 0, Skipped: 0, Time elapsed: 0.001000 sec
     [echo] Ran org.apache.poi.ss.formula.functions.TestTFunc
     [echo] Tests run: 5, Failures: 0, Aborted: 0, Skipped: 0, Time elapsed: 0.001000 sec
     [echo] Ran org.apache.poi.ss.formula.functions.TestText
     [echo] Tests run: 4, Failures: 0, Aborted: 0, Skipped: 0, Time elapsed: 0.002000 sec
     [echo] Ran org.apache.poi.ss.formula.functions.TestTime
     [echo] Tests run: 2, Failures: 0, Aborted: 0, Skipped: 0, Time elapsed: 0.003000 sec
     [echo] Ran org.apache.poi.ss.formula.functions.TestTrendFunctionsFromSpreadsheet
     [echo] Tests run: 41, Failures: 0, Aborted: 0, Skipped: 0, Time elapsed: 0.045000 sec
     [echo] Ran org.apache.poi.ss.formula.functions.TestTrim
     [echo] Tests run: 3, Failures: 0, Aborted: 0, Skipped: 0, Time elapsed: 0.001000 sec
     [echo] Ran org.apache.poi.ss.formula.functions.TestTrunc
     [echo] Tests run: 7, Failures: 0, Aborted: 0, Skipped: 0, Time elapsed: 0.002000 sec
     [echo] Ran org.apache.poi.ss.formula.functions.TestTwoOperandNumericFunctionsFromSpreadsheet
     [echo] Tests run: 34, Failures: 0, Aborted: 0, Skipped: 0, Time elapsed: 0.029000 sec
     [echo] Ran org.apache.poi.ss.formula.functions.TestValue
     [echo] Tests run: 2, Failures: 0, Aborted: 0, Skipped: 0, Time elapsed: 0.002000 sec
     [echo] Ran org.apache.poi.ss.formula.functions.TestWeekNumFunctionsFromSpreadsheet
     [echo] Tests run: 7, Failures: 0, Aborted: 0, Skipped: 0, Time elapsed: 0.006000 sec
     [echo] Ran org.apache.poi.ss.formula.functions.TestWeekNumFunctionsFromSpreadsheet2013
     [echo] Tests run: 7, Failures: 0, Aborted: 0, Skipped: 0, Time elapsed: 0.005000 sec
     [echo] Ran org.apache.poi.ss.formula.functions.TestWeekdayFunc
     [echo] Tests run: 2, Failures: 0, Aborted: 0, Skipped: 0, Time elapsed: 0.001000 sec
     [echo] Ran org.apache.poi.ss.formula.functions.TestXYNumericFunction
     [echo] Tests run: 3, Failures: 0, Aborted: 0, Skipped: 0, Time elapsed: 0.001000 sec
     [echo] Ran org.apache.poi.ss.formula.ptg.TestAbstractFunctionPtg
     [echo] Tests run: 3, Failures: 0, Aborted: 0, Skipped: 0, Time elapsed: 0.001000 sec
     [echo] Ran org.apache.poi.ss.formula.ptg.TestArea3DPtg
     [echo] Tests run: 1, Failures: 0, Aborted: 0, Skipped: 0, Time elapsed: 0.000000 sec
     [echo] Ran org.apache.poi.ss.formula.ptg.TestAreaErrPtg
     [echo] Tests run: 1, Failures: 0, Aborted: 0, Skipped: 0, Time elapsed: 0.001000 sec
     [echo] Ran org.apache.poi.ss.formula.ptg.TestAreaPtg
     [echo] Tests run: 5, Failures: 0, Aborted: 0, Skipped: 0, Time elapsed: 0.000000 sec
     [echo] Ran org.apache.poi.ss.formula.ptg.TestArrayPtg
     [echo] Tests run: 5, Failures: 0, Aborted: 0, Skipped: 0, Time elapsed: 0.003000 sec
     [echo] Ran org.apache.poi.ss.formula.ptg.TestAttrPtg
     [echo] Tests run: 1, Failures: 0, Aborted: 0, Skipped: 0, Time elapsed: 0.000000 sec
     [echo] Ran org.apache.poi.ss.formula.ptg.TestErrPtg
     [echo] Tests run: 1, Failures: 0, Aborted: 0, Skipped: 0, Time elapsed: 0.001000 sec
     [echo] Ran org.apache.poi.ss.formula.ptg.TestExternalFunctionFormulas
     [echo] Tests run: 3, Failures: 0, Aborted: 0, Skipped: 0, Time elapsed: 0.003000 sec
     [echo] Ran org.apache.poi.ss.formula.ptg.TestExternalNameReference
     [echo] Tests run: 3, Failures: 0, Aborted: 0, Skipped: 0, Time elapsed: 0.004000 sec
     [echo] Ran org.apache.poi.ss.formula.ptg.TestFuncPtg
     [echo] Tests run: 2, Failures: 0, Aborted: 0, Skipped: 0, Time elapsed: 0.001000 sec
     [echo] Ran org.apache.poi.ss.formula.ptg.TestFuncVarPtg
     [echo] Tests run: 1, Failures: 0, Aborted: 0, Skipped: 0, Time elapsed: 0.001000 sec
     [echo] Ran org.apache.poi.ss.formula.ptg.TestIntersectionPtg
     [echo] Tests run: 1, Failures: 0, Aborted: 0, Skipped: 0, Time elapsed: 0.001000 sec
     [echo] Ran org.apache.poi.ss.formula.ptg.TestPercentPtg
     [echo] Tests run: 1, Failures: 0, Aborted: 0, Skipped: 0, Time elapsed: 0.000000 sec
     [echo] Ran org.apache.poi.ss.formula.ptg.TestRangePtg
     [echo] Tests run: 1, Failures: 0, Aborted: 0, Skipped: 0, Time elapsed: 0.001000 sec
     [echo] Ran org.apache.poi.ss.formula.ptg.TestRef3DPtg
     [echo] Tests run: 1, Failures: 0, Aborted: 0, Skipped: 0, Time elapsed: 0.000000 sec
     [echo] Ran org.apache.poi.ss.formula.ptg.TestReferencePtg
     [echo] Tests run: 4, Failures: 0, Aborted: 0, Skipped: 0, Time elapsed: 0.006000 sec
     [echo] Ran org.apache.poi.ss.formula.ptg.TestUnionPtg
     [echo] Tests run: 1, Failures: 0, Aborted: 0, Skipped: 0, Time elapsed: 0.001000 sec
     [echo] Ran org.apache.poi.ss.formula.udf.TestAggregatingUDFFinder
     [echo] Tests run: 2, Failures: 0, Aborted: 0, Skipped: 0, Time elapsed: 0.001000 sec
     [echo] Ran org.apache.poi.ss.formula.udf.TestDefaultUDFFinder
     [echo] Tests run: 1, Failures: 0, Aborted: 0, Skipped: 0, Time elapsed: 0.000000 sec
     [echo] Ran org.apache.poi.ss.usermodel.TestDataFormatter
     [echo] Tests run: 37, Failures: 0, Aborted: 0, Skipped: 1, Time elapsed: 0.327000 sec
     [echo] Ran org.apache.poi.ss.usermodel.TestDateUtil
     [echo] Tests run: 26, Failures: 0, Aborted: 0, Skipped: 0, Time elapsed: 0.014000 sec
     [echo] Ran org.apache.poi.ss.usermodel.TestExcelStyleDateFormatter
     [echo] Tests run: 123, Failures: 0, Aborted: 0, Skipped: 0, Time elapsed: 0.060000 sec
     [echo] Ran org.apache.poi.ss.usermodel.TestFractionFormat
     [echo] Tests run: 5, Failures: 0, Aborted: 0, Skipped: 1, Time elapsed: 0.297000 sec
     [echo] Ran org.apache.poi.ss.usermodel.TestHSSFBorderStyle
     [echo] Tests run: 1, Failures: 0, Aborted: 0, Skipped: 0, Time elapsed: 0.002000 sec
     [echo] Ran org.apache.poi.ss.usermodel.TestIndexedColors
     [echo] Tests run: 3, Failures: 0, Aborted: 0, Skipped: 0, Time elapsed: 0.001000 sec
     [echo] Ran org.apache.poi.ss.util.TestAreaReference
     [echo] Tests run: 3, Failures: 0, Aborted: 0, Skipped: 0, Time elapsed: 0.001000 sec
     [echo] Ran org.apache.poi.ss.util.TestCellAddress
     [echo] Tests run: 6, Failures: 0, Aborted: 0, Skipped: 0, Time elapsed: 0.001000 sec
     [echo] Ran org.apache.poi.ss.util.TestCellRangeAddress
     [echo] Tests run: 14, Failures: 0, Aborted: 0, Skipped: 0, Time elapsed: 0.003000 sec
     [echo] Ran org.apache.poi.ss.util.TestCellRangeUtil
     [echo] Tests run: 1, Failures: 0, Aborted: 0, Skipped: 0, Time elapsed: 0.000000 sec
     [echo] Ran org.apache.poi.ss.util.TestCellReference
     [echo] Tests run: 27, Failures: 0, Aborted: 0, Skipped: 0, Time elapsed: 0.284000 sec
     [echo] Ran org.apache.poi.ss.util.TestDateFormatConverter
     [echo] Tests run: 18, Failures: 0, Aborted: 0, Skipped: 0, Time elapsed: 1.452000 sec
     [echo] Ran org.apache.poi.ss.util.TestDateParser
     [echo] Tests run: 5, Failures: 0, Aborted: 0, Skipped: 0, Time elapsed: 0.004000 sec
     [echo] Ran org.apache.poi.ss.util.TestExpandedDouble
     [echo] Tests run: 18, Failures: 0, Aborted: 0, Skipped: 0, Time elapsed: 0.009000 sec
     [echo] Ran org.apache.poi.ss.util.TestHSSFCellUtil
     [echo] Tests run: 14, Failures: 0, Aborted: 0, Skipped: 0, Time elapsed: 0.015000 sec
     [echo] Ran org.apache.poi.ss.util.TestNumberComparer
     [echo] Tests run: 115, Failures: 0, Aborted: 0, Skipped: 0, Time elapsed: 0.069000 sec
     [echo] Ran org.apache.poi.ss.util.TestNumberToTextConverter
     [echo] Tests run: 2, Failures: 0, Aborted: 0, Skipped: 0, Time elapsed: 0.009000 sec
     [echo] Ran org.apache.poi.ss.util.TestPropertyTemplate
     [echo] Tests run: 8, Failures: 0, Aborted: 0, Skipped: 0, Time elapsed: 0.019000 sec
     [echo] Ran org.apache.poi.ss.util.TestRegionUtil
     [echo] Tests run: 10, Failures: 0, Aborted: 0, Skipped: 0, Time elapsed: 0.013000 sec
     [echo] Ran org.apache.poi.ss.util.TestSheetBuilder
     [echo] Tests run: 3, Failures: 0, Aborted: 0, Skipped: 0, Time elapsed: 0.002000 sec
     [echo] Ran org.apache.poi.ss.util.TestSheetUtil
     [echo] Tests run: 7, Failures: 0, Aborted: 0, Skipped: 0, Time elapsed: 0.004000 sec
     [echo] Ran org.apache.poi.ss.util.TestWorkbookUtil
     [echo] Tests run: 1, Failures: 0, Aborted: 0, Skipped: 0, Time elapsed: 0.000000 sec
     [echo] Ran org.apache.poi.ss.util.cellwalk.TestCellWalk
     [echo] Tests run: 1, Failures: 0, Aborted: 0, Skipped: 0, Time elapsed: 0.003000 sec
     [echo] Ran org.apache.poi.util.TestArrayUtil
     [echo] Tests run: 1, Failures: 0, Aborted: 0, Skipped: 0, Time elapsed: 0.001000 sec
     [echo] Ran org.apache.poi.util.TestBitField
     [echo] Tests run: 16, Failures: 0, Aborted: 0, Skipped: 0, Time elapsed: 0.003000 sec
     [echo] Ran org.apache.poi.util.TestByteField
     [echo] Tests run: 5, Failures: 0, Aborted: 0, Skipped: 0, Time elapsed: 0.001000 sec
     [echo] Ran org.apache.poi.util.TestHexDump
     [echo] Tests run: 8, Failures: 0, Aborted: 0, Skipped: 0, Time elapsed: 0.009000 sec
     [echo] Ran org.apache.poi.util.TestIOUtils
     [echo] Tests run: 36, Failures: 0, Aborted: 0, Skipped: 0, Time elapsed: 0.029000 sec
     [echo] Ran org.apache.poi.util.TestIntList
     [echo] Tests run: 19, Failures: 0, Aborted: 0, Skipped: 0, Time elapsed: 0.043000 sec
     [echo] Ran org.apache.poi.util.TestIntegerField
     [echo] Tests run: 5, Failures: 0, Aborted: 0, Skipped: 0, Time elapsed: 0.002000 sec
     [echo] Ran org.apache.poi.util.TestLittleEndian
     [echo] Tests run: 15, Failures: 0, Aborted: 0, Skipped: 0, Time elapsed: 0.002000 sec
     [echo] Ran org.apache.poi.util.TestLittleEndianStreams
     [echo] Tests run: 5, Failures: 0, Aborted: 0, Skipped: 0, Time elapsed: 0.002000 sec
     [echo] Ran org.apache.poi.util.TestLocaleUtil
     [echo] Tests run: 3, Failures: 0, Aborted: 0, Skipped: 0, Time elapsed: 0.001000 sec
     [echo] Ran org.apache.poi.util.TestLongField
     [echo] Tests run: 5, Failures: 0, Aborted: 0, Skipped: 0, Time elapsed: 0.002000 sec
     [echo] Ran org.apache.poi.util.TestPOILogger
     [echo] Tests run: 1, Failures: 0, Aborted: 0, Skipped: 0, Time elapsed: 0.001000 sec
     [echo] Ran org.apache.poi.util.TestRLEDecompressingInputStream
     [echo] Tests run: 4, Failures: 0, Aborted: 0, Skipped: 0, Time elapsed: 0.001000 sec
     [echo] Ran org.apache.poi.util.TestShortField
     [echo] Tests run: 5, Failures: 0, Aborted: 0, Skipped: 0, Time elapsed: 0.002000 sec
     [echo] Ran org.apache.poi.util.TestStringCodepointsIterable
     [echo] Tests run: 1, Failures: 0, Aborted: 0, Skipped: 0, Time elapsed: 0.001000 sec
     [echo] Ran org.apache.poi.util.TestStringUtil
     [echo] Tests run: 7, Failures: 0, Aborted: 0, Skipped: 0, Time elapsed: 0.001000 sec
     [echo] Ran org.apache.poi.util.TestTempFile
     [echo] Tests run: 4, Failures: 0, Aborted: 0, Skipped: 0, Time elapsed: 0.005000 sec
     [echo] Ran org.apache.poi.util.TestXMLHelper
     [echo] Tests run: 8, Failures: 0, Aborted: 0, Skipped: 0, Time elapsed: 0.267000 sec

-test-excelant-write-testfile:

test:

compile-integration:
    [javac] Compiling 28 source files to <https://ci-builds.apache.org/job/POI/job/POI-DSL-Windows-1.8/ws/build\integration-test-classes>
    [javac] Support for javac --release has been added in Java9 ignoring it
    [mkdir] Created dir: <https://ci-builds.apache.org/job/POI/job/POI-DSL-Windows-1.8/ws/build\integration-test-classes\META-INF\versions\9>
      [jar] Building jar: <https://ci-builds.apache.org/job/POI/job/POI-DSL-Windows-1.8/ws/build\dist\maven\poi-integration\poi-integration-5.0.1-SNAPSHOT.jar>

-test-integration-check:

test-integration:

BUILD FAILED
<https://ci-builds.apache.org/job/POI/job/POI-DSL-Windows-1.8/ws/build.xml>:1709: The following error occurred while executing this line:
<https://ci-builds.apache.org/job/POI/job/POI-DSL-Windows-1.8/ws/build.xml>:1256: Some test(s) have failure(s)

Total time: 21 minutes 36 seconds
Build step 'Invoke Ant' marked build as failure
[SpotBugs] Skipping execution of recorder since overall result is 'FAILURE'
Archiving artifacts
[Fast Archiver] Compressed 6.71 MB of artifacts by 45.1% relative to #104
Skipping publisher since build result is FAILURE
Recording test results

---------------------------------------------------------------------
To unsubscribe, e-mail: [hidden email]
For additional commands, e-mail: [hidden email]

Reply | Threaded
Open this post in threaded view
|

Build failed in Jenkins: POI » POI-DSL-Windows-1.8 #110

Apache Jenkins Server
See <https://ci-builds.apache.org/job/POI/job/POI-DSL-Windows-1.8/110/display/redirect?page=changes>

Changes:

[Andreas Beeker] fix small typo on main page

[PJ Fanning] add fastexcel lib to related projects

[PJ Fanning] gradle 6.8

[PJ Fanning] gradle 6.8

[PJ Fanning] [github-215] Improve Performance of OperandResolver#parseDouble. Thanks to Robert Wenzel. This closes #215


------------------------------------------
[...truncated 308.09 KB...]
     [echo] Tests run: 98, Failures: 0, Aborted: 0, Skipped: 0, Time elapsed: 0.069000 sec
     [echo] Ran org.apache.poi.ss.formula.functions.TestIndirect
     [echo] Tests run: 3, Failures: 0, Aborted: 0, Skipped: 0, Time elapsed: 0.006000 sec
     [echo] Ran org.apache.poi.ss.formula.functions.TestIndirectFunctionFromSpreadsheet
     [echo] Tests run: 11, Failures: 0, Aborted: 0, Skipped: 0, Time elapsed: 0.008000 sec
     [echo] Ran org.apache.poi.ss.formula.functions.TestIntercept
     [echo] Tests run: 4, Failures: 0, Aborted: 0, Skipped: 0, Time elapsed: 0.003000 sec
     [echo] Ran org.apache.poi.ss.formula.functions.TestIrr
     [echo] Tests run: 3, Failures: 0, Aborted: 0, Skipped: 0, Time elapsed: 0.003000 sec
     [echo] Ran org.apache.poi.ss.formula.functions.TestIsBlank
     [echo] Tests run: 1, Failures: 0, Aborted: 0, Skipped: 0, Time elapsed: 0.001000 sec
     [echo] Ran org.apache.poi.ss.formula.functions.TestLeftRight
     [echo] Tests run: 2, Failures: 0, Aborted: 0, Skipped: 0, Time elapsed: 0.000000 sec
     [echo] Ran org.apache.poi.ss.formula.functions.TestLen
     [echo] Tests run: 3, Failures: 0, Aborted: 0, Skipped: 0, Time elapsed: 0.001000 sec
     [echo] Ran org.apache.poi.ss.formula.functions.TestLogicalFunction
     [echo] Tests run: 2, Failures: 0, Aborted: 0, Skipped: 0, Time elapsed: 0.001000 sec
     [echo] Ran org.apache.poi.ss.formula.functions.TestLogicalFunctionsFromSpreadsheet
     [echo] Tests run: 15, Failures: 0, Aborted: 0, Skipped: 0, Time elapsed: 0.011000 sec
     [echo] Ran org.apache.poi.ss.formula.functions.TestLookupFunctionsFromSpreadsheet
     [echo] Tests run: 205, Failures: 0, Aborted: 0, Skipped: 0, Time elapsed: 0.155000 sec
     [echo] Ran org.apache.poi.ss.formula.functions.TestMatch
     [echo] Tests run: 9, Failures: 0, Aborted: 0, Skipped: 0, Time elapsed: 0.004000 sec
     [echo] Ran org.apache.poi.ss.formula.functions.TestMatchFunctionsFromSpreadsheet
     [echo] Tests run: 14, Failures: 0, Aborted: 0, Skipped: 0, Time elapsed: 0.007000 sec
     [echo] Ran org.apache.poi.ss.formula.functions.TestMathX
     [echo] Tests run: 23, Failures: 0, Aborted: 0, Skipped: 0, Time elapsed: 0.006000 sec
     [echo] Ran org.apache.poi.ss.formula.functions.TestMid
     [echo] Tests run: 4, Failures: 0, Aborted: 0, Skipped: 0, Time elapsed: 0.001000 sec
     [echo] Ran org.apache.poi.ss.formula.functions.TestMirr
     [echo] Tests run: 4, Failures: 0, Aborted: 0, Skipped: 0, Time elapsed: 0.004000 sec
     [echo] Ran org.apache.poi.ss.formula.functions.TestMultiOperandNumericFunction
     [echo] Tests run: 3, Failures: 0, Aborted: 0, Skipped: 0, Time elapsed: 0.001000 sec
     [echo] Ran org.apache.poi.ss.formula.functions.TestNper
     [echo] Tests run: 2, Failures: 0, Aborted: 0, Skipped: 0, Time elapsed: 0.001000 sec
     [echo] Ran org.apache.poi.ss.formula.functions.TestNpv
     [echo] Tests run: 2, Failures: 0, Aborted: 0, Skipped: 0, Time elapsed: 0.003000 sec
     [echo] Ran org.apache.poi.ss.formula.functions.TestOct2Dec
     [echo] Tests run: 2, Failures: 0, Aborted: 0, Skipped: 0, Time elapsed: 0.001000 sec
     [echo] Ran org.apache.poi.ss.formula.functions.TestOffset
     [echo] Tests run: 21, Failures: 0, Aborted: 0, Skipped: 0, Time elapsed: 0.008000 sec
     [echo] Ran org.apache.poi.ss.formula.functions.TestPPMT
     [echo] Tests run: 1, Failures: 0, Aborted: 0, Skipped: 0, Time elapsed: 0.001000 sec
     [echo] Ran org.apache.poi.ss.formula.functions.TestPmt
     [echo] Tests run: 2, Failures: 0, Aborted: 0, Skipped: 0, Time elapsed: 0.000000 sec
     [echo] Ran org.apache.poi.ss.formula.functions.TestPoisson
     [echo] Tests run: 6, Failures: 0, Aborted: 0, Skipped: 0, Time elapsed: 0.000000 sec
     [echo] Ran org.apache.poi.ss.formula.functions.TestProduct
     [echo] Tests run: 4, Failures: 0, Aborted: 0, Skipped: 0, Time elapsed: 0.001000 sec
     [echo] Ran org.apache.poi.ss.formula.functions.TestQuotient
     [echo] Tests run: 2, Failures: 0, Aborted: 0, Skipped: 0, Time elapsed: 0.001000 sec
     [echo] Ran org.apache.poi.ss.formula.functions.TestQuotientFunctionsFromSpreadsheet
     [echo] Tests run: 8, Failures: 0, Aborted: 0, Skipped: 0, Time elapsed: 0.005000 sec
     [echo] Ran org.apache.poi.ss.formula.functions.TestRank
     [echo] Tests run: 1, Failures: 0, Aborted: 0, Skipped: 0, Time elapsed: 0.003000 sec
     [echo] Ran org.apache.poi.ss.formula.functions.TestRelationalOperations
     [echo] Tests run: 5, Failures: 0, Aborted: 0, Skipped: 0, Time elapsed: 0.001000 sec
     [echo] Ran org.apache.poi.ss.formula.functions.TestReptFunctionsFromSpreadsheet
     [echo] Tests run: 5, Failures: 0, Aborted: 0, Skipped: 0, Time elapsed: 0.006000 sec
     [echo] Ran org.apache.poi.ss.formula.functions.TestRomanFunctionsFromSpreadsheet
     [echo] Tests run: 35, Failures: 0, Aborted: 0, Skipped: 0, Time elapsed: 0.013000 sec
     [echo] Ran org.apache.poi.ss.formula.functions.TestRoundFuncs
     [echo] Tests run: 5, Failures: 0, Aborted: 0, Skipped: 1, Time elapsed: 0.001000 sec
     [echo] Ran org.apache.poi.ss.formula.functions.TestRowCol
     [echo] Tests run: 4, Failures: 0, Aborted: 0, Skipped: 0, Time elapsed: 0.001000 sec
     [echo] Ran org.apache.poi.ss.formula.functions.TestSlope
     [echo] Tests run: 3, Failures: 0, Aborted: 0, Skipped: 0, Time elapsed: 0.002000 sec
     [echo] Ran org.apache.poi.ss.formula.functions.TestStatsLib
     [echo] Tests run: 8, Failures: 0, Aborted: 0, Skipped: 0, Time elapsed: 0.002000 sec
     [echo] Ran org.apache.poi.ss.formula.functions.TestSubstitute
     [echo] Tests run: 5, Failures: 0, Aborted: 0, Skipped: 0, Time elapsed: 0.001000 sec
     [echo] Ran org.apache.poi.ss.formula.functions.TestSubtotal
     [echo] Tests run: 11, Failures: 0, Aborted: 0, Skipped: 0, Time elapsed: 0.007000 sec
     [echo] Ran org.apache.poi.ss.formula.functions.TestSumif
     [echo] Tests run: 3, Failures: 0, Aborted: 0, Skipped: 0, Time elapsed: 0.001000 sec
     [echo] Ran org.apache.poi.ss.formula.functions.TestSumifs
     [echo] Tests run: 7, Failures: 0, Aborted: 0, Skipped: 0, Time elapsed: 0.005000 sec
     [echo] Ran org.apache.poi.ss.formula.functions.TestSumproduct
     [echo] Tests run: 5, Failures: 0, Aborted: 0, Skipped: 0, Time elapsed: 0.001000 sec
     [echo] Ran org.apache.poi.ss.formula.functions.TestTFunc
     [echo] Tests run: 5, Failures: 0, Aborted: 0, Skipped: 0, Time elapsed: 0.001000 sec
     [echo] Ran org.apache.poi.ss.formula.functions.TestText
     [echo] Tests run: 4, Failures: 0, Aborted: 0, Skipped: 0, Time elapsed: 0.003000 sec
     [echo] Ran org.apache.poi.ss.formula.functions.TestTime
     [echo] Tests run: 2, Failures: 0, Aborted: 0, Skipped: 0, Time elapsed: 0.004000 sec
     [echo] Ran org.apache.poi.ss.formula.functions.TestTrendFunctionsFromSpreadsheet
     [echo] Tests run: 41, Failures: 0, Aborted: 0, Skipped: 0, Time elapsed: 0.030000 sec
     [echo] Ran org.apache.poi.ss.formula.functions.TestTrim
     [echo] Tests run: 3, Failures: 0, Aborted: 0, Skipped: 0, Time elapsed: 0.001000 sec
     [echo] Ran org.apache.poi.ss.formula.functions.TestTrunc
     [echo] Tests run: 7, Failures: 0, Aborted: 0, Skipped: 0, Time elapsed: 0.001000 sec
     [echo] Ran org.apache.poi.ss.formula.functions.TestTwoOperandNumericFunctionsFromSpreadsheet
     [echo] Tests run: 34, Failures: 0, Aborted: 0, Skipped: 0, Time elapsed: 0.028000 sec
     [echo] Ran org.apache.poi.ss.formula.functions.TestValue
     [echo] Tests run: 2, Failures: 0, Aborted: 0, Skipped: 0, Time elapsed: 0.001000 sec
     [echo] Ran org.apache.poi.ss.formula.functions.TestWeekNumFunctionsFromSpreadsheet
     [echo] Tests run: 7, Failures: 0, Aborted: 0, Skipped: 0, Time elapsed: 0.006000 sec
     [echo] Ran org.apache.poi.ss.formula.functions.TestWeekNumFunctionsFromSpreadsheet2013
     [echo] Tests run: 7, Failures: 0, Aborted: 0, Skipped: 0, Time elapsed: 0.006000 sec
     [echo] Ran org.apache.poi.ss.formula.functions.TestWeekdayFunc
     [echo] Tests run: 2, Failures: 0, Aborted: 0, Skipped: 0, Time elapsed: 0.002000 sec
     [echo] Ran org.apache.poi.ss.formula.functions.TestXYNumericFunction
     [echo] Tests run: 3, Failures: 0, Aborted: 0, Skipped: 0, Time elapsed: 0.002000 sec
     [echo] Ran org.apache.poi.ss.formula.ptg.TestAbstractFunctionPtg
     [echo] Tests run: 3, Failures: 0, Aborted: 0, Skipped: 0, Time elapsed: 0.001000 sec
     [echo] Ran org.apache.poi.ss.formula.ptg.TestArea3DPtg
     [echo] Tests run: 1, Failures: 0, Aborted: 0, Skipped: 0, Time elapsed: 0.000000 sec
     [echo] Ran org.apache.poi.ss.formula.ptg.TestAreaErrPtg
     [echo] Tests run: 1, Failures: 0, Aborted: 0, Skipped: 0, Time elapsed: 0.001000 sec
     [echo] Ran org.apache.poi.ss.formula.ptg.TestAreaPtg
     [echo] Tests run: 5, Failures: 0, Aborted: 0, Skipped: 0, Time elapsed: 0.002000 sec
     [echo] Ran org.apache.poi.ss.formula.ptg.TestArrayPtg
     [echo] Tests run: 5, Failures: 0, Aborted: 0, Skipped: 0, Time elapsed: 0.002000 sec
     [echo] Ran org.apache.poi.ss.formula.ptg.TestAttrPtg
     [echo] Tests run: 1, Failures: 0, Aborted: 0, Skipped: 0, Time elapsed: 0.000000 sec
     [echo] Ran org.apache.poi.ss.formula.ptg.TestErrPtg
     [echo] Tests run: 1, Failures: 0, Aborted: 0, Skipped: 0, Time elapsed: 0.001000 sec
     [echo] Ran org.apache.poi.ss.formula.ptg.TestExternalFunctionFormulas
     [echo] Tests run: 3, Failures: 0, Aborted: 0, Skipped: 0, Time elapsed: 0.003000 sec
     [echo] Ran org.apache.poi.ss.formula.ptg.TestExternalNameReference
     [echo] Tests run: 3, Failures: 0, Aborted: 0, Skipped: 0, Time elapsed: 0.004000 sec
     [echo] Ran org.apache.poi.ss.formula.ptg.TestFuncPtg
     [echo] Tests run: 2, Failures: 0, Aborted: 0, Skipped: 0, Time elapsed: 0.000000 sec
     [echo] Ran org.apache.poi.ss.formula.ptg.TestFuncVarPtg
     [echo] Tests run: 1, Failures: 0, Aborted: 0, Skipped: 0, Time elapsed: 0.000000 sec
     [echo] Ran org.apache.poi.ss.formula.ptg.TestIntersectionPtg
     [echo] Tests run: 1, Failures: 0, Aborted: 0, Skipped: 0, Time elapsed: 0.001000 sec
     [echo] Ran org.apache.poi.ss.formula.ptg.TestPercentPtg
     [echo] Tests run: 1, Failures: 0, Aborted: 0, Skipped: 0, Time elapsed: 0.001000 sec
     [echo] Ran org.apache.poi.ss.formula.ptg.TestRangePtg
     [echo] Tests run: 1, Failures: 0, Aborted: 0, Skipped: 0, Time elapsed: 0.001000 sec
     [echo] Ran org.apache.poi.ss.formula.ptg.TestRef3DPtg
     [echo] Tests run: 1, Failures: 0, Aborted: 0, Skipped: 0, Time elapsed: 0.001000 sec
     [echo] Ran org.apache.poi.ss.formula.ptg.TestReferencePtg
     [echo] Tests run: 4, Failures: 0, Aborted: 0, Skipped: 0, Time elapsed: 0.007000 sec
     [echo] Ran org.apache.poi.ss.formula.ptg.TestUnionPtg
     [echo] Tests run: 1, Failures: 0, Aborted: 0, Skipped: 0, Time elapsed: 0.001000 sec
     [echo] Ran org.apache.poi.ss.formula.udf.TestAggregatingUDFFinder
     [echo] Tests run: 2, Failures: 0, Aborted: 0, Skipped: 0, Time elapsed: 0.001000 sec
     [echo] Ran org.apache.poi.ss.formula.udf.TestDefaultUDFFinder
     [echo] Tests run: 1, Failures: 0, Aborted: 0, Skipped: 0, Time elapsed: 0.001000 sec
     [echo] Ran org.apache.poi.ss.usermodel.TestDataFormatter
     [echo] Tests run: 37, Failures: 0, Aborted: 0, Skipped: 1, Time elapsed: 0.386000 sec
     [echo] Ran org.apache.poi.ss.usermodel.TestDateUtil
     [echo] Tests run: 26, Failures: 0, Aborted: 0, Skipped: 0, Time elapsed: 0.013000 sec
     [echo] Ran org.apache.poi.ss.usermodel.TestExcelStyleDateFormatter
     [echo] Tests run: 123, Failures: 0, Aborted: 0, Skipped: 0, Time elapsed: 0.059000 sec
     [echo] Ran org.apache.poi.ss.usermodel.TestFractionFormat
     [echo] Tests run: 5, Failures: 0, Aborted: 0, Skipped: 1, Time elapsed: 0.181000 sec
     [echo] Ran org.apache.poi.ss.usermodel.TestHSSFBorderStyle
     [echo] Tests run: 1, Failures: 0, Aborted: 0, Skipped: 0, Time elapsed: 0.001000 sec
     [echo] Ran org.apache.poi.ss.usermodel.TestIndexedColors
     [echo] Tests run: 3, Failures: 0, Aborted: 0, Skipped: 0, Time elapsed: 0.001000 sec
     [echo] Ran org.apache.poi.ss.util.TestAreaReference
     [echo] Tests run: 3, Failures: 0, Aborted: 0, Skipped: 0, Time elapsed: 0.001000 sec
     [echo] Ran org.apache.poi.ss.util.TestCellAddress
     [echo] Tests run: 6, Failures: 0, Aborted: 0, Skipped: 0, Time elapsed: 0.000000 sec
     [echo] Ran org.apache.poi.ss.util.TestCellRangeAddress
     [echo] Tests run: 14, Failures: 0, Aborted: 0, Skipped: 0, Time elapsed: 0.004000 sec
     [echo] Ran org.apache.poi.ss.util.TestCellRangeUtil
     [echo] Tests run: 1, Failures: 0, Aborted: 0, Skipped: 0, Time elapsed: 0.001000 sec
     [echo] Ran org.apache.poi.ss.util.TestCellReference
     [echo] Tests run: 27, Failures: 0, Aborted: 0, Skipped: 0, Time elapsed: 0.300000 sec
     [echo] Ran org.apache.poi.ss.util.TestDateFormatConverter
     [echo] Tests run: 18, Failures: 0, Aborted: 0, Skipped: 0, Time elapsed: 1.380000 sec
     [echo] Ran org.apache.poi.ss.util.TestDateParser
     [echo] Tests run: 5, Failures: 0, Aborted: 0, Skipped: 0, Time elapsed: 0.004000 sec
     [echo] Ran org.apache.poi.ss.util.TestExpandedDouble
     [echo] Tests run: 18, Failures: 0, Aborted: 0, Skipped: 0, Time elapsed: 0.010000 sec
     [echo] Ran org.apache.poi.ss.util.TestHSSFCellUtil
     [echo] Tests run: 14, Failures: 0, Aborted: 0, Skipped: 0, Time elapsed: 0.011000 sec
     [echo] Ran org.apache.poi.ss.util.TestNumberComparer
     [echo] Tests run: 115, Failures: 0, Aborted: 0, Skipped: 0, Time elapsed: 0.082000 sec
     [echo] Ran org.apache.poi.ss.util.TestNumberToTextConverter
     [echo] Tests run: 2, Failures: 0, Aborted: 0, Skipped: 0, Time elapsed: 0.010000 sec
     [echo] Ran org.apache.poi.ss.util.TestPropertyTemplate
     [echo] Tests run: 8, Failures: 0, Aborted: 0, Skipped: 0, Time elapsed: 0.021000 sec
     [echo] Ran org.apache.poi.ss.util.TestRegionUtil
     [echo] Tests run: 10, Failures: 0, Aborted: 0, Skipped: 0, Time elapsed: 0.015000 sec
     [echo] Ran org.apache.poi.ss.util.TestSheetBuilder
     [echo] Tests run: 3, Failures: 0, Aborted: 0, Skipped: 0, Time elapsed: 0.002000 sec
     [echo] Ran org.apache.poi.ss.util.TestSheetUtil
     [echo] Tests run: 7, Failures: 0, Aborted: 0, Skipped: 0, Time elapsed: 0.003000 sec
     [echo] Ran org.apache.poi.ss.util.TestWorkbookUtil
     [echo] Tests run: 1, Failures: 0, Aborted: 0, Skipped: 0, Time elapsed: 0.001000 sec
     [echo] Ran org.apache.poi.ss.util.cellwalk.TestCellWalk
     [echo] Tests run: 1, Failures: 0, Aborted: 0, Skipped: 0, Time elapsed: 0.003000 sec
     [echo] Ran org.apache.poi.util.TestArrayUtil
     [echo] Tests run: 1, Failures: 0, Aborted: 0, Skipped: 0, Time elapsed: 0.003000 sec
     [echo] Ran org.apache.poi.util.TestBitField
     [echo] Tests run: 16, Failures: 0, Aborted: 0, Skipped: 0, Time elapsed: 0.003000 sec
     [echo] Ran org.apache.poi.util.TestByteField
     [echo] Tests run: 5, Failures: 0, Aborted: 0, Skipped: 0, Time elapsed: 0.002000 sec
     [echo] Ran org.apache.poi.util.TestHexDump
     [echo] Tests run: 8, Failures: 0, Aborted: 0, Skipped: 0, Time elapsed: 0.021000 sec
     [echo] Ran org.apache.poi.util.TestIOUtils
     [echo] Tests run: 36, Failures: 0, Aborted: 0, Skipped: 0, Time elapsed: 0.067000 sec
     [echo] Ran org.apache.poi.util.TestIntList
     [echo] Tests run: 19, Failures: 0, Aborted: 0, Skipped: 0, Time elapsed: 0.082000 sec
     [echo] Ran org.apache.poi.util.TestIntegerField
     [echo] Tests run: 5, Failures: 0, Aborted: 0, Skipped: 0, Time elapsed: 0.003000 sec
     [echo] Ran org.apache.poi.util.TestLittleEndian
     [echo] Tests run: 15, Failures: 0, Aborted: 0, Skipped: 0, Time elapsed: 0.004000 sec
     [echo] Ran org.apache.poi.util.TestLittleEndianStreams
     [echo] Tests run: 5, Failures: 0, Aborted: 0, Skipped: 0, Time elapsed: 0.001000 sec
     [echo] Ran org.apache.poi.util.TestLocaleUtil
     [echo] Tests run: 3, Failures: 0, Aborted: 0, Skipped: 0, Time elapsed: 0.000000 sec
     [echo] Ran org.apache.poi.util.TestLongField
     [echo] Tests run: 5, Failures: 0, Aborted: 0, Skipped: 0, Time elapsed: 0.002000 sec
     [echo] Ran org.apache.poi.util.TestPOILogger
     [echo] Tests run: 1, Failures: 0, Aborted: 0, Skipped: 0, Time elapsed: 0.001000 sec
     [echo] Ran org.apache.poi.util.TestRLEDecompressingInputStream
     [echo] Tests run: 4, Failures: 0, Aborted: 0, Skipped: 0, Time elapsed: 0.001000 sec
     [echo] Ran org.apache.poi.util.TestShortField
     [echo] Tests run: 5, Failures: 0, Aborted: 0, Skipped: 0, Time elapsed: 0.001000 sec
     [echo] Ran org.apache.poi.util.TestStringCodepointsIterable
     [echo] Tests run: 1, Failures: 0, Aborted: 0, Skipped: 0, Time elapsed: 0.001000 sec
     [echo] Ran org.apache.poi.util.TestStringUtil
     [echo] Tests run: 7, Failures: 0, Aborted: 0, Skipped: 0, Time elapsed: 0.002000 sec
     [echo] Ran org.apache.poi.util.TestTempFile
     [echo] Tests run: 4, Failures: 0, Aborted: 0, Skipped: 0, Time elapsed: 0.009000 sec
     [echo] Ran org.apache.poi.util.TestXMLHelper
     [echo] Tests run: 8, Failures: 0, Aborted: 0, Skipped: 0, Time elapsed: 0.326000 sec

-test-excelant-write-testfile:

test:

compile-integration:
    [javac] Compiling 28 source files to <https://ci-builds.apache.org/job/POI/job/POI-DSL-Windows-1.8/ws/build\integration-test-classes>
    [javac] Support for javac --release has been added in Java9 ignoring it
    [mkdir] Created dir: <https://ci-builds.apache.org/job/POI/job/POI-DSL-Windows-1.8/ws/build\integration-test-classes\META-INF\versions\9>
      [jar] Building jar: <https://ci-builds.apache.org/job/POI/job/POI-DSL-Windows-1.8/ws/build\dist\maven\poi-integration\poi-integration-5.0.1-SNAPSHOT.jar>

-test-integration-check:

test-integration:

BUILD FAILED
<https://ci-builds.apache.org/job/POI/job/POI-DSL-Windows-1.8/ws/build.xml>:1709: The following error occurred while executing this line:
<https://ci-builds.apache.org/job/POI/job/POI-DSL-Windows-1.8/ws/build.xml>:1256: Some test(s) have failure(s)

Total time: 25 minutes 22 seconds
Build step 'Invoke Ant' marked build as failure
[SpotBugs] Skipping execution of recorder since overall result is 'FAILURE'
Archiving artifacts
[Fast Archiver] Compressed 7.25 MB of artifacts by 41.8% relative to #104
Skipping publisher since build result is FAILURE
Recording test results

---------------------------------------------------------------------
To unsubscribe, e-mail: [hidden email]
For additional commands, e-mail: [hidden email]

Reply | Threaded
Open this post in threaded view
|

Build failed in Jenkins: POI » POI-DSL-Windows-1.8 #111

Apache Jenkins Server
See <https://ci-builds.apache.org/job/POI/job/POI-DSL-Windows-1.8/111/display/redirect?page=changes>

Changes:

[Andreas Beeker] typo

[Andreas Beeker] apply @announce comments

[Andreas Beeker] limit junit concurrent threads to 3 (fixed amount)

[Alain Béarez] Bug 65016 - Creating a chart throws exception

[Andreas Beeker] github-211 - Revert addRow to behaviour before 4.1.2


------------------------------------------
[...truncated 307.69 KB...]
     [echo] Tests run: 98, Failures: 0, Aborted: 0, Skipped: 0, Time elapsed: 0.071000 sec
     [echo] Ran org.apache.poi.ss.formula.functions.TestIndirect
     [echo] Tests run: 3, Failures: 0, Aborted: 0, Skipped: 0, Time elapsed: 0.004000 sec
     [echo] Ran org.apache.poi.ss.formula.functions.TestIndirectFunctionFromSpreadsheet
     [echo] Tests run: 11, Failures: 0, Aborted: 0, Skipped: 0, Time elapsed: 0.008000 sec
     [echo] Ran org.apache.poi.ss.formula.functions.TestIntercept
     [echo] Tests run: 4, Failures: 0, Aborted: 0, Skipped: 0, Time elapsed: 0.003000 sec
     [echo] Ran org.apache.poi.ss.formula.functions.TestIrr
     [echo] Tests run: 3, Failures: 0, Aborted: 0, Skipped: 0, Time elapsed: 0.003000 sec
     [echo] Ran org.apache.poi.ss.formula.functions.TestIsBlank
     [echo] Tests run: 1, Failures: 0, Aborted: 0, Skipped: 0, Time elapsed: 0.001000 sec
     [echo] Ran org.apache.poi.ss.formula.functions.TestLeftRight
     [echo] Tests run: 2, Failures: 0, Aborted: 0, Skipped: 0, Time elapsed: 0.000000 sec
     [echo] Ran org.apache.poi.ss.formula.functions.TestLen
     [echo] Tests run: 3, Failures: 0, Aborted: 0, Skipped: 0, Time elapsed: 0.001000 sec
     [echo] Ran org.apache.poi.ss.formula.functions.TestLogicalFunction
     [echo] Tests run: 2, Failures: 0, Aborted: 0, Skipped: 0, Time elapsed: 0.001000 sec
     [echo] Ran org.apache.poi.ss.formula.functions.TestLogicalFunctionsFromSpreadsheet
     [echo] Tests run: 15, Failures: 0, Aborted: 0, Skipped: 0, Time elapsed: 0.006000 sec
     [echo] Ran org.apache.poi.ss.formula.functions.TestLookupFunctionsFromSpreadsheet
     [echo] Tests run: 205, Failures: 0, Aborted: 0, Skipped: 0, Time elapsed: 0.096000 sec
     [echo] Ran org.apache.poi.ss.formula.functions.TestMatch
     [echo] Tests run: 9, Failures: 0, Aborted: 0, Skipped: 0, Time elapsed: 0.003000 sec
     [echo] Ran org.apache.poi.ss.formula.functions.TestMatchFunctionsFromSpreadsheet
     [echo] Tests run: 14, Failures: 0, Aborted: 0, Skipped: 0, Time elapsed: 0.005000 sec
     [echo] Ran org.apache.poi.ss.formula.functions.TestMathX
     [echo] Tests run: 23, Failures: 0, Aborted: 0, Skipped: 0, Time elapsed: 0.004000 sec
     [echo] Ran org.apache.poi.ss.formula.functions.TestMid
     [echo] Tests run: 4, Failures: 0, Aborted: 0, Skipped: 0, Time elapsed: 0.001000 sec
     [echo] Ran org.apache.poi.ss.formula.functions.TestMirr
     [echo] Tests run: 4, Failures: 0, Aborted: 0, Skipped: 0, Time elapsed: 0.002000 sec
     [echo] Ran org.apache.poi.ss.formula.functions.TestMultiOperandNumericFunction
     [echo] Tests run: 3, Failures: 0, Aborted: 0, Skipped: 0, Time elapsed: 0.001000 sec
     [echo] Ran org.apache.poi.ss.formula.functions.TestNper
     [echo] Tests run: 2, Failures: 0, Aborted: 0, Skipped: 0, Time elapsed: 0.000000 sec
     [echo] Ran org.apache.poi.ss.formula.functions.TestNpv
     [echo] Tests run: 2, Failures: 0, Aborted: 0, Skipped: 0, Time elapsed: 0.002000 sec
     [echo] Ran org.apache.poi.ss.formula.functions.TestOct2Dec
     [echo] Tests run: 2, Failures: 0, Aborted: 0, Skipped: 0, Time elapsed: 0.000000 sec
     [echo] Ran org.apache.poi.ss.formula.functions.TestOffset
     [echo] Tests run: 21, Failures: 0, Aborted: 0, Skipped: 0, Time elapsed: 0.006000 sec
     [echo] Ran org.apache.poi.ss.formula.functions.TestPPMT
     [echo] Tests run: 1, Failures: 0, Aborted: 0, Skipped: 0, Time elapsed: 0.001000 sec
     [echo] Ran org.apache.poi.ss.formula.functions.TestPmt
     [echo] Tests run: 2, Failures: 0, Aborted: 0, Skipped: 0, Time elapsed: 0.001000 sec
     [echo] Ran org.apache.poi.ss.formula.functions.TestPoisson
     [echo] Tests run: 6, Failures: 0, Aborted: 0, Skipped: 0, Time elapsed: 0.001000 sec
     [echo] Ran org.apache.poi.ss.formula.functions.TestProduct
     [echo] Tests run: 4, Failures: 0, Aborted: 0, Skipped: 0, Time elapsed: 0.000000 sec
     [echo] Ran org.apache.poi.ss.formula.functions.TestQuotient
     [echo] Tests run: 2, Failures: 0, Aborted: 0, Skipped: 0, Time elapsed: 0.001000 sec
     [echo] Ran org.apache.poi.ss.formula.functions.TestQuotientFunctionsFromSpreadsheet
     [echo] Tests run: 8, Failures: 0, Aborted: 0, Skipped: 0, Time elapsed: 0.004000 sec
     [echo] Ran org.apache.poi.ss.formula.functions.TestRank
     [echo] Tests run: 1, Failures: 0, Aborted: 0, Skipped: 0, Time elapsed: 0.002000 sec
     [echo] Ran org.apache.poi.ss.formula.functions.TestRelationalOperations
     [echo] Tests run: 5, Failures: 0, Aborted: 0, Skipped: 0, Time elapsed: 0.001000 sec
     [echo] Ran org.apache.poi.ss.formula.functions.TestReptFunctionsFromSpreadsheet
     [echo] Tests run: 5, Failures: 0, Aborted: 0, Skipped: 0, Time elapsed: 0.006000 sec
     [echo] Ran org.apache.poi.ss.formula.functions.TestRomanFunctionsFromSpreadsheet
     [echo] Tests run: 35, Failures: 0, Aborted: 0, Skipped: 0, Time elapsed: 0.017000 sec
     [echo] Ran org.apache.poi.ss.formula.functions.TestRoundFuncs
     [echo] Tests run: 5, Failures: 0, Aborted: 0, Skipped: 1, Time elapsed: 0.001000 sec
     [echo] Ran org.apache.poi.ss.formula.functions.TestRowCol
     [echo] Tests run: 4, Failures: 0, Aborted: 0, Skipped: 0, Time elapsed: 0.001000 sec
     [echo] Ran org.apache.poi.ss.formula.functions.TestSlope
     [echo] Tests run: 3, Failures: 0, Aborted: 0, Skipped: 0, Time elapsed: 0.001000 sec
     [echo] Ran org.apache.poi.ss.formula.functions.TestStatsLib
     [echo] Tests run: 8, Failures: 0, Aborted: 0, Skipped: 0, Time elapsed: 0.002000 sec
     [echo] Ran org.apache.poi.ss.formula.functions.TestSubstitute
     [echo] Tests run: 5, Failures: 0, Aborted: 0, Skipped: 0, Time elapsed: 0.001000 sec
     [echo] Ran org.apache.poi.ss.formula.functions.TestSubtotal
     [echo] Tests run: 11, Failures: 0, Aborted: 0, Skipped: 0, Time elapsed: 0.008000 sec
     [echo] Ran org.apache.poi.ss.formula.functions.TestSumif
     [echo] Tests run: 3, Failures: 0, Aborted: 0, Skipped: 0, Time elapsed: 0.001000 sec
     [echo] Ran org.apache.poi.ss.formula.functions.TestSumifs
     [echo] Tests run: 7, Failures: 0, Aborted: 0, Skipped: 0, Time elapsed: 0.003000 sec
     [echo] Ran org.apache.poi.ss.formula.functions.TestSumproduct
     [echo] Tests run: 5, Failures: 0, Aborted: 0, Skipped: 0, Time elapsed: 0.001000 sec
     [echo] Ran org.apache.poi.ss.formula.functions.TestTFunc
     [echo] Tests run: 5, Failures: 0, Aborted: 0, Skipped: 0, Time elapsed: 0.001000 sec
     [echo] Ran org.apache.poi.ss.formula.functions.TestText
     [echo] Tests run: 4, Failures: 0, Aborted: 0, Skipped: 0, Time elapsed: 0.002000 sec
     [echo] Ran org.apache.poi.ss.formula.functions.TestTime
     [echo] Tests run: 2, Failures: 0, Aborted: 0, Skipped: 0, Time elapsed: 0.003000 sec
     [echo] Ran org.apache.poi.ss.formula.functions.TestTrendFunctionsFromSpreadsheet
     [echo] Tests run: 41, Failures: 0, Aborted: 0, Skipped: 0, Time elapsed: 0.027000 sec
     [echo] Ran org.apache.poi.ss.formula.functions.TestTrim
     [echo] Tests run: 3, Failures: 0, Aborted: 0, Skipped: 0, Time elapsed: 0.001000 sec
     [echo] Ran org.apache.poi.ss.formula.functions.TestTrunc
     [echo] Tests run: 7, Failures: 0, Aborted: 0, Skipped: 0, Time elapsed: 0.001000 sec
     [echo] Ran org.apache.poi.ss.formula.functions.TestTwoOperandNumericFunctionsFromSpreadsheet
     [echo] Tests run: 34, Failures: 0, Aborted: 0, Skipped: 0, Time elapsed: 0.031000 sec
     [echo] Ran org.apache.poi.ss.formula.functions.TestValue
     [echo] Tests run: 2, Failures: 0, Aborted: 0, Skipped: 0, Time elapsed: 0.002000 sec
     [echo] Ran org.apache.poi.ss.formula.functions.TestWeekNumFunctionsFromSpreadsheet
     [echo] Tests run: 7, Failures: 0, Aborted: 0, Skipped: 0, Time elapsed: 0.004000 sec
     [echo] Ran org.apache.poi.ss.formula.functions.TestWeekNumFunctionsFromSpreadsheet2013
     [echo] Tests run: 7, Failures: 0, Aborted: 0, Skipped: 0, Time elapsed: 0.005000 sec
     [echo] Ran org.apache.poi.ss.formula.functions.TestWeekdayFunc
     [echo] Tests run: 2, Failures: 0, Aborted: 0, Skipped: 0, Time elapsed: 0.001000 sec
     [echo] Ran org.apache.poi.ss.formula.functions.TestXYNumericFunction
     [echo] Tests run: 3, Failures: 0, Aborted: 0, Skipped: 0, Time elapsed: 0.001000 sec
     [echo] Ran org.apache.poi.ss.formula.ptg.TestAbstractFunctionPtg
     [echo] Tests run: 3, Failures: 0, Aborted: 0, Skipped: 0, Time elapsed: 0.002000 sec
     [echo] Ran org.apache.poi.ss.formula.ptg.TestArea3DPtg
     [echo] Tests run: 1, Failures: 0, Aborted: 0, Skipped: 0, Time elapsed: 0.000000 sec
     [echo] Ran org.apache.poi.ss.formula.ptg.TestAreaErrPtg
     [echo] Tests run: 1, Failures: 0, Aborted: 0, Skipped: 0, Time elapsed: 0.001000 sec
     [echo] Ran org.apache.poi.ss.formula.ptg.TestAreaPtg
     [echo] Tests run: 5, Failures: 0, Aborted: 0, Skipped: 0, Time elapsed: 0.001000 sec
     [echo] Ran org.apache.poi.ss.formula.ptg.TestArrayPtg
     [echo] Tests run: 5, Failures: 0, Aborted: 0, Skipped: 0, Time elapsed: 0.003000 sec
     [echo] Ran org.apache.poi.ss.formula.ptg.TestAttrPtg
     [echo] Tests run: 1, Failures: 0, Aborted: 0, Skipped: 0, Time elapsed: 0.000000 sec
     [echo] Ran org.apache.poi.ss.formula.ptg.TestErrPtg
     [echo] Tests run: 1, Failures: 0, Aborted: 0, Skipped: 0, Time elapsed: 0.001000 sec
     [echo] Ran org.apache.poi.ss.formula.ptg.TestExternalFunctionFormulas
     [echo] Tests run: 3, Failures: 0, Aborted: 0, Skipped: 0, Time elapsed: 0.003000 sec
     [echo] Ran org.apache.poi.ss.formula.ptg.TestExternalNameReference
     [echo] Tests run: 3, Failures: 0, Aborted: 0, Skipped: 0, Time elapsed: 0.003000 sec
     [echo] Ran org.apache.poi.ss.formula.ptg.TestFuncPtg
     [echo] Tests run: 2, Failures: 0, Aborted: 0, Skipped: 0, Time elapsed: 0.001000 sec
     [echo] Ran org.apache.poi.ss.formula.ptg.TestFuncVarPtg
     [echo] Tests run: 1, Failures: 0, Aborted: 0, Skipped: 0, Time elapsed: 0.000000 sec
     [echo] Ran org.apache.poi.ss.formula.ptg.TestIntersectionPtg
     [echo] Tests run: 1, Failures: 0, Aborted: 0, Skipped: 0, Time elapsed: 0.001000 sec
     [echo] Ran org.apache.poi.ss.formula.ptg.TestPercentPtg
     [echo] Tests run: 1, Failures: 0, Aborted: 0, Skipped: 0, Time elapsed: 0.001000 sec
     [echo] Ran org.apache.poi.ss.formula.ptg.TestRangePtg
     [echo] Tests run: 1, Failures: 0, Aborted: 0, Skipped: 0, Time elapsed: 0.001000 sec
     [echo] Ran org.apache.poi.ss.formula.ptg.TestRef3DPtg
     [echo] Tests run: 1, Failures: 0, Aborted: 0, Skipped: 0, Time elapsed: 0.001000 sec
     [echo] Ran org.apache.poi.ss.formula.ptg.TestReferencePtg
     [echo] Tests run: 4, Failures: 0, Aborted: 0, Skipped: 0, Time elapsed: 0.012000 sec
     [echo] Ran org.apache.poi.ss.formula.ptg.TestUnionPtg
     [echo] Tests run: 1, Failures: 0, Aborted: 0, Skipped: 0, Time elapsed: 0.001000 sec
     [echo] Ran org.apache.poi.ss.formula.udf.TestAggregatingUDFFinder
     [echo] Tests run: 2, Failures: 0, Aborted: 0, Skipped: 0, Time elapsed: 0.001000 sec
     [echo] Ran org.apache.poi.ss.formula.udf.TestDefaultUDFFinder
     [echo] Tests run: 1, Failures: 0, Aborted: 0, Skipped: 0, Time elapsed: 0.001000 sec
     [echo] Ran org.apache.poi.ss.usermodel.TestDataFormatter
     [echo] Tests run: 37, Failures: 0, Aborted: 0, Skipped: 1, Time elapsed: 0.405000 sec
     [echo] Ran org.apache.poi.ss.usermodel.TestDateUtil
     [echo] Tests run: 26, Failures: 0, Aborted: 0, Skipped: 0, Time elapsed: 0.014000 sec
     [echo] Ran org.apache.poi.ss.usermodel.TestExcelStyleDateFormatter
     [echo] Tests run: 123, Failures: 0, Aborted: 0, Skipped: 0, Time elapsed: 0.079000 sec
     [echo] Ran org.apache.poi.ss.usermodel.TestFractionFormat
     [echo] Tests run: 5, Failures: 0, Aborted: 0, Skipped: 1, Time elapsed: 0.309000 sec
     [echo] Ran org.apache.poi.ss.usermodel.TestHSSFBorderStyle
     [echo] Tests run: 1, Failures: 0, Aborted: 0, Skipped: 0, Time elapsed: 0.001000 sec
     [echo] Ran org.apache.poi.ss.usermodel.TestIndexedColors
     [echo] Tests run: 3, Failures: 0, Aborted: 0, Skipped: 0, Time elapsed: 0.002000 sec
     [echo] Ran org.apache.poi.ss.util.TestAreaReference
     [echo] Tests run: 3, Failures: 0, Aborted: 0, Skipped: 0, Time elapsed: 0.001000 sec
     [echo] Ran org.apache.poi.ss.util.TestCellAddress
     [echo] Tests run: 6, Failures: 0, Aborted: 0, Skipped: 0, Time elapsed: 0.001000 sec
     [echo] Ran org.apache.poi.ss.util.TestCellRangeAddress
     [echo] Tests run: 14, Failures: 0, Aborted: 0, Skipped: 0, Time elapsed: 0.006000 sec
     [echo] Ran org.apache.poi.ss.util.TestCellRangeUtil
     [echo] Tests run: 1, Failures: 0, Aborted: 0, Skipped: 0, Time elapsed: 0.000000 sec
     [echo] Ran org.apache.poi.ss.util.TestCellReference
     [echo] Tests run: 27, Failures: 0, Aborted: 0, Skipped: 0, Time elapsed: 0.296000 sec
     [echo] Ran org.apache.poi.ss.util.TestDateFormatConverter
     [echo] Tests run: 18, Failures: 0, Aborted: 0, Skipped: 0, Time elapsed: 1.217000 sec
     [echo] Ran org.apache.poi.ss.util.TestDateParser
     [echo] Tests run: 5, Failures: 0, Aborted: 0, Skipped: 0, Time elapsed: 0.007000 sec
     [echo] Ran org.apache.poi.ss.util.TestExpandedDouble
     [echo] Tests run: 18, Failures: 0, Aborted: 0, Skipped: 0, Time elapsed: 0.009000 sec
     [echo] Ran org.apache.poi.ss.util.TestHSSFCellUtil
     [echo] Tests run: 14, Failures: 0, Aborted: 0, Skipped: 0, Time elapsed: 0.015000 sec
     [echo] Ran org.apache.poi.ss.util.TestNumberComparer
     [echo] Tests run: 115, Failures: 0, Aborted: 0, Skipped: 0, Time elapsed: 0.067000 sec
     [echo] Ran org.apache.poi.ss.util.TestNumberToTextConverter
     [echo] Tests run: 2, Failures: 0, Aborted: 0, Skipped: 0, Time elapsed: 0.008000 sec
     [echo] Ran org.apache.poi.ss.util.TestPropertyTemplate
     [echo] Tests run: 8, Failures: 0, Aborted: 0, Skipped: 0, Time elapsed: 0.024000 sec
     [echo] Ran org.apache.poi.ss.util.TestRegionUtil
     [echo] Tests run: 10, Failures: 0, Aborted: 0, Skipped: 0, Time elapsed: 0.014000 sec
     [echo] Ran org.apache.poi.ss.util.TestSheetBuilder
     [echo] Tests run: 3, Failures: 0, Aborted: 0, Skipped: 0, Time elapsed: 0.002000 sec
     [echo] Ran org.apache.poi.ss.util.TestSheetUtil
     [echo] Tests run: 7, Failures: 0, Aborted: 0, Skipped: 0, Time elapsed: 0.004000 sec
     [echo] Ran org.apache.poi.ss.util.TestWorkbookUtil
     [echo] Tests run: 1, Failures: 0, Aborted: 0, Skipped: 0, Time elapsed: 0.001000 sec
     [echo] Ran org.apache.poi.ss.util.cellwalk.TestCellWalk
     [echo] Tests run: 1, Failures: 0, Aborted: 0, Skipped: 0, Time elapsed: 0.003000 sec
     [echo] Ran org.apache.poi.util.TestArrayUtil
     [echo] Tests run: 1, Failures: 0, Aborted: 0, Skipped: 0, Time elapsed: 0.002000 sec
     [echo] Ran org.apache.poi.util.TestBitField
     [echo] Tests run: 16, Failures: 0, Aborted: 0, Skipped: 0, Time elapsed: 0.002000 sec
     [echo] Ran org.apache.poi.util.TestByteField
     [echo] Tests run: 5, Failures: 0, Aborted: 0, Skipped: 0, Time elapsed: 0.002000 sec
     [echo] Ran org.apache.poi.util.TestHexDump
     [echo] Tests run: 8, Failures: 0, Aborted: 0, Skipped: 0, Time elapsed: 0.010000 sec
     [echo] Ran org.apache.poi.util.TestIOUtils
     [echo] Tests run: 36, Failures: 0, Aborted: 0, Skipped: 0, Time elapsed: 0.048000 sec
     [echo] Ran org.apache.poi.util.TestIntList
     [echo] Tests run: 19, Failures: 0, Aborted: 0, Skipped: 0, Time elapsed: 0.038000 sec
     [echo] Ran org.apache.poi.util.TestIntegerField
     [echo] Tests run: 5, Failures: 0, Aborted: 0, Skipped: 0, Time elapsed: 0.003000 sec
     [echo] Ran org.apache.poi.util.TestLittleEndian
     [echo] Tests run: 15, Failures: 0, Aborted: 0, Skipped: 0, Time elapsed: 0.003000 sec
     [echo] Ran org.apache.poi.util.TestLittleEndianStreams
     [echo] Tests run: 5, Failures: 0, Aborted: 0, Skipped: 0, Time elapsed: 0.001000 sec
     [echo] Ran org.apache.poi.util.TestLocaleUtil
     [echo] Tests run: 3, Failures: 0, Aborted: 0, Skipped: 0, Time elapsed: 0.001000 sec
     [echo] Ran org.apache.poi.util.TestLongField
     [echo] Tests run: 5, Failures: 0, Aborted: 0, Skipped: 0, Time elapsed: 0.001000 sec
     [echo] Ran org.apache.poi.util.TestPOILogger
     [echo] Tests run: 1, Failures: 0, Aborted: 0, Skipped: 0, Time elapsed: 0.000000 sec
     [echo] Ran org.apache.poi.util.TestRLEDecompressingInputStream
     [echo] Tests run: 4, Failures: 0, Aborted: 0, Skipped: 0, Time elapsed: 0.001000 sec
     [echo] Ran org.apache.poi.util.TestShortField
     [echo] Tests run: 5, Failures: 0, Aborted: 0, Skipped: 0, Time elapsed: 0.002000 sec
     [echo] Ran org.apache.poi.util.TestStringCodepointsIterable
     [echo] Tests run: 1, Failures: 0, Aborted: 0, Skipped: 0, Time elapsed: 0.001000 sec
     [echo] Ran org.apache.poi.util.TestStringUtil
     [echo] Tests run: 7, Failures: 0, Aborted: 0, Skipped: 0, Time elapsed: 0.001000 sec
     [echo] Ran org.apache.poi.util.TestTempFile
     [echo] Tests run: 4, Failures: 0, Aborted: 0, Skipped: 0, Time elapsed: 0.009000 sec
     [echo] Ran org.apache.poi.util.TestXMLHelper
     [echo] Tests run: 8, Failures: 0, Aborted: 0, Skipped: 0, Time elapsed: 0.313000 sec

-test-excelant-write-testfile:

test:

compile-integration:
    [javac] Compiling 28 source files to <https://ci-builds.apache.org/job/POI/job/POI-DSL-Windows-1.8/ws/build\integration-test-classes>
    [javac] Support for javac --release has been added in Java9 ignoring it
    [mkdir] Created dir: <https://ci-builds.apache.org/job/POI/job/POI-DSL-Windows-1.8/ws/build\integration-test-classes\META-INF\versions\9>
      [jar] Building jar: <https://ci-builds.apache.org/job/POI/job/POI-DSL-Windows-1.8/ws/build\dist\maven\poi-integration\poi-integration-5.0.1-SNAPSHOT.jar>

-test-integration-check:

test-integration:

BUILD FAILED
<https://ci-builds.apache.org/job/POI/job/POI-DSL-Windows-1.8/ws/build.xml>:1711: The following error occurred while executing this line:
<https://ci-builds.apache.org/job/POI/job/POI-DSL-Windows-1.8/ws/build.xml>:1256: Some test(s) have failure(s)

Total time: 21 minutes 14 seconds
Build step 'Invoke Ant' marked build as failure
[SpotBugs] Skipping execution of recorder since overall result is 'FAILURE'
Archiving artifacts
[Fast Archiver] Compressed 7.32 MB of artifacts by 41.4% relative to #104
Skipping publisher since build result is FAILURE
Recording test results

---------------------------------------------------------------------
To unsubscribe, e-mail: [hidden email]
For additional commands, e-mail: [hidden email]

Reply | Threaded
Open this post in threaded view
|

Build failed in Jenkins: POI » POI-DSL-Windows-1.8 #112

Apache Jenkins Server
See <https://ci-builds.apache.org/job/POI/job/POI-DSL-Windows-1.8/112/display/redirect?page=changes>

Changes:

[PJ Fanning] missing license

[Alain Béarez] Bug 64950: handle doughnut hole size

[PJ Fanning] [bug-65096] XLSX Streaming XML not correctly reading multiple inline Strings


------------------------------------------
[...truncated 287.20 KB...]
     [echo] Tests run: 98, Failures: 0, Aborted: 0, Skipped: 0, Time elapsed: 0.068000 sec
     [echo] Ran org.apache.poi.ss.formula.functions.TestIndirect
     [echo] Tests run: 3, Failures: 0, Aborted: 0, Skipped: 0, Time elapsed: 0.006000 sec
     [echo] Ran org.apache.poi.ss.formula.functions.TestIndirectFunctionFromSpreadsheet
     [echo] Tests run: 11, Failures: 0, Aborted: 0, Skipped: 0, Time elapsed: 0.008000 sec
     [echo] Ran org.apache.poi.ss.formula.functions.TestIntercept
     [echo] Tests run: 4, Failures: 0, Aborted: 0, Skipped: 0, Time elapsed: 0.002000 sec
     [echo] Ran org.apache.poi.ss.formula.functions.TestIrr
     [echo] Tests run: 3, Failures: 0, Aborted: 0, Skipped: 0, Time elapsed: 0.002000 sec
     [echo] Ran org.apache.poi.ss.formula.functions.TestIsBlank
     [echo] Tests run: 1, Failures: 0, Aborted: 0, Skipped: 0, Time elapsed: 0.001000 sec
     [echo] Ran org.apache.poi.ss.formula.functions.TestLeftRight
     [echo] Tests run: 2, Failures: 0, Aborted: 0, Skipped: 0, Time elapsed: 0.001000 sec
     [echo] Ran org.apache.poi.ss.formula.functions.TestLen
     [echo] Tests run: 3, Failures: 0, Aborted: 0, Skipped: 0, Time elapsed: 0.001000 sec
     [echo] Ran org.apache.poi.ss.formula.functions.TestLogicalFunction
     [echo] Tests run: 2, Failures: 0, Aborted: 0, Skipped: 0, Time elapsed: 0.001000 sec
     [echo] Ran org.apache.poi.ss.formula.functions.TestLogicalFunctionsFromSpreadsheet
     [echo] Tests run: 15, Failures: 0, Aborted: 0, Skipped: 0, Time elapsed: 0.007000 sec
     [echo] Ran org.apache.poi.ss.formula.functions.TestLookupFunctionsFromSpreadsheet
     [echo] Tests run: 205, Failures: 0, Aborted: 0, Skipped: 0, Time elapsed: 0.155000 sec
     [echo] Ran org.apache.poi.ss.formula.functions.TestMatch
     [echo] Tests run: 9, Failures: 0, Aborted: 0, Skipped: 0, Time elapsed: 0.004000 sec
     [echo] Ran org.apache.poi.ss.formula.functions.TestMatchFunctionsFromSpreadsheet
     [echo] Tests run: 14, Failures: 0, Aborted: 0, Skipped: 0, Time elapsed: 0.009000 sec
     [echo] Ran org.apache.poi.ss.formula.functions.TestMathX
     [echo] Tests run: 23, Failures: 0, Aborted: 0, Skipped: 0, Time elapsed: 0.007000 sec
     [echo] Ran org.apache.poi.ss.formula.functions.TestMid
     [echo] Tests run: 4, Failures: 0, Aborted: 0, Skipped: 0, Time elapsed: 0.001000 sec
     [echo] Ran org.apache.poi.ss.formula.functions.TestMirr
     [echo] Tests run: 4, Failures: 0, Aborted: 0, Skipped: 0, Time elapsed: 0.003000 sec
     [echo] Ran org.apache.poi.ss.formula.functions.TestMultiOperandNumericFunction
     [echo] Tests run: 3, Failures: 0, Aborted: 0, Skipped: 0, Time elapsed: 0.001000 sec
     [echo] Ran org.apache.poi.ss.formula.functions.TestNper
     [echo] Tests run: 2, Failures: 0, Aborted: 0, Skipped: 0, Time elapsed: 0.001000 sec
     [echo] Ran org.apache.poi.ss.formula.functions.TestNpv
     [echo] Tests run: 2, Failures: 0, Aborted: 0, Skipped: 0, Time elapsed: 0.002000 sec
     [echo] Ran org.apache.poi.ss.formula.functions.TestOct2Dec
     [echo] Tests run: 2, Failures: 0, Aborted: 0, Skipped: 0, Time elapsed: 0.001000 sec
     [echo] Ran org.apache.poi.ss.formula.functions.TestOffset
     [echo] Tests run: 21, Failures: 0, Aborted: 0, Skipped: 0, Time elapsed: 0.007000 sec
     [echo] Ran org.apache.poi.ss.formula.functions.TestPPMT
     [echo] Tests run: 1, Failures: 0, Aborted: 0, Skipped: 0, Time elapsed: 0.002000 sec
     [echo] Ran org.apache.poi.ss.formula.functions.TestPmt
     [echo] Tests run: 2, Failures: 0, Aborted: 0, Skipped: 0, Time elapsed: 0.000000 sec
     [echo] Ran org.apache.poi.ss.formula.functions.TestPoisson
     [echo] Tests run: 6, Failures: 0, Aborted: 0, Skipped: 0, Time elapsed: 0.001000 sec
     [echo] Ran org.apache.poi.ss.formula.functions.TestProduct
     [echo] Tests run: 4, Failures: 0, Aborted: 0, Skipped: 0, Time elapsed: 0.001000 sec
     [echo] Ran org.apache.poi.ss.formula.functions.TestQuotient
     [echo] Tests run: 2, Failures: 0, Aborted: 0, Skipped: 0, Time elapsed: 0.001000 sec
     [echo] Ran org.apache.poi.ss.formula.functions.TestQuotientFunctionsFromSpreadsheet
     [echo] Tests run: 8, Failures: 0, Aborted: 0, Skipped: 0, Time elapsed: 0.005000 sec
     [echo] Ran org.apache.poi.ss.formula.functions.TestRank
     [echo] Tests run: 1, Failures: 0, Aborted: 0, Skipped: 0, Time elapsed: 0.003000 sec
     [echo] Ran org.apache.poi.ss.formula.functions.TestRelationalOperations
     [echo] Tests run: 5, Failures: 0, Aborted: 0, Skipped: 0, Time elapsed: 0.002000 sec
     [echo] Ran org.apache.poi.ss.formula.functions.TestReptFunctionsFromSpreadsheet
     [echo] Tests run: 5, Failures: 0, Aborted: 0, Skipped: 0, Time elapsed: 0.004000 sec
     [echo] Ran org.apache.poi.ss.formula.functions.TestRomanFunctionsFromSpreadsheet
     [echo] Tests run: 35, Failures: 0, Aborted: 0, Skipped: 0, Time elapsed: 0.010000 sec
     [echo] Ran org.apache.poi.ss.formula.functions.TestRoundFuncs
     [echo] Tests run: 5, Failures: 0, Aborted: 0, Skipped: 1, Time elapsed: 0.001000 sec
     [echo] Ran org.apache.poi.ss.formula.functions.TestRowCol
     [echo] Tests run: 4, Failures: 0, Aborted: 0, Skipped: 0, Time elapsed: 0.001000 sec
     [echo] Ran org.apache.poi.ss.formula.functions.TestSlope
     [echo] Tests run: 3, Failures: 0, Aborted: 0, Skipped: 0, Time elapsed: 0.001000 sec
     [echo] Ran org.apache.poi.ss.formula.functions.TestStatsLib
     [echo] Tests run: 8, Failures: 0, Aborted: 0, Skipped: 0, Time elapsed: 0.001000 sec
     [echo] Ran org.apache.poi.ss.formula.functions.TestSubstitute
     [echo] Tests run: 5, Failures: 0, Aborted: 0, Skipped: 0, Time elapsed: 0.000000 sec
     [echo] Ran org.apache.poi.ss.formula.functions.TestSubtotal
     [echo] Tests run: 11, Failures: 0, Aborted: 0, Skipped: 0, Time elapsed: 0.010000 sec
     [echo] Ran org.apache.poi.ss.formula.functions.TestSumif
     [echo] Tests run: 3, Failures: 0, Aborted: 0, Skipped: 0, Time elapsed: 0.001000 sec
     [echo] Ran org.apache.poi.ss.formula.functions.TestSumifs
     [echo] Tests run: 7, Failures: 0, Aborted: 0, Skipped: 0, Time elapsed: 0.003000 sec
     [echo] Ran org.apache.poi.ss.formula.functions.TestSumproduct
     [echo] Tests run: 5, Failures: 0, Aborted: 0, Skipped: 0, Time elapsed: 0.001000 sec
     [echo] Ran org.apache.poi.ss.formula.functions.TestTFunc
     [echo] Tests run: 5, Failures: 0, Aborted: 0, Skipped: 0, Time elapsed: 0.001000 sec
     [echo] Ran org.apache.poi.ss.formula.functions.TestText
     [echo] Tests run: 4, Failures: 0, Aborted: 0, Skipped: 0, Time elapsed: 0.003000 sec
     [echo] Ran org.apache.poi.ss.formula.functions.TestTime
     [echo] Tests run: 2, Failures: 0, Aborted: 0, Skipped: 0, Time elapsed: 0.005000 sec
     [echo] Ran org.apache.poi.ss.formula.functions.TestTrendFunctionsFromSpreadsheet
     [echo] Tests run: 41, Failures: 0, Aborted: 0, Skipped: 0, Time elapsed: 0.049000 sec
     [echo] Ran org.apache.poi.ss.formula.functions.TestTrim
     [echo] Tests run: 3, Failures: 0, Aborted: 0, Skipped: 0, Time elapsed: 0.001000 sec
     [echo] Ran org.apache.poi.ss.formula.functions.TestTrunc
     [echo] Tests run: 7, Failures: 0, Aborted: 0, Skipped: 0, Time elapsed: 0.002000 sec
     [echo] Ran org.apache.poi.ss.formula.functions.TestTwoOperandNumericFunctionsFromSpreadsheet
     [echo] Tests run: 34, Failures: 0, Aborted: 0, Skipped: 0, Time elapsed: 0.022000 sec
     [echo] Ran org.apache.poi.ss.formula.functions.TestValue
     [echo] Tests run: 2, Failures: 0, Aborted: 0, Skipped: 0, Time elapsed: 0.003000 sec
     [echo] Ran org.apache.poi.ss.formula.functions.TestWeekNumFunctionsFromSpreadsheet
     [echo] Tests run: 7, Failures: 0, Aborted: 0, Skipped: 0, Time elapsed: 0.005000 sec
     [echo] Ran org.apache.poi.ss.formula.functions.TestWeekNumFunctionsFromSpreadsheet2013
     [echo] Tests run: 7, Failures: 0, Aborted: 0, Skipped: 0, Time elapsed: 0.005000 sec
     [echo] Ran org.apache.poi.ss.formula.functions.TestWeekdayFunc
     [echo] Tests run: 2, Failures: 0, Aborted: 0, Skipped: 0, Time elapsed: 0.001000 sec
     [echo] Ran org.apache.poi.ss.formula.functions.TestXYNumericFunction
     [echo] Tests run: 3, Failures: 0, Aborted: 0, Skipped: 0, Time elapsed: 0.001000 sec
     [echo] Ran org.apache.poi.ss.formula.ptg.TestAbstractFunctionPtg
     [echo] Tests run: 3, Failures: 0, Aborted: 0, Skipped: 0, Time elapsed: 0.001000 sec
     [echo] Ran org.apache.poi.ss.formula.ptg.TestArea3DPtg
     [echo] Tests run: 1, Failures: 0, Aborted: 0, Skipped: 0, Time elapsed: 0.000000 sec
     [echo] Ran org.apache.poi.ss.formula.ptg.TestAreaErrPtg
     [echo] Tests run: 1, Failures: 0, Aborted: 0, Skipped: 0, Time elapsed: 0.001000 sec
     [echo] Ran org.apache.poi.ss.formula.ptg.TestAreaPtg
     [echo] Tests run: 5, Failures: 0, Aborted: 0, Skipped: 0, Time elapsed: 0.001000 sec
     [echo] Ran org.apache.poi.ss.formula.ptg.TestArrayPtg
     [echo] Tests run: 5, Failures: 0, Aborted: 0, Skipped: 0, Time elapsed: 0.003000 sec
     [echo] Ran org.apache.poi.ss.formula.ptg.TestAttrPtg
     [echo] Tests run: 1, Failures: 0, Aborted: 0, Skipped: 0, Time elapsed: 0.001000 sec
     [echo] Ran org.apache.poi.ss.formula.ptg.TestErrPtg
     [echo] Tests run: 1, Failures: 0, Aborted: 0, Skipped: 0, Time elapsed: 0.001000 sec
     [echo] Ran org.apache.poi.ss.formula.ptg.TestExternalFunctionFormulas
     [echo] Tests run: 3, Failures: 0, Aborted: 0, Skipped: 0, Time elapsed: 0.003000 sec
     [echo] Ran org.apache.poi.ss.formula.ptg.TestExternalNameReference
     [echo] Tests run: 3, Failures: 0, Aborted: 0, Skipped: 0, Time elapsed: 0.003000 sec
     [echo] Ran org.apache.poi.ss.formula.ptg.TestFuncPtg
     [echo] Tests run: 2, Failures: 0, Aborted: 0, Skipped: 0, Time elapsed: 0.000000 sec
     [echo] Ran org.apache.poi.ss.formula.ptg.TestFuncVarPtg
     [echo] Tests run: 1, Failures: 0, Aborted: 0, Skipped: 0, Time elapsed: 0.000000 sec
     [echo] Ran org.apache.poi.ss.formula.ptg.TestIntersectionPtg
     [echo] Tests run: 1, Failures: 0, Aborted: 0, Skipped: 0, Time elapsed: 0.001000 sec
     [echo] Ran org.apache.poi.ss.formula.ptg.TestPercentPtg
     [echo] Tests run: 1, Failures: 0, Aborted: 0, Skipped: 0, Time elapsed: 0.001000 sec
     [echo] Ran org.apache.poi.ss.formula.ptg.TestRangePtg
     [echo] Tests run: 1, Failures: 0, Aborted: 0, Skipped: 0, Time elapsed: 0.001000 sec
     [echo] Ran org.apache.poi.ss.formula.ptg.TestRef3DPtg
     [echo] Tests run: 1, Failures: 0, Aborted: 0, Skipped: 0, Time elapsed: 0.001000 sec
     [echo] Ran org.apache.poi.ss.formula.ptg.TestReferencePtg
     [echo] Tests run: 4, Failures: 0, Aborted: 0, Skipped: 0, Time elapsed: 0.006000 sec
     [echo] Ran org.apache.poi.ss.formula.ptg.TestUnionPtg
     [echo] Tests run: 1, Failures: 0, Aborted: 0, Skipped: 0, Time elapsed: 0.001000 sec
     [echo] Ran org.apache.poi.ss.formula.udf.TestAggregatingUDFFinder
     [echo] Tests run: 2, Failures: 0, Aborted: 0, Skipped: 0, Time elapsed: 0.000000 sec
     [echo] Ran org.apache.poi.ss.formula.udf.TestDefaultUDFFinder
     [echo] Tests run: 1, Failures: 0, Aborted: 0, Skipped: 0, Time elapsed: 0.001000 sec
     [echo] Ran org.apache.poi.ss.usermodel.TestDataFormatter
     [echo] Tests run: 37, Failures: 0, Aborted: 0, Skipped: 1, Time elapsed: 0.349000 sec
     [echo] Ran org.apache.poi.ss.usermodel.TestDateUtil
     [echo] Tests run: 26, Failures: 0, Aborted: 0, Skipped: 0, Time elapsed: 0.014000 sec
     [echo] Ran org.apache.poi.ss.usermodel.TestExcelStyleDateFormatter
     [echo] Tests run: 123, Failures: 0, Aborted: 0, Skipped: 0, Time elapsed: 0.054000 sec
     [echo] Ran org.apache.poi.ss.usermodel.TestFractionFormat
     [echo] Tests run: 5, Failures: 0, Aborted: 0, Skipped: 1, Time elapsed: 0.284000 sec
     [echo] Ran org.apache.poi.ss.usermodel.TestHSSFBorderStyle
     [echo] Tests run: 1, Failures: 0, Aborted: 0, Skipped: 0, Time elapsed: 0.001000 sec
     [echo] Ran org.apache.poi.ss.usermodel.TestIndexedColors
     [echo] Tests run: 3, Failures: 0, Aborted: 0, Skipped: 0, Time elapsed: 0.002000 sec
     [echo] Ran org.apache.poi.ss.util.TestAreaReference
     [echo] Tests run: 3, Failures: 0, Aborted: 0, Skipped: 0, Time elapsed: 0.001000 sec
     [echo] Ran org.apache.poi.ss.util.TestCellAddress
     [echo] Tests run: 6, Failures: 0, Aborted: 0, Skipped: 0, Time elapsed: 0.001000 sec
     [echo] Ran org.apache.poi.ss.util.TestCellRangeAddress
     [echo] Tests run: 14, Failures: 0, Aborted: 0, Skipped: 0, Time elapsed: 0.004000 sec
     [echo] Ran org.apache.poi.ss.util.TestCellRangeUtil
     [echo] Tests run: 1, Failures: 0, Aborted: 0, Skipped: 0, Time elapsed: 0.001000 sec
     [echo] Ran org.apache.poi.ss.util.TestCellReference
     [echo] Tests run: 27, Failures: 0, Aborted: 0, Skipped: 0, Time elapsed: 0.172000 sec
     [echo] Ran org.apache.poi.ss.util.TestDateFormatConverter
     [echo] Tests run: 18, Failures: 0, Aborted: 0, Skipped: 0, Time elapsed: 1.676000 sec
     [echo] Ran org.apache.poi.ss.util.TestDateParser
     [echo] Tests run: 5, Failures: 0, Aborted: 0, Skipped: 0, Time elapsed: 0.004000 sec
     [echo] Ran org.apache.poi.ss.util.TestExpandedDouble
     [echo] Tests run: 18, Failures: 0, Aborted: 0, Skipped: 0, Time elapsed: 0.012000 sec
     [echo] Ran org.apache.poi.ss.util.TestHSSFCellUtil
     [echo] Tests run: 14, Failures: 0, Aborted: 0, Skipped: 0, Time elapsed: 0.015000 sec
     [echo] Ran org.apache.poi.ss.util.TestNumberComparer
     [echo] Tests run: 115, Failures: 0, Aborted: 0, Skipped: 0, Time elapsed: 0.055000 sec
     [echo] Ran org.apache.poi.ss.util.TestNumberToTextConverter
     [echo] Tests run: 2, Failures: 0, Aborted: 0, Skipped: 0, Time elapsed: 0.007000 sec
     [echo] Ran org.apache.poi.ss.util.TestPropertyTemplate
     [echo] Tests run: 8, Failures: 0, Aborted: 0, Skipped: 0, Time elapsed: 0.021000 sec
     [echo] Ran org.apache.poi.ss.util.TestRegionUtil
     [echo] Tests run: 10, Failures: 0, Aborted: 0, Skipped: 0, Time elapsed: 0.016000 sec
     [echo] Ran org.apache.poi.ss.util.TestSheetBuilder
     [echo] Tests run: 3, Failures: 0, Aborted: 0, Skipped: 0, Time elapsed: 0.002000 sec
     [echo] Ran org.apache.poi.ss.util.TestSheetUtil
     [echo] Tests run: 7, Failures: 0, Aborted: 0, Skipped: 0, Time elapsed: 0.005000 sec
     [echo] Ran org.apache.poi.ss.util.TestWorkbookUtil
     [echo] Tests run: 1, Failures: 0, Aborted: 0, Skipped: 0, Time elapsed: 0.000000 sec
     [echo] Ran org.apache.poi.ss.util.cellwalk.TestCellWalk
     [echo] Tests run: 1, Failures: 0, Aborted: 0, Skipped: 0, Time elapsed: 0.003000 sec
     [echo] Ran org.apache.poi.util.TestArrayUtil
     [echo] Tests run: 1, Failures: 0, Aborted: 0, Skipped: 0, Time elapsed: 0.002000 sec
     [echo] Ran org.apache.poi.util.TestBitField
     [echo] Tests run: 16, Failures: 0, Aborted: 0, Skipped: 0, Time elapsed: 0.002000 sec
     [echo] Ran org.apache.poi.util.TestByteField
     [echo] Tests run: 5, Failures: 0, Aborted: 0, Skipped: 0, Time elapsed: 0.001000 sec
     [echo] Ran org.apache.poi.util.TestHexDump
     [echo] Tests run: 8, Failures: 0, Aborted: 0, Skipped: 0, Time elapsed: 0.011000 sec
     [echo] Ran org.apache.poi.util.TestIOUtils
     [echo] Tests run: 36, Failures: 0, Aborted: 0, Skipped: 0, Time elapsed: 0.053000 sec
     [echo] Ran org.apache.poi.util.TestIntList
     [echo] Tests run: 19, Failures: 0, Aborted: 0, Skipped: 0, Time elapsed: 0.041000 sec
     [echo] Ran org.apache.poi.util.TestIntegerField
     [echo] Tests run: 5, Failures: 0, Aborted: 0, Skipped: 0, Time elapsed: 0.003000 sec
     [echo] Ran org.apache.poi.util.TestLittleEndian
     [echo] Tests run: 15, Failures: 0, Aborted: 0, Skipped: 0, Time elapsed: 0.004000 sec
     [echo] Ran org.apache.poi.util.TestLittleEndianStreams
     [echo] Tests run: 5, Failures: 0, Aborted: 0, Skipped: 0, Time elapsed: 0.002000 sec
     [echo] Ran org.apache.poi.util.TestLocaleUtil
     [echo] Tests run: 3, Failures: 0, Aborted: 0, Skipped: 0, Time elapsed: 0.001000 sec
     [echo] Ran org.apache.poi.util.TestLongField
     [echo] Tests run: 5, Failures: 0, Aborted: 0, Skipped: 0, Time elapsed: 0.002000 sec
     [echo] Ran org.apache.poi.util.TestPOILogger
     [echo] Tests run: 1, Failures: 0, Aborted: 0, Skipped: 0, Time elapsed: 0.001000 sec
     [echo] Ran org.apache.poi.util.TestRLEDecompressingInputStream
     [echo] Tests run: 4, Failures: 0, Aborted: 0, Skipped: 0, Time elapsed: 0.001000 sec
     [echo] Ran org.apache.poi.util.TestShortField
     [echo] Tests run: 5, Failures: 0, Aborted: 0, Skipped: 0, Time elapsed: 0.002000 sec
     [echo] Ran org.apache.poi.util.TestStringCodepointsIterable
     [echo] Tests run: 1, Failures: 0, Aborted: 0, Skipped: 0, Time elapsed: 0.001000 sec
     [echo] Ran org.apache.poi.util.TestStringUtil
     [echo] Tests run: 7, Failures: 0, Aborted: 0, Skipped: 0, Time elapsed: 0.002000 sec
     [echo] Ran org.apache.poi.util.TestTempFile
     [echo] Tests run: 4, Failures: 0, Aborted: 0, Skipped: 0, Time elapsed: 0.010000 sec
     [echo] Ran org.apache.poi.util.TestXMLHelper
     [echo] Tests run: 8, Failures: 0, Aborted: 0, Skipped: 0, Time elapsed: 0.315000 sec

-test-excelant-write-testfile:

test:

compile-integration:
    [javac] Compiling 28 source files to <https://ci-builds.apache.org/job/POI/job/POI-DSL-Windows-1.8/ws/build\integration-test-classes>
    [javac] Support for javac --release has been added in Java9 ignoring it
    [mkdir] Created dir: <https://ci-builds.apache.org/job/POI/job/POI-DSL-Windows-1.8/ws/build\integration-test-classes\META-INF\versions\9>
      [jar] Building jar: <https://ci-builds.apache.org/job/POI/job/POI-DSL-Windows-1.8/ws/build\dist\maven\poi-integration\poi-integration-5.0.1-SNAPSHOT.jar>

-test-integration-check:

test-integration:

BUILD FAILED
<https://ci-builds.apache.org/job/POI/job/POI-DSL-Windows-1.8/ws/build.xml>:1711: The following error occurred while executing this line:
<https://ci-builds.apache.org/job/POI/job/POI-DSL-Windows-1.8/ws/build.xml>:1256: Some test(s) have failure(s)

Total time: 26 minutes 0 seconds
Build step 'Invoke Ant' marked build as failure
[SpotBugs] Skipping execution of recorder since overall result is 'FAILURE'
Archiving artifacts
[Fast Archiver] Compressed 7.16 MB of artifacts by 42.3% relative to #104
Skipping publisher since build result is FAILURE
Recording test results

---------------------------------------------------------------------
To unsubscribe, e-mail: [hidden email]
For additional commands, e-mail: [hidden email]

Reply | Threaded
Open this post in threaded view
|

Build failed in Jenkins: POI » POI-DSL-Windows-1.8 #114

Apache Jenkins Server
See <https://ci-builds.apache.org/job/POI/job/POI-DSL-Windows-1.8/114/display/redirect?page=changes>

Changes:

[Andreas Beeker] try to fix font-based issues

[Dominik Stadler] List some more changes for 5.0.0

[Dominik Stadler] Documentation: Adjust examples, fix git command, adjust for JUnit 5

[Andreas Beeker] Sonar fixes
add asserts to tests


------------------------------------------
[...truncated 286.84 KB...]
     [echo] Tests run: 98, Failures: 0, Aborted: 0, Skipped: 0, Time elapsed: 0.070000 sec
     [echo] Ran org.apache.poi.ss.formula.functions.TestIndirect
     [echo] Tests run: 3, Failures: 0, Aborted: 0, Skipped: 0, Time elapsed: 0.009000 sec
     [echo] Ran org.apache.poi.ss.formula.functions.TestIndirectFunctionFromSpreadsheet
     [echo] Tests run: 11, Failures: 0, Aborted: 0, Skipped: 0, Time elapsed: 0.008000 sec
     [echo] Ran org.apache.poi.ss.formula.functions.TestIntercept
     [echo] Tests run: 4, Failures: 0, Aborted: 0, Skipped: 0, Time elapsed: 0.003000 sec
     [echo] Ran org.apache.poi.ss.formula.functions.TestIrr
     [echo] Tests run: 3, Failures: 0, Aborted: 0, Skipped: 0, Time elapsed: 0.003000 sec
     [echo] Ran org.apache.poi.ss.formula.functions.TestIsBlank
     [echo] Tests run: 1, Failures: 0, Aborted: 0, Skipped: 0, Time elapsed: 0.000000 sec
     [echo] Ran org.apache.poi.ss.formula.functions.TestLeftRight
     [echo] Tests run: 2, Failures: 0, Aborted: 0, Skipped: 0, Time elapsed: 0.000000 sec
     [echo] Ran org.apache.poi.ss.formula.functions.TestLen
     [echo] Tests run: 3, Failures: 0, Aborted: 0, Skipped: 0, Time elapsed: 0.001000 sec
     [echo] Ran org.apache.poi.ss.formula.functions.TestLogicalFunction
     [echo] Tests run: 2, Failures: 0, Aborted: 0, Skipped: 0, Time elapsed: 0.002000 sec
     [echo] Ran org.apache.poi.ss.formula.functions.TestLogicalFunctionsFromSpreadsheet
     [echo] Tests run: 15, Failures: 0, Aborted: 0, Skipped: 0, Time elapsed: 0.014000 sec
     [echo] Ran org.apache.poi.ss.formula.functions.TestLookupFunctionsFromSpreadsheet
     [echo] Tests run: 205, Failures: 0, Aborted: 0, Skipped: 0, Time elapsed: 0.155000 sec
     [echo] Ran org.apache.poi.ss.formula.functions.TestMatch
     [echo] Tests run: 9, Failures: 0, Aborted: 0, Skipped: 0, Time elapsed: 0.003000 sec
     [echo] Ran org.apache.poi.ss.formula.functions.TestMatchFunctionsFromSpreadsheet
     [echo] Tests run: 14, Failures: 0, Aborted: 0, Skipped: 0, Time elapsed: 0.008000 sec
     [echo] Ran org.apache.poi.ss.formula.functions.TestMathX
     [echo] Tests run: 23, Failures: 0, Aborted: 0, Skipped: 0, Time elapsed: 0.006000 sec
     [echo] Ran org.apache.poi.ss.formula.functions.TestMid
     [echo] Tests run: 4, Failures: 0, Aborted: 0, Skipped: 0, Time elapsed: 0.001000 sec
     [echo] Ran org.apache.poi.ss.formula.functions.TestMirr
     [echo] Tests run: 4, Failures: 0, Aborted: 0, Skipped: 0, Time elapsed: 0.003000 sec
     [echo] Ran org.apache.poi.ss.formula.functions.TestMultiOperandNumericFunction
     [echo] Tests run: 3, Failures: 0, Aborted: 0, Skipped: 0, Time elapsed: 0.000000 sec
     [echo] Ran org.apache.poi.ss.formula.functions.TestNper
     [echo] Tests run: 2, Failures: 0, Aborted: 0, Skipped: 0, Time elapsed: 0.000000 sec
     [echo] Ran org.apache.poi.ss.formula.functions.TestNpv
     [echo] Tests run: 2, Failures: 0, Aborted: 0, Skipped: 0, Time elapsed: 0.002000 sec
     [echo] Ran org.apache.poi.ss.formula.functions.TestOct2Dec
     [echo] Tests run: 2, Failures: 0, Aborted: 0, Skipped: 0, Time elapsed: 0.001000 sec
     [echo] Ran org.apache.poi.ss.formula.functions.TestOffset
     [echo] Tests run: 21, Failures: 0, Aborted: 0, Skipped: 0, Time elapsed: 0.010000 sec
     [echo] Ran org.apache.poi.ss.formula.functions.TestPPMT
     [echo] Tests run: 1, Failures: 0, Aborted: 0, Skipped: 0, Time elapsed: 0.002000 sec
     [echo] Ran org.apache.poi.ss.formula.functions.TestPmt
     [echo] Tests run: 2, Failures: 0, Aborted: 0, Skipped: 0, Time elapsed: 0.001000 sec
     [echo] Ran org.apache.poi.ss.formula.functions.TestPoisson
     [echo] Tests run: 6, Failures: 0, Aborted: 0, Skipped: 0, Time elapsed: 0.001000 sec
     [echo] Ran org.apache.poi.ss.formula.functions.TestProduct
     [echo] Tests run: 4, Failures: 0, Aborted: 0, Skipped: 0, Time elapsed: 0.001000 sec
     [echo] Ran org.apache.poi.ss.formula.functions.TestQuotient
     [echo] Tests run: 2, Failures: 0, Aborted: 0, Skipped: 0, Time elapsed: 0.000000 sec
     [echo] Ran org.apache.poi.ss.formula.functions.TestQuotientFunctionsFromSpreadsheet
     [echo] Tests run: 8, Failures: 0, Aborted: 0, Skipped: 0, Time elapsed: 0.005000 sec
     [echo] Ran org.apache.poi.ss.formula.functions.TestRank
     [echo] Tests run: 1, Failures: 0, Aborted: 0, Skipped: 0, Time elapsed: 0.002000 sec
     [echo] Ran org.apache.poi.ss.formula.functions.TestRelationalOperations
     [echo] Tests run: 5, Failures: 0, Aborted: 0, Skipped: 0, Time elapsed: 0.001000 sec
     [echo] Ran org.apache.poi.ss.formula.functions.TestReptFunctionsFromSpreadsheet
     [echo] Tests run: 5, Failures: 0, Aborted: 0, Skipped: 0, Time elapsed: 0.007000 sec
     [echo] Ran org.apache.poi.ss.formula.functions.TestRomanFunctionsFromSpreadsheet
     [echo] Tests run: 35, Failures: 0, Aborted: 0, Skipped: 0, Time elapsed: 0.023000 sec
     [echo] Ran org.apache.poi.ss.formula.functions.TestRoundFuncs
     [echo] Tests run: 5, Failures: 0, Aborted: 0, Skipped: 1, Time elapsed: 0.001000 sec
     [echo] Ran org.apache.poi.ss.formula.functions.TestRowCol
     [echo] Tests run: 4, Failures: 0, Aborted: 0, Skipped: 0, Time elapsed: 0.001000 sec
     [echo] Ran org.apache.poi.ss.formula.functions.TestSlope
     [echo] Tests run: 3, Failures: 0, Aborted: 0, Skipped: 0, Time elapsed: 0.001000 sec
     [echo] Ran org.apache.poi.ss.formula.functions.TestStatsLib
     [echo] Tests run: 8, Failures: 0, Aborted: 0, Skipped: 0, Time elapsed: 0.002000 sec
     [echo] Ran org.apache.poi.ss.formula.functions.TestSubstitute
     [echo] Tests run: 5, Failures: 0, Aborted: 0, Skipped: 0, Time elapsed: 0.001000 sec
     [echo] Ran org.apache.poi.ss.formula.functions.TestSubtotal
     [echo] Tests run: 11, Failures: 0, Aborted: 0, Skipped: 0, Time elapsed: 0.008000 sec
     [echo] Ran org.apache.poi.ss.formula.functions.TestSumif
     [echo] Tests run: 3, Failures: 0, Aborted: 0, Skipped: 0, Time elapsed: 0.001000 sec
     [echo] Ran org.apache.poi.ss.formula.functions.TestSumifs
     [echo] Tests run: 7, Failures: 0, Aborted: 0, Skipped: 0, Time elapsed: 0.004000 sec
     [echo] Ran org.apache.poi.ss.formula.functions.TestSumproduct
     [echo] Tests run: 5, Failures: 0, Aborted: 0, Skipped: 0, Time elapsed: 0.001000 sec
     [echo] Ran org.apache.poi.ss.formula.functions.TestTFunc
     [echo] Tests run: 5, Failures: 0, Aborted: 0, Skipped: 0, Time elapsed: 0.001000 sec
     [echo] Ran org.apache.poi.ss.formula.functions.TestText
     [echo] Tests run: 4, Failures: 0, Aborted: 0, Skipped: 0, Time elapsed: 0.003000 sec
     [echo] Ran org.apache.poi.ss.formula.functions.TestTime
     [echo] Tests run: 2, Failures: 0, Aborted: 0, Skipped: 0, Time elapsed: 0.005000 sec
     [echo] Ran org.apache.poi.ss.formula.functions.TestTrendFunctionsFromSpreadsheet
     [echo] Tests run: 41, Failures: 0, Aborted: 0, Skipped: 0, Time elapsed: 0.144000 sec
     [echo] Ran org.apache.poi.ss.formula.functions.TestTrim
     [echo] Tests run: 3, Failures: 0, Aborted: 0, Skipped: 0, Time elapsed: 0.001000 sec
     [echo] Ran org.apache.poi.ss.formula.functions.TestTrunc
     [echo] Tests run: 7, Failures: 0, Aborted: 0, Skipped: 0, Time elapsed: 0.002000 sec
     [echo] Ran org.apache.poi.ss.formula.functions.TestTwoOperandNumericFunctionsFromSpreadsheet
     [echo] Tests run: 34, Failures: 0, Aborted: 0, Skipped: 0, Time elapsed: 0.020000 sec
     [echo] Ran org.apache.poi.ss.formula.functions.TestValue
     [echo] Tests run: 2, Failures: 0, Aborted: 0, Skipped: 0, Time elapsed: 0.001000 sec
     [echo] Ran org.apache.poi.ss.formula.functions.TestWeekNumFunctionsFromSpreadsheet
     [echo] Tests run: 7, Failures: 0, Aborted: 0, Skipped: 0, Time elapsed: 0.005000 sec
     [echo] Ran org.apache.poi.ss.formula.functions.TestWeekNumFunctionsFromSpreadsheet2013
     [echo] Tests run: 7, Failures: 0, Aborted: 0, Skipped: 0, Time elapsed: 0.006000 sec
     [echo] Ran org.apache.poi.ss.formula.functions.TestWeekdayFunc
     [echo] Tests run: 2, Failures: 0, Aborted: 0, Skipped: 0, Time elapsed: 0.001000 sec
     [echo] Ran org.apache.poi.ss.formula.functions.TestXYNumericFunction
     [echo] Tests run: 3, Failures: 0, Aborted: 0, Skipped: 0, Time elapsed: 0.002000 sec
     [echo] Ran org.apache.poi.ss.formula.ptg.TestAbstractFunctionPtg
     [echo] Tests run: 3, Failures: 0, Aborted: 0, Skipped: 0, Time elapsed: 0.002000 sec
     [echo] Ran org.apache.poi.ss.formula.ptg.TestArea3DPtg
     [echo] Tests run: 1, Failures: 0, Aborted: 0, Skipped: 0, Time elapsed: 0.001000 sec
     [echo] Ran org.apache.poi.ss.formula.ptg.TestAreaErrPtg
     [echo] Tests run: 1, Failures: 0, Aborted: 0, Skipped: 0, Time elapsed: 0.001000 sec
     [echo] Ran org.apache.poi.ss.formula.ptg.TestAreaPtg
     [echo] Tests run: 5, Failures: 0, Aborted: 0, Skipped: 0, Time elapsed: 0.001000 sec
     [echo] Ran org.apache.poi.ss.formula.ptg.TestArrayPtg
     [echo] Tests run: 5, Failures: 0, Aborted: 0, Skipped: 0, Time elapsed: 0.003000 sec
     [echo] Ran org.apache.poi.ss.formula.ptg.TestAttrPtg
     [echo] Tests run: 1, Failures: 0, Aborted: 0, Skipped: 0, Time elapsed: 0.000000 sec
     [echo] Ran org.apache.poi.ss.formula.ptg.TestErrPtg
     [echo] Tests run: 1, Failures: 0, Aborted: 0, Skipped: 0, Time elapsed: 0.001000 sec
     [echo] Ran org.apache.poi.ss.formula.ptg.TestExternalFunctionFormulas
     [echo] Tests run: 3, Failures: 0, Aborted: 0, Skipped: 0, Time elapsed: 0.003000 sec
     [echo] Ran org.apache.poi.ss.formula.ptg.TestExternalNameReference
     [echo] Tests run: 3, Failures: 0, Aborted: 0, Skipped: 0, Time elapsed: 0.004000 sec
     [echo] Ran org.apache.poi.ss.formula.ptg.TestFuncPtg
     [echo] Tests run: 2, Failures: 0, Aborted: 0, Skipped: 0, Time elapsed: 0.000000 sec
     [echo] Ran org.apache.poi.ss.formula.ptg.TestFuncVarPtg
     [echo] Tests run: 1, Failures: 0, Aborted: 0, Skipped: 0, Time elapsed: 0.000000 sec
     [echo] Ran org.apache.poi.ss.formula.ptg.TestIntersectionPtg
     [echo] Tests run: 1, Failures: 0, Aborted: 0, Skipped: 0, Time elapsed: 0.001000 sec
     [echo] Ran org.apache.poi.ss.formula.ptg.TestPercentPtg
     [echo] Tests run: 1, Failures: 0, Aborted: 0, Skipped: 0, Time elapsed: 0.001000 sec
     [echo] Ran org.apache.poi.ss.formula.ptg.TestRangePtg
     [echo] Tests run: 1, Failures: 0, Aborted: 0, Skipped: 0, Time elapsed: 0.001000 sec
     [echo] Ran org.apache.poi.ss.formula.ptg.TestRef3DPtg
     [echo] Tests run: 1, Failures: 0, Aborted: 0, Skipped: 0, Time elapsed: 0.000000 sec
     [echo] Ran org.apache.poi.ss.formula.ptg.TestReferencePtg
     [echo] Tests run: 4, Failures: 0, Aborted: 0, Skipped: 0, Time elapsed: 0.006000 sec
     [echo] Ran org.apache.poi.ss.formula.ptg.TestUnionPtg
     [echo] Tests run: 1, Failures: 0, Aborted: 0, Skipped: 0, Time elapsed: 0.001000 sec
     [echo] Ran org.apache.poi.ss.formula.udf.TestAggregatingUDFFinder
     [echo] Tests run: 2, Failures: 0, Aborted: 0, Skipped: 0, Time elapsed: 0.001000 sec
     [echo] Ran org.apache.poi.ss.formula.udf.TestDefaultUDFFinder
     [echo] Tests run: 1, Failures: 0, Aborted: 0, Skipped: 0, Time elapsed: 0.000000 sec
     [echo] Ran org.apache.poi.ss.usermodel.TestDataFormatter
     [echo] Tests run: 37, Failures: 0, Aborted: 0, Skipped: 1, Time elapsed: 0.326000 sec
     [echo] Ran org.apache.poi.ss.usermodel.TestDateUtil
     [echo] Tests run: 26, Failures: 0, Aborted: 0, Skipped: 0, Time elapsed: 0.017000 sec
     [echo] Ran org.apache.poi.ss.usermodel.TestExcelStyleDateFormatter
     [echo] Tests run: 123, Failures: 0, Aborted: 0, Skipped: 0, Time elapsed: 0.057000 sec
     [echo] Ran org.apache.poi.ss.usermodel.TestFractionFormat
     [echo] Tests run: 5, Failures: 0, Aborted: 0, Skipped: 1, Time elapsed: 0.315000 sec
     [echo] Ran org.apache.poi.ss.usermodel.TestHSSFBorderStyle
     [echo] Tests run: 1, Failures: 0, Aborted: 0, Skipped: 0, Time elapsed: 0.002000 sec
     [echo] Ran org.apache.poi.ss.usermodel.TestIndexedColors
     [echo] Tests run: 3, Failures: 0, Aborted: 0, Skipped: 0, Time elapsed: 0.001000 sec
     [echo] Ran org.apache.poi.ss.util.TestAreaReference
     [echo] Tests run: 3, Failures: 0, Aborted: 0, Skipped: 0, Time elapsed: 0.001000 sec
     [echo] Ran org.apache.poi.ss.util.TestCellAddress
     [echo] Tests run: 6, Failures: 0, Aborted: 0, Skipped: 0, Time elapsed: 0.001000 sec
     [echo] Ran org.apache.poi.ss.util.TestCellRangeAddress
     [echo] Tests run: 14, Failures: 0, Aborted: 0, Skipped: 0, Time elapsed: 0.005000 sec
     [echo] Ran org.apache.poi.ss.util.TestCellRangeUtil
     [echo] Tests run: 1, Failures: 0, Aborted: 0, Skipped: 0, Time elapsed: 0.001000 sec
     [echo] Ran org.apache.poi.ss.util.TestCellReference
     [echo] Tests run: 27, Failures: 0, Aborted: 0, Skipped: 0, Time elapsed: 0.342000 sec
     [echo] Ran org.apache.poi.ss.util.TestDateFormatConverter
     [echo] Tests run: 18, Failures: 0, Aborted: 0, Skipped: 0, Time elapsed: 1.382000 sec
     [echo] Ran org.apache.poi.ss.util.TestDateParser
     [echo] Tests run: 5, Failures: 0, Aborted: 0, Skipped: 0, Time elapsed: 0.004000 sec
     [echo] Ran org.apache.poi.ss.util.TestExpandedDouble
     [echo] Tests run: 18, Failures: 0, Aborted: 0, Skipped: 0, Time elapsed: 0.010000 sec
     [echo] Ran org.apache.poi.ss.util.TestHSSFCellUtil
     [echo] Tests run: 14, Failures: 0, Aborted: 0, Skipped: 0, Time elapsed: 0.016000 sec
     [echo] Ran org.apache.poi.ss.util.TestNumberComparer
     [echo] Tests run: 115, Failures: 0, Aborted: 0, Skipped: 0, Time elapsed: 0.083000 sec
     [echo] Ran org.apache.poi.ss.util.TestNumberToTextConverter
     [echo] Tests run: 2, Failures: 0, Aborted: 0, Skipped: 0, Time elapsed: 0.009000 sec
     [echo] Ran org.apache.poi.ss.util.TestPropertyTemplate
     [echo] Tests run: 8, Failures: 0, Aborted: 0, Skipped: 0, Time elapsed: 0.029000 sec
     [echo] Ran org.apache.poi.ss.util.TestRegionUtil
     [echo] Tests run: 10, Failures: 0, Aborted: 0, Skipped: 0, Time elapsed: 0.016000 sec
     [echo] Ran org.apache.poi.ss.util.TestSheetBuilder
     [echo] Tests run: 3, Failures: 0, Aborted: 0, Skipped: 0, Time elapsed: 0.003000 sec
     [echo] Ran org.apache.poi.ss.util.TestSheetUtil
     [echo] Tests run: 7, Failures: 0, Aborted: 0, Skipped: 0, Time elapsed: 0.004000 sec
     [echo] Ran org.apache.poi.ss.util.TestWorkbookUtil
     [echo] Tests run: 1, Failures: 0, Aborted: 0, Skipped: 0, Time elapsed: 0.001000 sec
     [echo] Ran org.apache.poi.ss.util.cellwalk.TestCellWalk
     [echo] Tests run: 1, Failures: 0, Aborted: 0, Skipped: 0, Time elapsed: 0.003000 sec
     [echo] Ran org.apache.poi.util.TestArrayUtil
     [echo] Tests run: 1, Failures: 0, Aborted: 0, Skipped: 0, Time elapsed: 0.002000 sec
     [echo] Ran org.apache.poi.util.TestBitField
     [echo] Tests run: 16, Failures: 0, Aborted: 0, Skipped: 0, Time elapsed: 0.012000 sec
     [echo] Ran org.apache.poi.util.TestByteField
     [echo] Tests run: 5, Failures: 0, Aborted: 0, Skipped: 0, Time elapsed: 0.002000 sec
     [echo] Ran org.apache.poi.util.TestHexDump
     [echo] Tests run: 8, Failures: 0, Aborted: 0, Skipped: 0, Time elapsed: 0.010000 sec
     [echo] Ran org.apache.poi.util.TestIOUtils
     [echo] Tests run: 36, Failures: 0, Aborted: 0, Skipped: 0, Time elapsed: 0.055000 sec
     [echo] Ran org.apache.poi.util.TestIntList
     [echo] Tests run: 19, Failures: 0, Aborted: 0, Skipped: 0, Time elapsed: 0.042000 sec
     [echo] Ran org.apache.poi.util.TestIntegerField
     [echo] Tests run: 5, Failures: 0, Aborted: 0, Skipped: 0, Time elapsed: 0.002000 sec
     [echo] Ran org.apache.poi.util.TestLittleEndian
     [echo] Tests run: 15, Failures: 0, Aborted: 0, Skipped: 0, Time elapsed: 0.003000 sec
     [echo] Ran org.apache.poi.util.TestLittleEndianStreams
     [echo] Tests run: 5, Failures: 0, Aborted: 0, Skipped: 0, Time elapsed: 0.002000 sec
     [echo] Ran org.apache.poi.util.TestLocaleUtil
     [echo] Tests run: 3, Failures: 0, Aborted: 0, Skipped: 0, Time elapsed: 0.001000 sec
     [echo] Ran org.apache.poi.util.TestLongField
     [echo] Tests run: 5, Failures: 0, Aborted: 0, Skipped: 0, Time elapsed: 0.002000 sec
     [echo] Ran org.apache.poi.util.TestPOILogger
     [echo] Tests run: 1, Failures: 0, Aborted: 0, Skipped: 0, Time elapsed: 0.000000 sec
     [echo] Ran org.apache.poi.util.TestRLEDecompressingInputStream
     [echo] Tests run: 4, Failures: 0, Aborted: 0, Skipped: 0, Time elapsed: 0.001000 sec
     [echo] Ran org.apache.poi.util.TestShortField
     [echo] Tests run: 5, Failures: 0, Aborted: 0, Skipped: 0, Time elapsed: 0.003000 sec
     [echo] Ran org.apache.poi.util.TestStringCodepointsIterable
     [echo] Tests run: 1, Failures: 0, Aborted: 0, Skipped: 0, Time elapsed: 0.001000 sec
     [echo] Ran org.apache.poi.util.TestStringUtil
     [echo] Tests run: 7, Failures: 0, Aborted: 0, Skipped: 0, Time elapsed: 0.002000 sec
     [echo] Ran org.apache.poi.util.TestTempFile
     [echo] Tests run: 4, Failures: 0, Aborted: 0, Skipped: 0, Time elapsed: 0.006000 sec
     [echo] Ran org.apache.poi.util.TestXMLHelper
     [echo] Tests run: 8, Failures: 0, Aborted: 0, Skipped: 0, Time elapsed: 0.205000 sec

-test-excelant-write-testfile:

test:

compile-integration:
    [javac] Compiling 28 source files to <https://ci-builds.apache.org/job/POI/job/POI-DSL-Windows-1.8/ws/build\integration-test-classes>
    [javac] Support for javac --release has been added in Java9 ignoring it
    [mkdir] Created dir: <https://ci-builds.apache.org/job/POI/job/POI-DSL-Windows-1.8/ws/build\integration-test-classes\META-INF\versions\9>
      [jar] Building jar: <https://ci-builds.apache.org/job/POI/job/POI-DSL-Windows-1.8/ws/build\dist\maven\poi-integration\poi-integration-5.0.1-SNAPSHOT.jar>

-test-integration-check:

test-integration:

BUILD FAILED
<https://ci-builds.apache.org/job/POI/job/POI-DSL-Windows-1.8/ws/build.xml>:1711: The following error occurred while executing this line:
<https://ci-builds.apache.org/job/POI/job/POI-DSL-Windows-1.8/ws/build.xml>:1256: Some test(s) have failure(s)

Total time: 27 minutes 36 seconds
Build step 'Invoke Ant' marked build as failure
[SpotBugs] Skipping execution of recorder since overall result is 'FAILURE'
Archiving artifacts
[Fast Archiver] Compressed 7.85 MB of artifacts by 38.6% relative to #104
Skipping publisher since build result is FAILURE
Recording test results

---------------------------------------------------------------------
To unsubscribe, e-mail: [hidden email]
For additional commands, e-mail: [hidden email]

Reply | Threaded
Open this post in threaded view
|

Build failed in Jenkins: POI » POI-DSL-Windows-1.8 #115

Apache Jenkins Server
See <https://ci-builds.apache.org/job/POI/job/POI-DSL-Windows-1.8/115/display/redirect?page=changes>

Changes:

[Andreas Beeker] Sonar fixes
add asserts to tests

[Andreas Beeker] Junit5 - fix logging to console

[Dominik Stadler] List more bugfixes that went into 5.0.0


------------------------------------------
[...truncated 183.42 KB...]
[junitlauncher]
[junitlauncher] Running org.apache.poi.xssf.usermodel.TestXSSFSimpleShape
[junitlauncher] Tests run: 1, Failures: 0, Aborted: 0, Skipped: 0, Time elapsed: 0.014000 sec
[junitlauncher]
[junitlauncher] Running org.apache.poi.xssf.usermodel.TestXSSFTable
[junitlauncher] Tests run: 29, Failures: 0, Aborted: 0, Skipped: 0, Time elapsed: 0.271000 sec
[junitlauncher]
[junitlauncher] Running org.apache.poi.xssf.usermodel.TestXSSFTableColumn
[junitlauncher] Tests run: 3, Failures: 0, Aborted: 0, Skipped: 0, Time elapsed: 0.034000 sec
[junitlauncher]
[junitlauncher] Running org.apache.poi.xssf.usermodel.TestXSSFTextParagraph
[junitlauncher] Tests run: 1, Failures: 0, Aborted: 0, Skipped: 0, Time elapsed: 0.015000 sec
[junitlauncher]
[junitlauncher] Running org.apache.poi.xssf.usermodel.TestXSSFTextRun
[junitlauncher] Tests run: 1, Failures: 0, Aborted: 0, Skipped: 0, Time elapsed: 0.008000 sec
[junitlauncher]
[junitlauncher] Running org.apache.poi.xssf.usermodel.TestXSSFUnicodeSurrogates
[junitlauncher] Tests run: 1, Failures: 0, Aborted: 0, Skipped: 0, Time elapsed: 0.031000 sec
[junitlauncher]
[junitlauncher] Running org.apache.poi.xssf.usermodel.TestXSSFVMLDrawing
[junitlauncher] Tests run: 5, Failures: 0, Aborted: 0, Skipped: 0, Time elapsed: 0.098000 sec
[junitlauncher]
[junitlauncher] Running org.apache.poi.xssf.usermodel.TestXSSFWorkbook
[junitlauncher] Tests run: 62, Failures: 0, Aborted: 0, Skipped: 0, Time elapsed: 1.022000 sec
[junitlauncher]
[junitlauncher] Running org.apache.poi.xssf.usermodel.charts.TestXDDFChartLegend
[junitlauncher] Tests run: 3, Failures: 0, Aborted: 0, Skipped: 0, Time elapsed: 0.011000 sec
[junitlauncher]
[junitlauncher] Running org.apache.poi.xssf.usermodel.charts.TestXDDFManualLayout
[junitlauncher] Tests run: 2, Failures: 0, Aborted: 0, Skipped: 0, Time elapsed: 0.008000 sec
[junitlauncher]
[junitlauncher] Running org.apache.poi.xssf.usermodel.charts.TestXSSF3DChartData
[junitlauncher] Tests run: 1, Failures: 0, Aborted: 0, Skipped: 0, Time elapsed: 0.020000 sec
[junitlauncher]
[junitlauncher] Running org.apache.poi.xssf.usermodel.charts.TestXSSFCategoryAxis
[junitlauncher] Tests run: 1, Failures: 0, Aborted: 0, Skipped: 0, Time elapsed: 0.011000 sec
[junitlauncher]
[junitlauncher] Running org.apache.poi.xssf.usermodel.charts.TestXSSFChartAxis
[junitlauncher] Tests run: 8, Failures: 0, Aborted: 0, Skipped: 0, Time elapsed: 0.045000 sec
[junitlauncher]
[junitlauncher] Running org.apache.poi.xssf.usermodel.charts.TestXSSFChartTitle
[junitlauncher] Tests run: 6, Failures: 0, Aborted: 0, Skipped: 0, Time elapsed: 0.042000 sec
[junitlauncher]
[junitlauncher] Running org.apache.poi.xssf.usermodel.charts.TestXSSFDateAxis
[junitlauncher] Tests run: 1, Failures: 0, Aborted: 0, Skipped: 0, Time elapsed: 0.008000 sec
[junitlauncher]
[junitlauncher] Running org.apache.poi.xssf.usermodel.charts.TestXSSFLineChartData
[junitlauncher] Tests run: 1, Failures: 0, Aborted: 0, Skipped: 0, Time elapsed: 0.006000 sec
[junitlauncher]
[junitlauncher] Running org.apache.poi.xssf.usermodel.charts.TestXSSFScatterChartData
[junitlauncher] Tests run: 1, Failures: 0, Aborted: 0, Skipped: 0, Time elapsed: 0.005000 sec
[junitlauncher]
[junitlauncher] Running org.apache.poi.xssf.usermodel.charts.TestXSSFValueAxis
[junitlauncher] Tests run: 1, Failures: 0, Aborted: 0, Skipped: 0, Time elapsed: 0.003000 sec
[junitlauncher]
[junitlauncher] Running org.apache.poi.xssf.usermodel.extensions.TestXSSFBorder
[junitlauncher] Tests run: 1, Failures: 0, Aborted: 0, Skipped: 0, Time elapsed: 0.002000 sec
[junitlauncher]
[junitlauncher] Running org.apache.poi.xssf.usermodel.extensions.TestXSSFCellFill
[junitlauncher] Tests run: 6, Failures: 0, Aborted: 0, Skipped: 0, Time elapsed: 0.016000 sec
[junitlauncher]
[junitlauncher] Running org.apache.poi.xssf.usermodel.extensions.TestXSSFHeaderFooter
[junitlauncher] Tests run: 10, Failures: 0, Aborted: 0, Skipped: 0, Time elapsed: 0.033000 sec
[junitlauncher]
[junitlauncher] Running org.apache.poi.xssf.usermodel.helpers.TestColumnHelper
[junitlauncher] Tests run: 16, Failures: 0, Aborted: 0, Skipped: 0, Time elapsed: 0.028000 sec
[junitlauncher]
[junitlauncher] Running org.apache.poi.xssf.usermodel.helpers.TestHeaderFooterHelper
[junitlauncher] Tests run: 2, Failures: 0, Aborted: 0, Skipped: 0, Time elapsed: 0.000000 sec
[junitlauncher]
[junitlauncher] Running org.apache.poi.xssf.usermodel.helpers.TestXSSFColumnShifting
[junitlauncher] Tests run: 2, Failures: 0, Aborted: 0, Skipped: 0, Time elapsed: 0.003000 sec
[junitlauncher]
[junitlauncher] Running org.apache.poi.xssf.util.TestCTColComparator
[junitlauncher] Tests run: 2, Failures: 0, Aborted: 0, Skipped: 0, Time elapsed: 0.000000 sec
[junitlauncher]
[junitlauncher] Running org.apache.poi.xssf.util.TestEvilUnclosedBRFixingInputStream
[junitlauncher] Tests run: 3, Failures: 0, Aborted: 0, Skipped: 0, Time elapsed: 0.001000 sec
[junitlauncher]
[junitlauncher] Running org.apache.poi.xssf.util.TestNumericRanges
[junitlauncher] Tests run: 2, Failures: 0, Aborted: 0, Skipped: 0, Time elapsed: 0.001000 sec
[junitlauncher]
[junitlauncher] Running org.apache.poi.xwpf.TestAllExtendedProperties
[junitlauncher] Tests run: 1, Failures: 0, Aborted: 0, Skipped: 0, Time elapsed: 0.032000 sec
[junitlauncher]
[junitlauncher] Running org.apache.poi.xwpf.TestDocumentProtection
[junitlauncher] Tests run: 10, Failures: 0, Aborted: 0, Skipped: 0, Time elapsed: 0.395000 sec
[junitlauncher]
[junitlauncher] Running org.apache.poi.xwpf.TestNecessaryOOXMLClasses
[junitlauncher] Tests run: 1, Failures: 0, Aborted: 0, Skipped: 0, Time elapsed: 0.011000 sec
[junitlauncher]
[junitlauncher] Running org.apache.poi.xwpf.TestPackageCorePropertiesGetKeywords
[junitlauncher] Tests run: 1, Failures: 0, Aborted: 0, Skipped: 0, Time elapsed: 0.016000 sec
[junitlauncher]
[junitlauncher] Running org.apache.poi.xwpf.TestXWPFBugs
[junitlauncher] Tests run: 4, Failures: 0, Aborted: 0, Skipped: 0, Time elapsed: 0.233000 sec
[junitlauncher]
[junitlauncher] Running org.apache.poi.xwpf.extractor.TestExternalEntities
[junitlauncher] Tests run: 1, Failures: 0, Aborted: 0, Skipped: 0, Time elapsed: 0.009000 sec
[junitlauncher]
[junitlauncher] Running org.apache.poi.xwpf.extractor.TestXWPFWordExtractor
[junitlauncher] Tests run: 24, Failures: 0, Aborted: 0, Skipped: 0, Time elapsed: 0.445000 sec
[junitlauncher]
[junitlauncher] Running org.apache.poi.xwpf.model.TestXWPFDecorators
[junitlauncher] Tests run: 2, Failures: 0, Aborted: 0, Skipped: 0, Time elapsed: 0.062000 sec
[junitlauncher]
[junitlauncher] Running org.apache.poi.xwpf.model.TestXWPFHeaderFooterPolicy
[junitlauncher] Tests run: 3, Failures: 0, Aborted: 0, Skipped: 0, Time elapsed: 0.160000 sec
[junitlauncher]
[junitlauncher] Running org.apache.poi.xwpf.usermodel.TestChangeTracking
[junitlauncher] Tests run: 3, Failures: 0, Aborted: 0, Skipped: 0, Time elapsed: 0.017000 sec
[junitlauncher]
[junitlauncher] Running org.apache.poi.xwpf.usermodel.TestColumn
[junitlauncher] Tests run: 4, Failures: 0, Aborted: 0, Skipped: 0, Time elapsed: 0.039000 sec
[junitlauncher]
[junitlauncher] Running org.apache.poi.xwpf.usermodel.TestXWPFAbstractNum
[junitlauncher] Tests run: 1, Failures: 0, Aborted: 0, Skipped: 0, Time elapsed: 0.000000 sec
[junitlauncher]
[junitlauncher] Running org.apache.poi.xwpf.usermodel.TestXWPFBugs
[junitlauncher] Tests run: 10, Failures: 0, Aborted: 0, Skipped: 0, Time elapsed: 0.200000 sec
[junitlauncher]
[junitlauncher] Running org.apache.poi.xwpf.usermodel.TestXWPFChart
[junitlauncher] Tests run: 4, Failures: 0, Aborted: 0, Skipped: 0, Time elapsed: 0.044000 sec
[junitlauncher]
[junitlauncher] Running org.apache.poi.xwpf.usermodel.TestXWPFComment
[junitlauncher] Tests run: 1, Failures: 0, Aborted: 0, Skipped: 0, Time elapsed: 0.005000 sec
[junitlauncher]
[junitlauncher] Running org.apache.poi.xwpf.usermodel.TestXWPFDocument
[junitlauncher] Tests run: 21, Failures: 0, Aborted: 0, Skipped: 1, Time elapsed: 0.277000 sec
[junitlauncher]
[junitlauncher] Running org.apache.poi.xwpf.usermodel.TestXWPFEndnote
[junitlauncher] Tests run: 4, Failures: 0, Aborted: 0, Skipped: 0, Time elapsed: 0.027000 sec
[junitlauncher]
[junitlauncher] Running org.apache.poi.xwpf.usermodel.TestXWPFEndnotes
[junitlauncher] Tests run: 2, Failures: 0, Aborted: 0, Skipped: 0, Time elapsed: 0.009000 sec
[junitlauncher]
[junitlauncher] Running org.apache.poi.xwpf.usermodel.TestXWPFFootnote
[junitlauncher] Tests run: 4, Failures: 0, Aborted: 0, Skipped: 0, Time elapsed: 0.017000 sec
[junitlauncher]
[junitlauncher] Running org.apache.poi.xwpf.usermodel.TestXWPFFootnotes
[junitlauncher] Tests run: 3, Failures: 0, Aborted: 0, Skipped: 0, Time elapsed: 0.025000 sec
[junitlauncher]
[junitlauncher] Running org.apache.poi.xwpf.usermodel.TestXWPFHeader
[junitlauncher] Tests run: 6, Failures: 0, Aborted: 0, Skipped: 0, Time elapsed: 0.118000 sec
[junitlauncher]
[junitlauncher] Running org.apache.poi.xwpf.usermodel.TestXWPFHeadings
[junitlauncher] Tests run: 1, Failures: 0, Aborted: 0, Skipped: 0, Time elapsed: 0.069000 sec
[junitlauncher]
[junitlauncher] Running org.apache.poi.xwpf.usermodel.TestXWPFNumbering
[junitlauncher] Tests run: 8, Failures: 0, Aborted: 0, Skipped: 0, Time elapsed: 0.073000 sec
[junitlauncher]
[junitlauncher] Running org.apache.poi.xwpf.usermodel.TestXWPFParagraph
[junitlauncher] Tests run: 29, Failures: 0, Aborted: 0, Skipped: 0, Time elapsed: 0.168000 sec
[junitlauncher]
[junitlauncher] Running org.apache.poi.xwpf.usermodel.TestXWPFPictureData
[junitlauncher] Tests run: 5, Failures: 0, Aborted: 0, Skipped: 0, Time elapsed: 0.118000 sec
[junitlauncher]
[junitlauncher] Running org.apache.poi.xwpf.usermodel.TestXWPFRun
[junitlauncher] Tests run: 34, Failures: 0, Aborted: 0, Skipped: 0, Time elapsed: 0.251000 sec
[junitlauncher]
[junitlauncher] Running org.apache.poi.xwpf.usermodel.TestXWPFSDT
[junitlauncher] Tests run: 7, Failures: 0, Aborted: 0, Skipped: 0, Time elapsed: 0.072000 sec
[junitlauncher]
[junitlauncher] Running org.apache.poi.xwpf.usermodel.TestXWPFSmartTag
[junitlauncher] Tests run: 1, Failures: 0, Aborted: 0, Skipped: 0, Time elapsed: 0.006000 sec
[junitlauncher]
[junitlauncher] Running org.apache.poi.xwpf.usermodel.TestXWPFStyles
[junitlauncher] Tests run: 10, Failures: 0, Aborted: 0, Skipped: 0, Time elapsed: 0.097000 sec
[junitlauncher]
[junitlauncher] Running org.apache.poi.xwpf.usermodel.TestXWPFTable
[junitlauncher] Tests run: 17, Failures: 0, Aborted: 0, Skipped: 0, Time elapsed: 0.093000 sec
[junitlauncher]
[junitlauncher] Running org.apache.poi.xwpf.usermodel.TestXWPFTableCell
[junitlauncher] Tests run: 11, Failures: 0, Aborted: 0, Skipped: 1, Time elapsed: 0.059000 sec
[junitlauncher]
[junitlauncher] Running org.apache.poi.xwpf.usermodel.TestXWPFTableRow
[junitlauncher] Tests run: 8, Failures: 0, Aborted: 0, Skipped: 0, Time elapsed: 0.034000 sec

-test-ooxml-write-testfile:

compile-ooxml-lite:
     [echo] Create ooxml-lite schemas
     [copy] Copying 1 file to <https://ci-builds.apache.org/job/POI/job/POI-DSL-Windows-1.8/ws/build>
     [copy] Copying 1 file to <https://ci-builds.apache.org/job/POI/job/POI-DSL-Windows-1.8/ws/build>
     [copy] Copying 1 file to <https://ci-builds.apache.org/job/POI/job/POI-DSL-Windows-1.8/ws/build>
    [mkdir] Created dir: <https://ci-builds.apache.org/job/POI/job/POI-DSL-Windows-1.8/ws/build\dist\maven\poi-ooxml-lite>
      [jar] Building jar: <https://ci-builds.apache.org/job/POI/job/POI-DSL-Windows-1.8/ws/build\dist\maven\poi-ooxml-lite\poi-ooxml-lite-5.0.1-SNAPSHOT.jar>

-test-excelant-check:

test-excelant:
[junitlauncher]
[junitlauncher] Running org.apache.poi.ss.excelant.TestBuildFile
[junitlauncher] Tests run: 14, Failures: 0, Aborted: 0, Skipped: 0, Time elapsed: 3.233000 sec
[junitlauncher]
[junitlauncher] Running org.apache.poi.ss.excelant.TestExcelAntPrecision
[junitlauncher] Tests run: 1, Failures: 0, Aborted: 0, Skipped: 0, Time elapsed: 0.003000 sec
[junitlauncher]
[junitlauncher] Running org.apache.poi.ss.excelant.TestExcelAntSet
[junitlauncher] Tests run: 2, Failures: 0, Aborted: 0, Skipped: 0, Time elapsed: 0.013000 sec
[junitlauncher]
[junitlauncher] Running org.apache.poi.ss.excelant.TestExcelAntSetDoubleCell
[junitlauncher] Tests run: 1, Failures: 0, Aborted: 0, Skipped: 0, Time elapsed: 0.001000 sec
[junitlauncher]
[junitlauncher] Running org.apache.poi.ss.excelant.TestExcelAntUserDefinedFunction
[junitlauncher] Tests run: 2, Failures: 0, Aborted: 0, Skipped: 0, Time elapsed: 0.003000 sec
[junitlauncher]
[junitlauncher] Running org.apache.poi.ss.excelant.util.TestExcelAntEvaluationResult
[junitlauncher] Tests run: 4, Failures: 0, Aborted: 0, Skipped: 0, Time elapsed: 0.006000 sec
[junitlauncher]
[junitlauncher] Running org.apache.poi.ss.excelant.util.TestExcelAntWorkbookUtil
[junitlauncher] Tests run: 23, Failures: 0, Aborted: 0, Skipped: 0, Time elapsed: 1.641000 sec
[junitlauncher]
[junitlauncher] Running org.apache.poi.ss.excelant.util.TestExcelAntWorkbookUtilFactory
[junitlauncher] Tests run: 2, Failures: 0, Aborted: 0, Skipped: 0, Time elapsed: 0.002000 sec

-test-excelant-write-testfile:

test:

compile-integration:
    [javac] Compiling 28 source files to <https://ci-builds.apache.org/job/POI/job/POI-DSL-Windows-1.8/ws/build\integration-test-classes>
    [javac] Support for javac --release has been added in Java9 ignoring it
    [mkdir] Created dir: <https://ci-builds.apache.org/job/POI/job/POI-DSL-Windows-1.8/ws/build\integration-test-classes\META-INF\versions\9>
      [jar] Building jar: <https://ci-builds.apache.org/job/POI/job/POI-DSL-Windows-1.8/ws/build\dist\maven\poi-integration\poi-integration-5.0.1-SNAPSHOT.jar>

-test-integration-check:

test-integration:
[junitlauncher]
[junitlauncher] Running org.apache.poi.stress.TestAllFiles
[junitlauncher]    Failed: #673 integration\stress022.pptx XSLF
[junitlauncher]    Failed: #1629 spreadsheet\54764.xlsx XSSF
[junitlauncher]    Failed: #2407 spreadsheet\poc-xmlbomb-empty.xlsx XSSF
[junitlauncher]    Failed: #2409 spreadsheet\poc-xmlbomb.xlsx XSSF
[junitlauncher]    Failed: #2428 spreadsheet\sample-beta.xlsx XSSF
[junitlauncher] Tests run: 7677, Failures: 5, Aborted: 0, Skipped: 0, Time elapsed: 182.136000 sec

BUILD FAILED
<https://ci-builds.apache.org/job/POI/job/POI-DSL-Windows-1.8/ws/build.xml>:1704: The following error occurred while executing this line:
<https://ci-builds.apache.org/job/POI/job/POI-DSL-Windows-1.8/ws/build.xml>:1254: Some test(s) have failure(s)

Total time: 23 minutes 8 seconds
Build step 'Invoke Ant' marked build as failure
[SpotBugs] Skipping execution of recorder since overall result is 'FAILURE'
Archiving artifacts
[Fast Archiver] Compressed 7.40 MB of artifacts by 41.0% relative to #104
Skipping publisher since build result is FAILURE
Recording test results

---------------------------------------------------------------------
To unsubscribe, e-mail: [hidden email]
For additional commands, e-mail: [hidden email]

Reply | Threaded
Open this post in threaded view
|

Jenkins build is back to normal : POI » POI-DSL-Windows-1.8 #116

Apache Jenkins Server
See <https://ci-builds.apache.org/job/POI/job/POI-DSL-Windows-1.8/116/display/redirect?page=changes>


---------------------------------------------------------------------
To unsubscribe, e-mail: [hidden email]
For additional commands, e-mail: [hidden email]