Build failed in Jenkins: POI » POI-DSL-Windows-1.14 #43

classic Classic list List threaded Threaded
3 messages Options
Reply | Threaded
Open this post in threaded view
|

Build failed in Jenkins: POI » POI-DSL-Windows-1.14 #43

Apache Jenkins Server
See <https://ci-builds.apache.org/job/POI/job/POI-DSL-Windows-1.14/43/display/redirect?page=changes>

Changes:

[Marius Volkhart] [bug-63046] Use Log4j 2 for logging

This removes the POILogger and POILogFactory mechanism for logging. This mechanism was created at a time when the Java landscape looked very different than it does today.

Log4j 2 is an Apache Foundation project that is well maintained and is widely regarded as having good performance and capabilities. We use only the Log4j API artifact. This lets application developers choose how they want to capture logging events if at all. Integrations with Log4j 2 Core and Logback are available from the Log4j project.

Closes #224

[Andreas Beeker] Use UTF-8 when writing SVG files

[PJ Fanning] try re-eanbling xml entity config


------------------------------------------
[...truncated 20.42 KB...]
U         src\scratchpad\src\org\apache\poi\hwpf\sprm\SectionSprmUncompressor.java
U         src\scratchpad\src\org\apache\poi\hwpf\sprm\TableSprmUncompressor.java
U         src\scratchpad\src\org\apache\poi\hwpf\usermodel\Paragraph.java
U         src\scratchpad\src\org\apache\poi\hwpf\usermodel\Picture.java
U         src\scratchpad\src\org\apache\poi\hwpf\usermodel\Range.java
U         src\scratchpad\src\org\apache\poi\hwpf\usermodel\TableRow.java
U         src\scratchpad\src\org\apache\poi\hwpf\util\LittleEndianCP950Reader.java
D         src\scratchpad\testcases\log4j.properties
D         src\scratchpad\testcases\commons-logging.properties
U         src\scratchpad\testcases\org\apache\poi\hwpf\HWPFTestDataSamples.java
U         src\scratchpad\testcases\org\apache\poi\hwpf\usermodel\TestBugs.java
U         src\testcases\org\apache\poi\hpsf\basic\TestWrite.java
U         src\testcases\org\apache\poi\hssf\usermodel\TestHSSFDataFormat.java
U         src\testcases\org\apache\poi\hssf\usermodel\TestMatrixFormulasFromBinarySpreadsheet.java
U         src\testcases\org\apache\poi\poifs\filesystem\TestEmptyDocument.java
U         src\testcases\org\apache\poi\ss\usermodel\BaseTestBugzillaIssues.java
D         src\testcases\org\apache\poi\util\TestPOILogger.java
D         src\testcases\org\apache\poi\util\DummyPOILogger.java

<-- Got one external: forrest.properties, svn url: https://svn.apache.org/repos/asf/poi/site/forrest.properties -->
Fetching 'https://svn.apache.org/repos/asf/poi/site/forrest.properties' at -1 into 'F:\jenkins\jenkins-slave\712657a4\workspace\POI\POI-DSL-Windows-1.14\forrest.properties'
At revision 1886772


<-- Got one external: documentation, svn url: https://svn.apache.org/repos/asf/poi/site/src/documentation -->
Fetching 'https://svn.apache.org/repos/asf/poi/site/src/documentation' at -1 into 'F:\jenkins\jenkins-slave\712657a4\workspace\POI\POI-DSL-Windows-1.14\src\documentation'
At revision 1886772

At revision 1886772

No changes for https://svn.apache.org/repos/asf/poi/site/forrest.properties since the previous build
No changes for https://svn.apache.org/repos/asf/poi/site/src/documentation since the previous build
[POI-DSL-Windows-1.14] $ cmd /c call F:\jenkins\jenkins-slave\temp\jenkins5146496786895786980.bat
    X   forrest.properties
X       src\documentation
?       src\integrationtest\build
M       src\multimodule\examples\java9\module-info.class
M       src\multimodule\excelant\java9\module-info.class
M       src\multimodule\poi\java9\module-info.class

Performing status on external item at 'src\documentation':
Java-Home: f:\\jenkins\\tools\\java\\latest14
 Volume in drive F is data
 Volume Serial Number is 20C7-E1AB

 Directory of f:\jenkins\tools\java\latest14

07/24/2019  07:22 AM    <DIR>          .
07/24/2019  07:22 AM    <DIR>          ..
07/24/2019  07:22 AM    <DIR>          bin
07/24/2019  07:22 AM    <DIR>          conf
07/24/2019  07:22 AM    <DIR>          include
07/24/2019  07:22 AM    <DIR>          jmods
07/24/2019  07:22 AM    <DIR>          legal
07/24/2019  07:22 AM    <DIR>          lib
07/17/2019  02:16 AM             1,213 release
               1 File(s)          1,213 bytes
               8 Dir(s)  881,883,664,384 bytes free
openjdk version "14-ea" 2020-03-17
OpenJDK Runtime Environment (build 14-ea+6-171)
OpenJDK 64-Bit Server VM (build 14-ea+6-171, mixed mode, sharing)
[POI-DSL-Windows-1.14] $ cmd.exe /C "F:\jenkins\tools\ant\latest1.10\bin\ant.bat -Dcoverage.enabled=true clean jenkins && exit %%ERRORLEVEL%%"
Buildfile: <https://ci-builds.apache.org/job/POI/job/POI-DSL-Windows-1.14/ws/build.xml>

clean:
   [delete] Deleting directory <https://ci-builds.apache.org/job/POI/job/POI-DSL-Windows-1.14/ws/build>

replaceVersion:

check-jars:

fetch-jars:
      [get] Getting: https://repo1.maven.org/maven2/commons-logging/commons-logging/1.2/commons-logging-1.2.jar
      [get] To: <https://ci-builds.apache.org/job/POI/job/POI-DSL-Windows-1.14/ws/lib\main-tests\commons-logging-1.2.jar>
      [get] Destination already exists (skipping): <https://ci-builds.apache.org/job/POI/job/POI-DSL-Windows-1.14/ws/lib\main\commons-codec-1.15.jar>
      [get] Destination already exists (skipping): <https://ci-builds.apache.org/job/POI/job/POI-DSL-Windows-1.14/ws/lib\main-tests\junit-jupiter-api-5.7.0.jar>
      [get] Destination already exists (skipping): <https://ci-builds.apache.org/job/POI/job/POI-DSL-Windows-1.14/ws/lib\main-tests\junit-jupiter-engine-5.7.0.jar>
      [get] Destination already exists (skipping): <https://ci-builds.apache.org/job/POI/job/POI-DSL-Windows-1.14/ws/lib\main-tests\junit-jupiter-params-5.7.0.jar>
      [get] Destination already exists (skipping): <https://ci-builds.apache.org/job/POI/job/POI-DSL-Windows-1.14/ws/lib\main-tests\junit-platform-launcher-1.7.0.jar>
      [get] Destination already exists (skipping): <https://ci-builds.apache.org/job/POI/job/POI-DSL-Windows-1.14/ws/lib\main-tests\junit-platform-engine-1.7.0.jar>
      [get] Destination already exists (skipping): <https://ci-builds.apache.org/job/POI/job/POI-DSL-Windows-1.14/ws/lib\main-tests\junit-platform-commons-1.7.0.jar>
      [get] Destination already exists (skipping): <https://ci-builds.apache.org/job/POI/job/POI-DSL-Windows-1.14/ws/lib\main-tests\opentest4j-1.2.0.jar>
      [get] Destination already exists (skipping): <https://ci-builds.apache.org/job/POI/job/POI-DSL-Windows-1.14/ws/lib\main-tests\apiguardian-api-1.1.0.jar>
      [get] Destination already exists (skipping): <https://ci-builds.apache.org/job/POI/job/POI-DSL-Windows-1.14/ws/lib\main-tests\jmh-core-1.27.jar>
      [get] Destination already exists (skipping): <https://ci-builds.apache.org/job/POI/job/POI-DSL-Windows-1.14/ws/lib\main-tests\jmh-generator-annprocess-1.27.jar>
      [get] Destination already exists (skipping): <https://ci-builds.apache.org/job/POI/job/POI-DSL-Windows-1.14/ws/lib\main-tests\hamcrest-2.2.jar>
      [get] Destination already exists (skipping): <https://ci-builds.apache.org/job/POI/job/POI-DSL-Windows-1.14/ws/lib\main-tests\xmlunit-core-2.8.2.jar>
      [get] Destination already exists (skipping): <https://ci-builds.apache.org/job/POI/job/POI-DSL-Windows-1.14/ws/lib\main-tests\mockito-core-3.6.28.jar>
      [get] Destination already exists (skipping): <https://ci-builds.apache.org/job/POI/job/POI-DSL-Windows-1.14/ws/lib\main-tests\byte-buddy-1.10.19.jar>
      [get] Destination already exists (skipping): <https://ci-builds.apache.org/job/POI/job/POI-DSL-Windows-1.14/ws/lib\main-tests\byte-buddy-agent-1.10.19.jar>
      [get] Destination already exists (skipping): <https://ci-builds.apache.org/job/POI/job/POI-DSL-Windows-1.14/ws/lib\main-tests\objenesis-3.1.jar>
      [get] Destination already exists (skipping): <https://ci-builds.apache.org/job/POI/job/POI-DSL-Windows-1.14/ws/lib\excelant\ant-1.10.9.jar>
      [get] Destination already exists (skipping): <https://ci-builds.apache.org/job/POI/job/POI-DSL-Windows-1.14/ws/lib\excelant\ant-launcher-1.10.9.jar>
      [get] Getting: https://repo1.maven.org/maven2/org/slf4j/slf4j-api/1.7.30/slf4j-api-1.7.30.jar
      [get] To: <https://ci-builds.apache.org/job/POI/job/POI-DSL-Windows-1.14/ws/lib\main-tests\slf4j-api-1.7.30.jar>
      [get] Getting: https://repo1.maven.org/maven2/org/apache/logging/log4j/log4j-api/2.14.0/log4j-api-2.14.0.jar
      [get] To: <https://ci-builds.apache.org/job/POI/job/POI-DSL-Windows-1.14/ws/lib\main\log4j-api-2.14.0.jar>
      [get] Getting: https://repo1.maven.org/maven2/org/apache/logging/log4j/log4j-core/2.14.0/log4j-core-2.14.0.jar
      [get] To: <https://ci-builds.apache.org/job/POI/job/POI-DSL-Windows-1.14/ws/lib\main-tests\log4j-core-2.14.0.jar>
      [get] Destination already exists (skipping): <https://ci-builds.apache.org/job/POI/job/POI-DSL-Windows-1.14/ws/lib\util\asm-9.0.jar>
      [get] Destination already exists (skipping): <https://ci-builds.apache.org/job/POI/job/POI-DSL-Windows-1.14/ws/lib\util\asm-commons-9.0.jar>
      [get] Destination already exists (skipping): <https://ci-builds.apache.org/job/POI/job/POI-DSL-Windows-1.14/ws/lib\util\asm-tree-9.0.jar>
      [get] Destination already exists (skipping): <https://ci-builds.apache.org/job/POI/job/POI-DSL-Windows-1.14/ws/lib\util\jacoco-0.8.6.zip>
      [get] Destination already exists (skipping): <https://ci-builds.apache.org/job/POI/job/POI-DSL-Windows-1.14/ws/lib\main\commons-collections4-4.4.jar>
      [get] Destination already exists (skipping): <https://ci-builds.apache.org/job/POI/job/POI-DSL-Windows-1.14/ws/lib\main\commons-math3-3.6.1.jar>
      [get] Destination already exists (skipping): <https://ci-builds.apache.org/job/POI/job/POI-DSL-Windows-1.14/ws/lib\main\SparseBitSet-1.2.jar>
    [unzip] Expanding: <https://ci-builds.apache.org/job/POI/job/POI-DSL-Windows-1.14/ws/lib\util\jacoco-0.8.6.zip> into <https://ci-builds.apache.org/job/POI/job/POI-DSL-Windows-1.14/ws/lib\util>
      [get] Destination already exists (skipping): <https://ci-builds.apache.org/job/POI/job/POI-DSL-Windows-1.14/ws/lib\util\apache-rat-0.13.jar>
      [get] Destination already exists (skipping): <https://ci-builds.apache.org/job/POI/job/POI-DSL-Windows-1.14/ws/lib\util\forbiddenapis-3.1.jar>
      [get] Destination already exists (skipping): <https://ci-builds.apache.org/job/POI/job/POI-DSL-Windows-1.14/ws/lib\ooxml-provided\bcprov-jdk15on-1.68.jar>
      [get] Destination already exists (skipping): <https://ci-builds.apache.org/job/POI/job/POI-DSL-Windows-1.14/ws/lib\ooxml-provided\bcpkix-jdk15on-1.68.jar>
      [get] Destination already exists (skipping): <https://ci-builds.apache.org/job/POI/job/POI-DSL-Windows-1.14/ws/lib\ooxml-provided\xmlsec-2.2.1.jar>

check-ooxml-jars:

fetch-ooxml-jars:
      [get] Destination already exists (skipping): <https://ci-builds.apache.org/job/POI/job/POI-DSL-Windows-1.14/ws/lib\ooxml\curvesapi-1.06.jar>
      [get] Getting: https://repo1.maven.org/maven2/org/apache/xmlbeans/xmlbeans/4.0.0/xmlbeans-4.0.0.jar
      [get] To: <https://ci-builds.apache.org/job/POI/job/POI-DSL-Windows-1.14/ws/lib\ooxml\xmlbeans-4.0.0.jar>
      [get] Destination already exists (skipping): <https://ci-builds.apache.org/job/POI/job/POI-DSL-Windows-1.14/ws/lib\ooxml\commons-compress-1.20.jar>
      [get] Destination already exists (skipping): <https://ci-builds.apache.org/job/POI/job/POI-DSL-Windows-1.14/ws/lib\ooxml-tests\reflections-0.9.12.jar>
      [get] Destination already exists (skipping): <https://ci-builds.apache.org/job/POI/job/POI-DSL-Windows-1.14/ws/lib\ooxml-tests\guava-30.1-jre.jar>
      [get] Destination already exists (skipping): <https://ci-builds.apache.org/job/POI/job/POI-DSL-Windows-1.14/ws/lib\ooxml-tests\javassist-3.27.0-GA.jar>
      [get] Destination already exists (skipping): <https://ci-builds.apache.org/job/POI/job/POI-DSL-Windows-1.14/ws/lib\ooxml-provided\batik-all-1.14.jar>
      [get] Destination already exists (skipping): <https://ci-builds.apache.org/job/POI/job/POI-DSL-Windows-1.14/ws/lib\ooxml-provided\xml-apis-ext-1.3.04.jar>
      [get] Destination already exists (skipping): <https://ci-builds.apache.org/job/POI/job/POI-DSL-Windows-1.14/ws/lib\ooxml-provided\xmlgraphics-commons-2.4.jar>
      [get] Destination already exists (skipping): <https://ci-builds.apache.org/job/POI/job/POI-DSL-Windows-1.14/ws/lib\ooxml-provided\pdfbox-2.0.22.jar>
      [get] Destination already exists (skipping): <https://ci-builds.apache.org/job/POI/job/POI-DSL-Windows-1.14/ws/lib\ooxml-provided\fontbox-2.0.22.jar>
      [get] Destination already exists (skipping): <https://ci-builds.apache.org/job/POI/job/POI-DSL-Windows-1.14/ws/lib\ooxml-provided\graphics2d-0.30.jar>

init:
    [mkdir] Created dir: <https://ci-builds.apache.org/job/POI/job/POI-DSL-Windows-1.14/ws/build>
    [mkdir] Created dir: <https://ci-builds.apache.org/job/POI/job/POI-DSL-Windows-1.14/ws/build\classes>
    [mkdir] Created dir: <https://ci-builds.apache.org/job/POI/job/POI-DSL-Windows-1.14/ws/build\test-classes>
    [mkdir] Created dir: <https://ci-builds.apache.org/job/POI/job/POI-DSL-Windows-1.14/ws/build\test-results>
    [mkdir] Created dir: <https://ci-builds.apache.org/job/POI/job/POI-DSL-Windows-1.14/ws/build\scratchpad-classes>
    [mkdir] Created dir: <https://ci-builds.apache.org/job/POI/job/POI-DSL-Windows-1.14/ws/build\scratchpad-test-classes>
    [mkdir] Created dir: <https://ci-builds.apache.org/job/POI/job/POI-DSL-Windows-1.14/ws/build\scratchpad-test-results>
    [mkdir] Created dir: <https://ci-builds.apache.org/job/POI/job/POI-DSL-Windows-1.14/ws/build\geometry-java>
    [mkdir] Created dir: <https://ci-builds.apache.org/job/POI/job/POI-DSL-Windows-1.14/ws/build\ooxml-classes>
    [mkdir] Created dir: <https://ci-builds.apache.org/job/POI/job/POI-DSL-Windows-1.14/ws/build\ooxml-test-classes>
    [mkdir] Created dir: <https://ci-builds.apache.org/job/POI/job/POI-DSL-Windows-1.14/ws/build\ooxml-test-results>
    [mkdir] Created dir: <https://ci-builds.apache.org/job/POI/job/POI-DSL-Windows-1.14/ws/build\excelant-classes>
    [mkdir] Created dir: <https://ci-builds.apache.org/job/POI/job/POI-DSL-Windows-1.14/ws/build\excelant-test-classes>
    [mkdir] Created dir: <https://ci-builds.apache.org/job/POI/job/POI-DSL-Windows-1.14/ws/build\excelant-test-results>
    [mkdir] Created dir: <https://ci-builds.apache.org/job/POI/job/POI-DSL-Windows-1.14/ws/build\examples-classes>
    [mkdir] Created dir: <https://ci-builds.apache.org/job/POI/job/POI-DSL-Windows-1.14/ws/build\integration-test-classes>
    [mkdir] Created dir: <https://ci-builds.apache.org/job/POI/job/POI-DSL-Windows-1.14/ws/build\integration-test-results>
    [mkdir] Created dir: <https://ci-builds.apache.org/job/POI/job/POI-DSL-Windows-1.14/ws/build\dist>
    [mkdir] Created dir: <https://ci-builds.apache.org/job/POI/job/POI-DSL-Windows-1.14/ws/build\site>
     [echo] Using Ant: Apache Ant(TM) version 1.10.9 compiled on September 27 2020 from F:\\jenkins\\tools\\ant\\latest1.10, Ant detected Java 14 (may be different than actual Java sometimes...)
     [echo] Using Java: 14-ea/14-ea+6-171/14-ea+6-171/OpenJDK 64-Bit Server VM from Oracle Corporation on Windows Server 2016: 10.0
     [echo] Building Apache POI version 5.0.1-SNAPSHOT and RC: RC1

-version-java-check:

compile-version:
     [copy] Copying 1 file to <https://ci-builds.apache.org/job/POI/job/POI-DSL-Windows-1.14/ws/build\classes\org\apache\poi>
    [javac] Compiling 1 source file to <https://ci-builds.apache.org/job/POI/job/POI-DSL-Windows-1.14/ws/build\classes>
    [javac] warning: [options] bootstrap class path not set in conjunction with -source 8
    [javac] 1 warning
   [delete] Deleting: <https://ci-builds.apache.org/job/POI/job/POI-DSL-Windows-1.14/ws/build\classes\org\apache\poi\Version.java>

compile-main:
    [javac] Compiling 1171 source files to <https://ci-builds.apache.org/job/POI/job/POI-DSL-Windows-1.14/ws/build\classes>
    [javac] Ignoring source, target and bootclasspath as release has been set
    [javac] Note: Some input files use or override a deprecated API.
    [javac] Note: Recompile with -Xlint:deprecation for details.
    [javac] Note: Some input files use unchecked or unsafe operations.
    [javac] Note: Recompile with -Xlint:unchecked for details.
    [javac] Creating empty <https://ci-builds.apache.org/job/POI/job/POI-DSL-Windows-1.14/ws/build\classes\org\apache\poi\ddf\package-info.class>
    [javac] Creating empty <https://ci-builds.apache.org/job/POI/job/POI-DSL-Windows-1.14/ws/build\classes\org\apache\poi\hssf\package-info.class>
    [javac] Creating empty <https://ci-builds.apache.org/job/POI/job/POI-DSL-Windows-1.14/ws/build\classes\org\apache\poi\poifs\dev\package-info.class>
    [javac] Creating empty <https://ci-builds.apache.org/job/POI/job/POI-DSL-Windows-1.14/ws/build\classes\org\apache\poi\util\package-info.class>
    [javac] Creating empty <https://ci-builds.apache.org/job/POI/job/POI-DSL-Windows-1.14/ws/build\classes\org\apache\poi\poifs\common\package-info.class>
    [javac] Creating empty <https://ci-builds.apache.org/job/POI/job/POI-DSL-Windows-1.14/ws/build\classes\org\apache\poi\hssf\record\package-info.class>
    [javac] Creating empty <https://ci-builds.apache.org/job/POI/job/POI-DSL-Windows-1.14/ws/build\classes\org\apache\poi\poifs\package-info.class>
    [javac] Creating empty <https://ci-builds.apache.org/job/POI/job/POI-DSL-Windows-1.14/ws/build\classes\org\apache\poi\poifs\crypt\package-info.class>
    [javac] Creating empty <https://ci-builds.apache.org/job/POI/job/POI-DSL-Windows-1.14/ws/build\classes\org\apache\poi\hpsf\wellknown\package-info.class>
    [javac] Creating empty <https://ci-builds.apache.org/job/POI/job/POI-DSL-Windows-1.14/ws/build\classes\org\apache\poi\hssf\dev\package-info.class>
    [javac] Creating empty <https://ci-builds.apache.org/job/POI/job/POI-DSL-Windows-1.14/ws/build\classes\org\apache\poi\ss\formula\package-info.class>
    [javac] Creating empty <https://ci-builds.apache.org/job/POI/job/POI-DSL-Windows-1.14/ws/build\classes\org\apache\poi\hpsf\package-info.class>
    [javac] Creating empty <https://ci-builds.apache.org/job/POI/job/POI-DSL-Windows-1.14/ws/build\classes\org\apache\poi\poifs\property\package-info.class>
    [javac] Creating empty <https://ci-builds.apache.org/job/POI/job/POI-DSL-Windows-1.14/ws/build\classes\org\apache\poi\poifs\filesystem\package-info.class>
    [javac] Creating empty <https://ci-builds.apache.org/job/POI/job/POI-DSL-Windows-1.14/ws/build\classes\org\apache\poi\ss\formula\ptg\package-info.class>
    [javac] Creating empty <https://ci-builds.apache.org/job/POI/job/POI-DSL-Windows-1.14/ws/build\classes\org\apache\poi\poifs\storage\package-info.class>
    [javac] Creating empty <https://ci-builds.apache.org/job/POI/job/POI-DSL-Windows-1.14/ws/build\classes\org\apache\poi\hssf\eventusermodel\package-info.class>
    [javac] Creating empty <https://ci-builds.apache.org/job/POI/job/POI-DSL-Windows-1.14/ws/build\classes\org\apache\poi\hssf\record\aggregates\package-info.class>
    [javac] Creating empty <https://ci-builds.apache.org/job/POI/job/POI-DSL-Windows-1.14/ws/build\classes\org\apache\poi\ss\format\package-info.class>
    [javac] Creating empty <https://ci-builds.apache.org/job/POI/job/POI-DSL-Windows-1.14/ws/build\classes\org\apache\poi\hssf\model\package-info.class>
    [javac] Creating empty <https://ci-builds.apache.org/job/POI/job/POI-DSL-Windows-1.14/ws/build\classes\org\apache\poi\hssf\usermodel\package-info.class>
    [javac] Creating empty <https://ci-builds.apache.org/job/POI/job/POI-DSL-Windows-1.14/ws/build\classes\org\apache\poi\hssf\util\package-info.class>
    [javac] Creating empty <https://ci-builds.apache.org/job/POI/job/POI-DSL-Windows-1.14/ws/build\classes\org\apache\poi\poifs\eventfilesystem\package-info.class>
    [javac] Compiling 1 source file to <https://ci-builds.apache.org/job/POI/job/POI-DSL-Windows-1.14/ws/src\multimodule\poi\java9>
    [javac] error: the unnamed module reads package org.apache.commons.logging from both commons.logging and org.apache.commons.logging
    [javac] error: the unnamed module reads package org.apache.commons.logging.impl from both commons.logging and org.apache.commons.logging
    [javac] error: module commons.math3 reads package org.apache.commons.logging from both commons.logging and org.apache.commons.logging
    [javac] error: module commons.math3 reads package org.apache.commons.logging.impl from both commons.logging and org.apache.commons.logging
    [javac] error: module org.apache.commons.codec reads package org.apache.commons.logging from both commons.logging and org.apache.commons.logging
    [javac] error: module org.apache.commons.codec reads package org.apache.commons.logging.impl from both commons.logging and org.apache.commons.logging
    [javac] error: module org.apache.commons.logging reads package org.apache.commons.logging from both commons.logging and org.apache.commons.logging
    [javac] error: module org.apache.commons.logging reads package org.apache.commons.logging.impl from both commons.logging and org.apache.commons.logging
    [javac] error: module org.slf4j reads package org.apache.commons.logging from both commons.logging and org.apache.commons.logging
    [javac] error: module org.slf4j reads package org.apache.commons.logging.impl from both commons.logging and org.apache.commons.logging
    [javac] error: module net.bytebuddy reads package org.apache.commons.logging from both commons.logging and org.apache.commons.logging
    [javac] error: module net.bytebuddy reads package org.apache.commons.logging.impl from both commons.logging and org.apache.commons.logging
    [javac] error: module net.bytebuddy.agent reads package org.apache.commons.logging from both commons.logging and org.apache.commons.logging
    [javac] error: module net.bytebuddy.agent reads package org.apache.commons.logging.impl from both commons.logging and org.apache.commons.logging
    [javac] error: module commons.logging reads package org.apache.commons.logging from both commons.logging and org.apache.commons.logging
    [javac] error: module commons.logging reads package org.apache.commons.logging.impl from both commons.logging and org.apache.commons.logging
    [javac] error: module org.hamcrest reads package org.apache.commons.logging from both commons.logging and org.apache.commons.logging
    [javac] error: module org.hamcrest reads package org.apache.commons.logging.impl from both commons.logging and org.apache.commons.logging
    [javac] error: module jmh.core reads package org.apache.commons.logging from both commons.logging and org.apache.commons.logging
    [javac] error: module jmh.core reads package org.apache.commons.logging.impl from both commons.logging and org.apache.commons.logging
    [javac] error: module jmh.generator.annprocess reads package org.apache.commons.logging from both commons.logging and org.apache.commons.logging
    [javac] error: module jmh.generator.annprocess reads package org.apache.commons.logging.impl from both commons.logging and org.apache.commons.logging
    [javac] error: module org.apache.logging.log4j.core reads package org.apache.commons.logging from both commons.logging and org.apache.commons.logging
    [javac] error: module org.apache.logging.log4j.core reads package org.apache.commons.logging.impl from both commons.logging and org.apache.commons.logging
    [javac] error: module org.mockito reads package org.apache.commons.logging from both commons.logging and org.apache.commons.logging
    [javac] error: module org.mockito reads package org.apache.commons.logging.impl from both commons.logging and org.apache.commons.logging
    [javac] error: module org.objenesis reads package org.apache.commons.logging from both commons.logging and org.apache.commons.logging
    [javac] error: module org.objenesis reads package org.apache.commons.logging.impl from both commons.logging and org.apache.commons.logging
    [javac] error: module org.slf4j.simple reads package org.apache.commons.logging from both commons.logging and org.apache.commons.logging
    [javac] error: module org.slf4j.simple reads package org.apache.commons.logging.impl from both commons.logging and org.apache.commons.logging
    [javac] error: module org.xmlunit reads package org.apache.commons.logging from both commons.logging and org.apache.commons.logging
    [javac] error: module org.xmlunit reads package org.apache.commons.logging.impl from both commons.logging and org.apache.commons.logging
    [javac] error: module SparseBitSet reads package org.apache.commons.logging from both commons.logging and org.apache.commons.logging
    [javac] error: module SparseBitSet reads package org.apache.commons.logging.impl from both commons.logging and org.apache.commons.logging
    [javac] error: module org.apache.logging.log4j reads package org.apache.commons.logging from both commons.logging and org.apache.commons.logging
    [javac] error: module org.apache.logging.log4j reads package org.apache.commons.logging.impl from both commons.logging and org.apache.commons.logging
    [javac] error: module org.apache.commons.collections4 reads package org.apache.commons.logging from both commons.logging and org.apache.commons.logging
    [javac] error: module org.apache.commons.collections4 reads package org.apache.commons.logging.impl from both commons.logging and org.apache.commons.logging
    [javac] <https://ci-builds.apache.org/job/POI/job/POI-DSL-Windows-1.14/ws/src\multimodule\poi\java9\module-info.java>:18: error: module org.apache.poi.poi reads package org.apache.commons.logging from both commons.logging and org.apache.commons.logging
    [javac] module org.apache.poi.poi {
    [javac] ^
    [javac] 39 errors

BUILD FAILED
<https://ci-builds.apache.org/job/POI/job/POI-DSL-Windows-1.14/ws/build.xml>:1099: The following error occurred while executing this line:
<https://ci-builds.apache.org/job/POI/job/POI-DSL-Windows-1.14/ws/build.xml>:986: Compile failed; see the compiler error output for details.

Total time: 1 minute 26 seconds
Build step 'Invoke Ant' marked build as failure
[SpotBugs] Skipping execution of recorder since overall result is 'FAILURE'
Archiving artifacts
[Fast Archiver] Compressed 3.09 MB of artifacts by 99.2% relative to #42
[WARNINGS] Skipping publisher since build result is FAILURE
Recording test results
ERROR: Step ‘Publish JUnit test result report’ failed: No test report files were found. Configuration error?

---------------------------------------------------------------------
To unsubscribe, e-mail: [hidden email]
For additional commands, e-mail: [hidden email]

Reply | Threaded
Open this post in threaded view
|

Build failed in Jenkins: POI » POI-DSL-Windows-1.14 #44

Apache Jenkins Server
See <https://ci-builds.apache.org/job/POI/job/POI-DSL-Windows-1.14/44/display/redirect?page=changes>

Changes:

[Andreas Beeker] Use upcoming XmlBeans 5.0.0 (working version 4.0.1)
Make batik optional as it doesn't work on the module-path
Use sub-components of batik as batik-all references them all again resulting in duplicated entries (maven poms haven't been migrated yet ...)
Remove SLF4j dependency


------------------------------------------
[...truncated 12.28 KB...]
      [get] To: <https://ci-builds.apache.org/job/POI/job/POI-DSL-Windows-1.14/ws/lib\ooxml-batik\xmlgraphics-commons-2.4.jar>
      [get] Destination already exists (skipping): <https://ci-builds.apache.org/job/POI/job/POI-DSL-Windows-1.14/ws/lib\ooxml-provided\pdfbox-2.0.22.jar>
      [get] Destination already exists (skipping): <https://ci-builds.apache.org/job/POI/job/POI-DSL-Windows-1.14/ws/lib\ooxml-provided\fontbox-2.0.22.jar>
      [get] Destination already exists (skipping): <https://ci-builds.apache.org/job/POI/job/POI-DSL-Windows-1.14/ws/lib\ooxml-provided\graphics2d-0.30.jar>

init:
    [mkdir] Created dir: <https://ci-builds.apache.org/job/POI/job/POI-DSL-Windows-1.14/ws/build>
    [mkdir] Created dir: <https://ci-builds.apache.org/job/POI/job/POI-DSL-Windows-1.14/ws/build\classes>
    [mkdir] Created dir: <https://ci-builds.apache.org/job/POI/job/POI-DSL-Windows-1.14/ws/build\test-classes>
    [mkdir] Created dir: <https://ci-builds.apache.org/job/POI/job/POI-DSL-Windows-1.14/ws/build\test-results>
    [mkdir] Created dir: <https://ci-builds.apache.org/job/POI/job/POI-DSL-Windows-1.14/ws/build\scratchpad-classes>
    [mkdir] Created dir: <https://ci-builds.apache.org/job/POI/job/POI-DSL-Windows-1.14/ws/build\scratchpad-test-classes>
    [mkdir] Created dir: <https://ci-builds.apache.org/job/POI/job/POI-DSL-Windows-1.14/ws/build\scratchpad-test-results>
    [mkdir] Created dir: <https://ci-builds.apache.org/job/POI/job/POI-DSL-Windows-1.14/ws/build\geometry-java>
    [mkdir] Created dir: <https://ci-builds.apache.org/job/POI/job/POI-DSL-Windows-1.14/ws/build\ooxml-classes>
    [mkdir] Created dir: <https://ci-builds.apache.org/job/POI/job/POI-DSL-Windows-1.14/ws/build\ooxml-test-classes>
    [mkdir] Created dir: <https://ci-builds.apache.org/job/POI/job/POI-DSL-Windows-1.14/ws/build\ooxml-test-results>
    [mkdir] Created dir: <https://ci-builds.apache.org/job/POI/job/POI-DSL-Windows-1.14/ws/build\excelant-classes>
    [mkdir] Created dir: <https://ci-builds.apache.org/job/POI/job/POI-DSL-Windows-1.14/ws/build\excelant-test-classes>
    [mkdir] Created dir: <https://ci-builds.apache.org/job/POI/job/POI-DSL-Windows-1.14/ws/build\excelant-test-results>
    [mkdir] Created dir: <https://ci-builds.apache.org/job/POI/job/POI-DSL-Windows-1.14/ws/build\examples-classes>
    [mkdir] Created dir: <https://ci-builds.apache.org/job/POI/job/POI-DSL-Windows-1.14/ws/build\integration-test-classes>
    [mkdir] Created dir: <https://ci-builds.apache.org/job/POI/job/POI-DSL-Windows-1.14/ws/build\integration-test-results>
    [mkdir] Created dir: <https://ci-builds.apache.org/job/POI/job/POI-DSL-Windows-1.14/ws/build\dist>
    [mkdir] Created dir: <https://ci-builds.apache.org/job/POI/job/POI-DSL-Windows-1.14/ws/build\site>
     [echo] Using Ant: Apache Ant(TM) version 1.10.9 compiled on September 27 2020 from F:\\jenkins\\tools\\ant\\latest1.10, Ant detected Java 14 (may be different than actual Java sometimes...)
     [echo] Using Java: 14-ea/14-ea+6-171/14-ea+6-171/OpenJDK 64-Bit Server VM from Oracle Corporation on Windows Server 2016: 10.0
     [echo] Building Apache POI version 5.0.1-SNAPSHOT and RC: RC1

-version-java-check:

compile-version:
     [copy] Copying 1 file to <https://ci-builds.apache.org/job/POI/job/POI-DSL-Windows-1.14/ws/build\classes\org\apache\poi>
    [javac] Compiling 1 source file to <https://ci-builds.apache.org/job/POI/job/POI-DSL-Windows-1.14/ws/build\classes>
    [javac] warning: [options] bootstrap class path not set in conjunction with -source 8
    [javac] 1 warning
   [delete] Deleting: <https://ci-builds.apache.org/job/POI/job/POI-DSL-Windows-1.14/ws/build\classes\org\apache\poi\Version.java>

compile-main:
    [javac] Compiling 1171 source files to <https://ci-builds.apache.org/job/POI/job/POI-DSL-Windows-1.14/ws/build\classes>
    [javac] Ignoring source, target and bootclasspath as release has been set
    [javac] Note: Some input files use or override a deprecated API.
    [javac] Note: Recompile with -Xlint:deprecation for details.
    [javac] Note: Some input files use unchecked or unsafe operations.
    [javac] Note: Recompile with -Xlint:unchecked for details.
    [javac] Creating empty <https://ci-builds.apache.org/job/POI/job/POI-DSL-Windows-1.14/ws/build\classes\org\apache\poi\ddf\package-info.class>
    [javac] Creating empty <https://ci-builds.apache.org/job/POI/job/POI-DSL-Windows-1.14/ws/build\classes\org\apache\poi\hssf\package-info.class>
    [javac] Creating empty <https://ci-builds.apache.org/job/POI/job/POI-DSL-Windows-1.14/ws/build\classes\org\apache\poi\poifs\dev\package-info.class>
    [javac] Creating empty <https://ci-builds.apache.org/job/POI/job/POI-DSL-Windows-1.14/ws/build\classes\org\apache\poi\util\package-info.class>
    [javac] Creating empty <https://ci-builds.apache.org/job/POI/job/POI-DSL-Windows-1.14/ws/build\classes\org\apache\poi\poifs\common\package-info.class>
    [javac] Creating empty <https://ci-builds.apache.org/job/POI/job/POI-DSL-Windows-1.14/ws/build\classes\org\apache\poi\hssf\record\package-info.class>
    [javac] Creating empty <https://ci-builds.apache.org/job/POI/job/POI-DSL-Windows-1.14/ws/build\classes\org\apache\poi\poifs\package-info.class>
    [javac] Creating empty <https://ci-builds.apache.org/job/POI/job/POI-DSL-Windows-1.14/ws/build\classes\org\apache\poi\poifs\crypt\package-info.class>
    [javac] Creating empty <https://ci-builds.apache.org/job/POI/job/POI-DSL-Windows-1.14/ws/build\classes\org\apache\poi\hpsf\wellknown\package-info.class>
    [javac] Creating empty <https://ci-builds.apache.org/job/POI/job/POI-DSL-Windows-1.14/ws/build\classes\org\apache\poi\hssf\dev\package-info.class>
    [javac] Creating empty <https://ci-builds.apache.org/job/POI/job/POI-DSL-Windows-1.14/ws/build\classes\org\apache\poi\ss\formula\package-info.class>
    [javac] Creating empty <https://ci-builds.apache.org/job/POI/job/POI-DSL-Windows-1.14/ws/build\classes\org\apache\poi\hpsf\package-info.class>
    [javac] Creating empty <https://ci-builds.apache.org/job/POI/job/POI-DSL-Windows-1.14/ws/build\classes\org\apache\poi\poifs\property\package-info.class>
    [javac] Creating empty <https://ci-builds.apache.org/job/POI/job/POI-DSL-Windows-1.14/ws/build\classes\org\apache\poi\poifs\filesystem\package-info.class>
    [javac] Creating empty <https://ci-builds.apache.org/job/POI/job/POI-DSL-Windows-1.14/ws/build\classes\org\apache\poi\ss\formula\ptg\package-info.class>
    [javac] Creating empty <https://ci-builds.apache.org/job/POI/job/POI-DSL-Windows-1.14/ws/build\classes\org\apache\poi\poifs\storage\package-info.class>
    [javac] Creating empty <https://ci-builds.apache.org/job/POI/job/POI-DSL-Windows-1.14/ws/build\classes\org\apache\poi\hssf\eventusermodel\package-info.class>
    [javac] Creating empty <https://ci-builds.apache.org/job/POI/job/POI-DSL-Windows-1.14/ws/build\classes\org\apache\poi\hssf\record\aggregates\package-info.class>
    [javac] Creating empty <https://ci-builds.apache.org/job/POI/job/POI-DSL-Windows-1.14/ws/build\classes\org\apache\poi\ss\format\package-info.class>
    [javac] Creating empty <https://ci-builds.apache.org/job/POI/job/POI-DSL-Windows-1.14/ws/build\classes\org\apache\poi\hssf\model\package-info.class>
    [javac] Creating empty <https://ci-builds.apache.org/job/POI/job/POI-DSL-Windows-1.14/ws/build\classes\org\apache\poi\hssf\usermodel\package-info.class>
    [javac] Creating empty <https://ci-builds.apache.org/job/POI/job/POI-DSL-Windows-1.14/ws/build\classes\org\apache\poi\hssf\util\package-info.class>
    [javac] Creating empty <https://ci-builds.apache.org/job/POI/job/POI-DSL-Windows-1.14/ws/build\classes\org\apache\poi\poifs\eventfilesystem\package-info.class>
    [javac] Compiling 1 source file to <https://ci-builds.apache.org/job/POI/job/POI-DSL-Windows-1.14/ws/src\multimodule\poi\java9>
    [mkdir] Created dir: <https://ci-builds.apache.org/job/POI/job/POI-DSL-Windows-1.14/ws/build\dist\maven\poi>
      [jar] Building jar: <https://ci-builds.apache.org/job/POI/job/POI-DSL-Windows-1.14/ws/build\dist\maven\poi\poi-5.0.1-SNAPSHOT.jar>
    [javac] Compiling 517 source files to <https://ci-builds.apache.org/job/POI/job/POI-DSL-Windows-1.14/ws/build\test-classes>
    [javac] Ignoring source, target and bootclasspath as release has been set
    [javac] Note: Some input files use or override a deprecated API.
    [javac] Note: Recompile with -Xlint:deprecation for details.
    [javac] Note: <https://ci-builds.apache.org/job/POI/job/POI-DSL-Windows-1.14/ws/src\testcases\org\apache\poi\sl\usermodel\BaseTestSlideShow.java> uses unchecked or unsafe operations.
    [javac] Note: Recompile with -Xlint:unchecked for details.
    [javac] Compiling 1 source file to <https://ci-builds.apache.org/job/POI/job/POI-DSL-Windows-1.14/ws/src\multimodule\poi\test9>
      [jar] Building jar: <https://ci-builds.apache.org/job/POI/job/POI-DSL-Windows-1.14/ws/build\dist\maven\poi-tests\poi-5.0.1-SNAPSHOT-tests.jar>
      [jar] Building jar: <https://ci-builds.apache.org/job/POI/job/POI-DSL-Windows-1.14/ws/build\dist\maven\poi\poi-5.0.1-SNAPSHOT-sources.jar>

compile-scratchpad:
    [javac] Compiling 515 source files to <https://ci-builds.apache.org/job/POI/job/POI-DSL-Windows-1.14/ws/build\scratchpad-classes>
    [javac] Ignoring source, target and bootclasspath as release has been set
    [javac] Note: Some input files use or override a deprecated API.
    [javac] Note: Recompile with -Xlint:deprecation for details.
    [javac] Note: Some input files use unchecked or unsafe operations.
    [javac] Note: Recompile with -Xlint:unchecked for details.
    [javac] Compiling 1 source file to <https://ci-builds.apache.org/job/POI/job/POI-DSL-Windows-1.14/ws/src\multimodule\scratchpad\java9>
    [javac] <https://ci-builds.apache.org/job/POI/job/POI-DSL-Windows-1.14/ws/src\multimodule\scratchpad\java9\module-info.java>:19: warning: requires transitive directive for an automatic module
    [javac]     requires transitive org.apache.poi.poi;
    [javac]                                       ^
    [javac] 1 warning
    [mkdir] Created dir: <https://ci-builds.apache.org/job/POI/job/POI-DSL-Windows-1.14/ws/build\dist\maven\poi-scratchpad>
      [jar] Building jar: <https://ci-builds.apache.org/job/POI/job/POI-DSL-Windows-1.14/ws/build\dist\maven\poi-scratchpad\poi-scratchpad-5.0.1-SNAPSHOT.jar>
    [javac] Compiling 197 source files to <https://ci-builds.apache.org/job/POI/job/POI-DSL-Windows-1.14/ws/build\scratchpad-test-classes>
    [javac] Ignoring source, target and bootclasspath as release has been set
    [javac] Note: Some input files use or override a deprecated API.
    [javac] Note: Recompile with -Xlint:deprecation for details.
    [javac] Compiling 1 source file to <https://ci-builds.apache.org/job/POI/job/POI-DSL-Windows-1.14/ws/src\multimodule\scratchpad\test9>
    [javac] <https://ci-builds.apache.org/job/POI/job/POI-DSL-Windows-1.14/ws/src\multimodule\scratchpad\test9\module-info.java>:19: warning: requires transitive directive for an automatic module
    [javac]     requires transitive org.apache.poi.poi;
    [javac]                                       ^
    [javac] 1 warning
      [jar] Building jar: <https://ci-builds.apache.org/job/POI/job/POI-DSL-Windows-1.14/ws/build\dist\maven\poi-scratchpad-tests\poi-scratchpad-5.0.1-SNAPSHOT-tests.jar>
      [jar] Building jar: <https://ci-builds.apache.org/job/POI/job/POI-DSL-Windows-1.14/ws/build\dist\maven\poi-scratchpad\poi-scratchpad-5.0.1-SNAPSHOT-sources.jar>

check-compiled-ooxml-xsds:

compile-ooxml-xsds:
    [mkdir] Created dir: <https://ci-builds.apache.org/job/POI/job/POI-DSL-Windows-1.14/ws/build\xmlbean-xsds>
     [copy] Copying 8 files to <https://ci-builds.apache.org/job/POI/job/POI-DSL-Windows-1.14/ws/build\xmlbean-xsds>
     [copy] Copying 28 resources to <https://ci-builds.apache.org/job/POI/job/POI-DSL-Windows-1.14/ws/build\xmlbean-xsds>
    [mkdir] Created dir: <https://ci-builds.apache.org/job/POI/job/POI-DSL-Windows-1.14/ws/build\xmlbean-sources>
    [mkdir] Created dir: <https://ci-builds.apache.org/job/POI/job/POI-DSL-Windows-1.14/ws/build\xmlbean-classes>
  [xmlbean] SchemaCompiler  Metadata LOAD:org/apache/xmlbeans/metadata GEN:org/apache/poi/schemas/ooxml
  [xmlbean] Time to build schema type system: 4.236 seconds
  [xmlbean] Time to generate code: 59.694 seconds
    [javac] Compiling 5064 source files to <https://ci-builds.apache.org/job/POI/job/POI-DSL-Windows-1.14/ws/build\xmlbean-classes>
    [javac] Ignoring source, target and bootclasspath as release has been set
    [mkdir] Created dir: <https://ci-builds.apache.org/job/POI/job/POI-DSL-Windows-1.14/ws/build\dist\maven\poi-ooxml-full>
      [jar] Building jar: <https://ci-builds.apache.org/job/POI/job/POI-DSL-Windows-1.14/ws/build\dist\maven\poi-ooxml-full\poi-ooxml-full-5.0.1-SNAPSHOT.jar>
      [jar] Building jar: <https://ci-builds.apache.org/job/POI/job/POI-DSL-Windows-1.14/ws/build\dist\maven\poi-ooxml-full\poi-ooxml-full-5.0.1-SNAPSHOT-sources.jar>

compile-ooxml:
    [javac] Compiling 620 source files to <https://ci-builds.apache.org/job/POI/job/POI-DSL-Windows-1.14/ws/build\ooxml-classes>
    [javac] Ignoring source, target and bootclasspath as release has been set
    [javac] Note: Some input files use or override a deprecated API.
    [javac] Note: Recompile with -Xlint:deprecation for details.
    [javac] Note: Some input files use unchecked or unsafe operations.
    [javac] Note: Recompile with -Xlint:unchecked for details.
    [javac] Creating empty <https://ci-builds.apache.org/job/POI/job/POI-DSL-Windows-1.14/ws/build\ooxml-classes\org\apache\poi\xwpf\package-info.class>
    [javac] Creating empty <https://ci-builds.apache.org/job/POI/job/POI-DSL-Windows-1.14/ws/build\ooxml-classes\org\apache\poi\xssf\binary\package-info.class>
    [javac] Compiling 1 source file to <https://ci-builds.apache.org/job/POI/job/POI-DSL-Windows-1.14/ws/src\multimodule\ooxml\java9>
    [javac] error: the unnamed module reads package org.apache.batik.xml from both batik.xml and batik.all
    [javac] error: the unnamed module reads package org.apache.batik.transcoder from both batik.transcoder and batik.all
    [javac] error: the unnamed module reads package org.apache.batik.transcoder.print from both batik.transcoder and batik.all
    [javac] error: the unnamed module reads package org.apache.batik.transcoder.wmf from both batik.transcoder and batik.all
    [javac] error: the unnamed module reads package org.apache.batik.transcoder.wmf.tosvg from both batik.transcoder and batik.all
    [javac] error: the unnamed module reads package org.apache.batik.transcoder.svg2svg from both batik.transcoder and batik.all
    [javac] error: the unnamed module reads package org.apache.batik.transcoder.image from both batik.transcoder and batik.all
    [javac] error: the unnamed module reads package org.apache.batik.transcoder.image.resources from both batik.transcoder and batik.all
    [javac] error: the unnamed module reads package org.apache.batik.transcoder.keys from both batik.transcoder and batik.all
    [javac] error: the unnamed module reads package org.apache.batik.svggen from both batik.svggen and batik.all
    [javac] error: the unnamed module reads package org.apache.batik.svggen.font from both batik.svggen and batik.all
    [javac] error: the unnamed module reads package org.apache.batik.svggen.font.table from both batik.svggen and batik.all
    [javac] error: the unnamed module reads package org.apache.batik.script from both batik.script and batik.all
    [javac] error: the unnamed module reads package org.apache.batik.script.jpython from both batik.script and batik.all
    [javac] error: the unnamed module reads package org.apache.batik.script.rhino from both batik.script and batik.all
    [javac] error: the unnamed module reads package org.apache.batik.parser from both batik.parser and batik.all
    [javac] error: the unnamed module reads package org.apache.batik.gvt from both batik.gvt and batik.all
    [javac] error: the unnamed module reads package org.apache.batik.gvt.renderer from both batik.gvt and batik.all
    [javac] error: the unnamed module reads package org.apache.batik.gvt.text from both batik.gvt and batik.all
    [javac] error: the unnamed module reads package org.apache.batik.gvt.filter from both batik.gvt and batik.all
    [javac] error: the unnamed module reads package org.apache.batik.gvt.font from both batik.gvt and batik.all
    [javac] error: the unnamed module reads package org.apache.batik.gvt.event from both batik.gvt and batik.all
    [javac] error: the unnamed module reads package org.apache.batik.gvt.flow from both batik.gvt and batik.all
    [javac] error: the unnamed module reads package org.apache.batik.css.engine from both batik.css and batik.all
    [javac] error: the unnamed module reads package org.apache.batik.css.engine.value from both batik.css and batik.all
    [javac] error: the unnamed module reads package org.apache.batik.css.engine.value.svg from both batik.css and batik.all
    [javac] error: the unnamed module reads package org.apache.batik.css.engine.value.css2 from both batik.css and batik.all
    [javac] error: the unnamed module reads package org.apache.batik.css.engine.value.svg12 from both batik.css and batik.all
    [javac] error: the unnamed module reads package org.apache.batik.css.engine.sac from both batik.css and batik.all
    [javac] error: the unnamed module reads package org.apache.batik.css.dom from both batik.css and batik.all
    [javac] error: the unnamed module reads package org.apache.batik.css.parser from both batik.css and batik.all
    [javac] error: the unnamed module reads package org.apache.batik.ext.swing from both batik.awt.util and batik.all
    [javac] error: the unnamed module reads package org.apache.batik.ext.awt from both batik.awt.util and batik.all
    [javac] error: the unnamed module reads package org.apache.batik.ext.awt.geom from both batik.awt.util and batik.all
    [javac] error: the unnamed module reads package org.apache.batik.ext.awt.font from both batik.awt.util and batik.all
    [javac] error: the unnamed module reads package org.apache.batik.ext.awt.image.codec.png from both batik.codec and batik.all
    [javac] error: the unnamed module reads package org.apache.batik.ext.awt.image.codec.imageio from both batik.codec and batik.all
    [javac] error: the unnamed module reads package org.apache.batik.ext.awt.image.codec.util from both batik.codec and batik.all
    [javac] error: the unnamed module reads package org.apache.batik.ext.awt.image from both batik.awt.util and batik.all
    [javac] error: the unnamed module reads package org.apache.batik.ext.awt.image.renderable from both batik.awt.util and batik.all
    [javac] error: the unnamed module reads package org.apache.batik.ext.awt.image.rendered from both batik.awt.util and batik.all
    [javac] error: the unnamed module reads package org.apache.batik.ext.awt.image.spi from both batik.awt.util and batik.all
    [javac] error: the unnamed module reads package org.apache.batik.ext.awt.g2d from both batik.awt.util and batik.all
    [javac] error: the unnamed module reads package org.apache.batik.ext.awt.color from both batik.awt.util and batik.all
    [javac] error: the unnamed module reads package org.apache.batik.anim from both batik.anim and batik.all
    [javac] error: the unnamed module reads package org.apache.batik.anim.timing from both batik.anim and batik.all
    [javac] error: the unnamed module reads package org.apache.batik.anim.values from both batik.anim and batik.all
    [javac] error: the unnamed module reads package org.apache.batik.anim.dom from both batik.anim and batik.all
    [javac] error: the unnamed module reads package org.apache.batik from both batik.all and batik.util
    [javac] error: the unnamed module reads package org.apache.batik.util from both batik.all and batik.util
    [javac] error: the unnamed module reads package org.apache.batik.util.resources from both batik.all and batik.util
    [javac] error: the unnamed module reads package org.apache.batik.util.io from both batik.all and batik.util
    [javac] error: the unnamed module reads package org.apache.batik.bridge from both batik.all and batik.bridge
    [javac] error: the unnamed module reads package org.apache.batik.bridge.svg12 from both batik.all and batik.bridge
    [javac] error: the unnamed module reads package org.apache.batik.dom.svg from both batik.all and batik.svg.dom
    [javac] error: the unnamed module reads package org.apache.batik.dom.svg12 from both batik.all and batik.svg.dom
    [javac] error: the unnamed module reads package org.apache.batik.dom from both batik.all and batik.dom
    [javac] error: the unnamed module reads package org.apache.batik.dom.xbl from both batik.all and batik.dom
    [javac] error: the unnamed module reads package org.apache.batik.dom.traversal from both batik.all and batik.dom
    [javac] error: the unnamed module reads package org.apache.batik.dom.util from both batik.all and batik.dom
    [javac] error: the unnamed module reads package org.apache.batik.dom.events from both batik.all and batik.dom
    [javac] error: the unnamed module reads package org.apache.batik.w3c.dom from both batik.all and batik.ext
    [javac] error: the unnamed module reads package org.apache.batik.w3c.dom.events from both batik.all and batik.ext
    [javac] error: the unnamed module reads package org.apache.batik.apps.rasterizer from both batik.all and batik.svgrasterizer
    [javac] error: the unnamed module reads package org.apache.batik.i18n from both batik.all and batik.i18n
    [javac] error: the unnamed module reads package org.apache.batik.constants from both batik.all and batik.constants
    [javac] error: module de.rototor.pdfbox.graphics2d reads package org.apache.batik.xml from both batik.xml and batik.all
    [javac] error: module de.rototor.pdfbox.graphics2d reads package org.apache.batik.transcoder from both batik.transcoder and batik.all
    [javac] error: module de.rototor.pdfbox.graphics2d reads package org.apache.batik.transcoder.print from both batik.transcoder and batik.all
    [javac] error: module de.rototor.pdfbox.graphics2d reads package org.apache.batik.transcoder.wmf from both batik.transcoder and batik.all
    [javac] error: module de.rototor.pdfbox.graphics2d reads package org.apache.batik.transcoder.wmf.tosvg from both batik.transcoder and batik.all
    [javac] error: module de.rototor.pdfbox.graphics2d reads package org.apache.batik.transcoder.svg2svg from both batik.transcoder and batik.all
    [javac] error: module de.rototor.pdfbox.graphics2d reads package org.apache.batik.transcoder.image from both batik.transcoder and batik.all
    [javac] error: module de.rototor.pdfbox.graphics2d reads package org.apache.batik.transcoder.image.resources from both batik.transcoder and batik.all
    [javac] error: module de.rototor.pdfbox.graphics2d reads package org.apache.batik.transcoder.keys from both batik.transcoder and batik.all
    [javac] error: module de.rototor.pdfbox.graphics2d reads package org.apache.batik.svggen from both batik.svggen and batik.all
    [javac] error: module de.rototor.pdfbox.graphics2d reads package org.apache.batik.svggen.font from both batik.svggen and batik.all
    [javac] error: module de.rototor.pdfbox.graphics2d reads package org.apache.batik.svggen.font.table from both batik.svggen and batik.all
    [javac] error: module de.rototor.pdfbox.graphics2d reads package org.apache.batik.script from both batik.script and batik.all
    [javac] error: module de.rototor.pdfbox.graphics2d reads package org.apache.batik.script.jpython from both batik.script and batik.all
    [javac] error: module de.rototor.pdfbox.graphics2d reads package org.apache.batik.script.rhino from both batik.script and batik.all
    [javac] error: module de.rototor.pdfbox.graphics2d reads package org.apache.batik.parser from both batik.parser and batik.all
    [javac] error: module de.rototor.pdfbox.graphics2d reads package org.apache.batik.gvt from both batik.gvt and batik.all
    [javac] error: module de.rototor.pdfbox.graphics2d reads package org.apache.batik.gvt.renderer from both batik.gvt and batik.all
    [javac] error: module de.rototor.pdfbox.graphics2d reads package org.apache.batik.gvt.text from both batik.gvt and batik.all
    [javac] error: module de.rototor.pdfbox.graphics2d reads package org.apache.batik.gvt.filter from both batik.gvt and batik.all
    [javac] error: module de.rototor.pdfbox.graphics2d reads package org.apache.batik.gvt.font from both batik.gvt and batik.all
    [javac] error: module de.rototor.pdfbox.graphics2d reads package org.apache.batik.gvt.event from both batik.gvt and batik.all
    [javac] error: module de.rototor.pdfbox.graphics2d reads package org.apache.batik.gvt.flow from both batik.gvt and batik.all
    [javac] error: module de.rototor.pdfbox.graphics2d reads package org.apache.batik.css.engine from both batik.css and batik.all
    [javac] error: module de.rototor.pdfbox.graphics2d reads package org.apache.batik.css.engine.value from both batik.css and batik.all
    [javac] error: module de.rototor.pdfbox.graphics2d reads package org.apache.batik.css.engine.value.svg from both batik.css and batik.all
    [javac] error: module de.rototor.pdfbox.graphics2d reads package org.apache.batik.css.engine.value.css2 from both batik.css and batik.all
    [javac] error: module de.rototor.pdfbox.graphics2d reads package org.apache.batik.css.engine.value.svg12 from both batik.css and batik.all
    [javac] error: module de.rototor.pdfbox.graphics2d reads package org.apache.batik.css.engine.sac from both batik.css and batik.all
    [javac] error: module de.rototor.pdfbox.graphics2d reads package org.apache.batik.css.dom from both batik.css and batik.all
    [javac] error: module de.rototor.pdfbox.graphics2d reads package org.apache.batik.css.parser from both batik.css and batik.all
    [javac] error: module de.rototor.pdfbox.graphics2d reads package org.apache.batik.ext.swing from both batik.awt.util and batik.all
    [javac] error: module de.rototor.pdfbox.graphics2d reads package org.apache.batik.ext.awt from both batik.awt.util and batik.all
    [javac] error: module de.rototor.pdfbox.graphics2d reads package org.apache.batik.ext.awt.geom from both batik.awt.util and batik.all
    [javac] 100 errors
    [javac] only showing the first 100 errors, of 3631 total; use -Xmaxerrs if you would like to see more

BUILD FAILED
<https://ci-builds.apache.org/job/POI/job/POI-DSL-Windows-1.14/ws/build.xml>:1223: The following error occurred while executing this line:
<https://ci-builds.apache.org/job/POI/job/POI-DSL-Windows-1.14/ws/build.xml>:1061: Compile failed; see the compiler error output for details.

Total time: 7 minutes 35 seconds
Build step 'Invoke Ant' marked build as failure
[SpotBugs] Skipping execution of recorder since overall result is 'FAILURE'
Archiving artifacts
[Fast Archiver] Compressed 2.79 MB of artifacts by 24.6% relative to #42
[WARNINGS] Skipping publisher since build result is FAILURE
Recording test results
ERROR: Step ‘Publish JUnit test result report’ failed: No test report files were found. Configuration error?

---------------------------------------------------------------------
To unsubscribe, e-mail: [hidden email]
For additional commands, e-mail: [hidden email]

Reply | Threaded
Open this post in threaded view
|

Build failed in Jenkins: POI » POI-DSL-Windows-1.14 #45

Apache Jenkins Server
See <https://ci-builds.apache.org/job/POI/job/POI-DSL-Windows-1.14/45/display/redirect?page=changes>

Changes:

[Marius Volkhart] [bug-63046] Fix Java 16 build

org.apache.santuario:xmlsec:2.2.0 has a dependency on SLF4J. We use this in SignatureInfo.java.


------------------------------------------
[...truncated 7.60 KB...]
      [get] Destination already exists (skipping): <https://ci-builds.apache.org/job/POI/job/POI-DSL-Windows-1.14/ws/lib\ooxml-batik\batik-gvt-1.14.jar>
      [get] Destination already exists (skipping): <https://ci-builds.apache.org/job/POI/job/POI-DSL-Windows-1.14/ws/lib\ooxml-batik\batik-i18n-1.14.jar>
      [get] Destination already exists (skipping): <https://ci-builds.apache.org/job/POI/job/POI-DSL-Windows-1.14/ws/lib\ooxml-batik\batik-parser-1.14.jar>
      [get] Destination already exists (skipping): <https://ci-builds.apache.org/job/POI/job/POI-DSL-Windows-1.14/ws/lib\ooxml-batik\batik-script-1.14.jar>
      [get] Destination already exists (skipping): <https://ci-builds.apache.org/job/POI/job/POI-DSL-Windows-1.14/ws/lib\ooxml-batik\batik-shared-resources-1.14.jar>
      [get] Destination already exists (skipping): <https://ci-builds.apache.org/job/POI/job/POI-DSL-Windows-1.14/ws/lib\ooxml-batik\batik-svg-dom-1.14.jar>
      [get] Destination already exists (skipping): <https://ci-builds.apache.org/job/POI/job/POI-DSL-Windows-1.14/ws/lib\ooxml-batik\batik-svggen-1.14.jar>
      [get] Destination already exists (skipping): <https://ci-builds.apache.org/job/POI/job/POI-DSL-Windows-1.14/ws/lib\ooxml-batik\batik-svgrasterizer-1.14.jar>
      [get] Destination already exists (skipping): <https://ci-builds.apache.org/job/POI/job/POI-DSL-Windows-1.14/ws/lib\ooxml-batik\batik-transcoder-1.14.jar>
      [get] Destination already exists (skipping): <https://ci-builds.apache.org/job/POI/job/POI-DSL-Windows-1.14/ws/lib\ooxml-batik\batik-util-1.14.jar>
      [get] Destination already exists (skipping): <https://ci-builds.apache.org/job/POI/job/POI-DSL-Windows-1.14/ws/lib\ooxml-batik\batik-xml-1.14.jar>
      [get] Destination already exists (skipping): <https://ci-builds.apache.org/job/POI/job/POI-DSL-Windows-1.14/ws/lib\ooxml-batik\xml-apis-ext-1.3.04.jar>
      [get] Destination already exists (skipping): <https://ci-builds.apache.org/job/POI/job/POI-DSL-Windows-1.14/ws/lib\ooxml-batik\xmlgraphics-commons-2.4.jar>
      [get] Destination already exists (skipping): <https://ci-builds.apache.org/job/POI/job/POI-DSL-Windows-1.14/ws/lib\ooxml-provided\pdfbox-2.0.22.jar>
      [get] Destination already exists (skipping): <https://ci-builds.apache.org/job/POI/job/POI-DSL-Windows-1.14/ws/lib\ooxml-provided\fontbox-2.0.22.jar>
      [get] Destination already exists (skipping): <https://ci-builds.apache.org/job/POI/job/POI-DSL-Windows-1.14/ws/lib\ooxml-provided\graphics2d-0.30.jar>

init:
    [mkdir] Created dir: <https://ci-builds.apache.org/job/POI/job/POI-DSL-Windows-1.14/ws/build>
    [mkdir] Created dir: <https://ci-builds.apache.org/job/POI/job/POI-DSL-Windows-1.14/ws/build\classes>
    [mkdir] Created dir: <https://ci-builds.apache.org/job/POI/job/POI-DSL-Windows-1.14/ws/build\test-classes>
    [mkdir] Created dir: <https://ci-builds.apache.org/job/POI/job/POI-DSL-Windows-1.14/ws/build\test-results>
    [mkdir] Created dir: <https://ci-builds.apache.org/job/POI/job/POI-DSL-Windows-1.14/ws/build\scratchpad-classes>
    [mkdir] Created dir: <https://ci-builds.apache.org/job/POI/job/POI-DSL-Windows-1.14/ws/build\scratchpad-test-classes>
    [mkdir] Created dir: <https://ci-builds.apache.org/job/POI/job/POI-DSL-Windows-1.14/ws/build\scratchpad-test-results>
    [mkdir] Created dir: <https://ci-builds.apache.org/job/POI/job/POI-DSL-Windows-1.14/ws/build\geometry-java>
    [mkdir] Created dir: <https://ci-builds.apache.org/job/POI/job/POI-DSL-Windows-1.14/ws/build\ooxml-classes>
    [mkdir] Created dir: <https://ci-builds.apache.org/job/POI/job/POI-DSL-Windows-1.14/ws/build\ooxml-test-classes>
    [mkdir] Created dir: <https://ci-builds.apache.org/job/POI/job/POI-DSL-Windows-1.14/ws/build\ooxml-test-results>
    [mkdir] Created dir: <https://ci-builds.apache.org/job/POI/job/POI-DSL-Windows-1.14/ws/build\excelant-classes>
    [mkdir] Created dir: <https://ci-builds.apache.org/job/POI/job/POI-DSL-Windows-1.14/ws/build\excelant-test-classes>
    [mkdir] Created dir: <https://ci-builds.apache.org/job/POI/job/POI-DSL-Windows-1.14/ws/build\excelant-test-results>
    [mkdir] Created dir: <https://ci-builds.apache.org/job/POI/job/POI-DSL-Windows-1.14/ws/build\examples-classes>
    [mkdir] Created dir: <https://ci-builds.apache.org/job/POI/job/POI-DSL-Windows-1.14/ws/build\integration-test-classes>
    [mkdir] Created dir: <https://ci-builds.apache.org/job/POI/job/POI-DSL-Windows-1.14/ws/build\integration-test-results>
    [mkdir] Created dir: <https://ci-builds.apache.org/job/POI/job/POI-DSL-Windows-1.14/ws/build\dist>
    [mkdir] Created dir: <https://ci-builds.apache.org/job/POI/job/POI-DSL-Windows-1.14/ws/build\site>
     [echo] Using Ant: Apache Ant(TM) version 1.10.9 compiled on September 27 2020 from F:\\jenkins\\tools\\ant\\latest1.10, Ant detected Java 14 (may be different than actual Java sometimes...)
     [echo] Using Java: 14-ea/14-ea+6-171/14-ea+6-171/OpenJDK 64-Bit Server VM from Oracle Corporation on Windows Server 2016: 10.0
     [echo] Building Apache POI version 5.0.1-SNAPSHOT and RC: RC1

-version-java-check:

compile-version:
     [copy] Copying 1 file to <https://ci-builds.apache.org/job/POI/job/POI-DSL-Windows-1.14/ws/build\classes\org\apache\poi>
    [javac] Compiling 1 source file to <https://ci-builds.apache.org/job/POI/job/POI-DSL-Windows-1.14/ws/build\classes>
    [javac] warning: [options] bootstrap class path not set in conjunction with -source 8
    [javac] 1 warning
   [delete] Deleting: <https://ci-builds.apache.org/job/POI/job/POI-DSL-Windows-1.14/ws/build\classes\org\apache\poi\Version.java>

compile-main:
    [javac] Compiling 1171 source files to <https://ci-builds.apache.org/job/POI/job/POI-DSL-Windows-1.14/ws/build\classes>
    [javac] Ignoring source, target and bootclasspath as release has been set
    [javac] Note: Some input files use or override a deprecated API.
    [javac] Note: Recompile with -Xlint:deprecation for details.
    [javac] Note: Some input files use unchecked or unsafe operations.
    [javac] Note: Recompile with -Xlint:unchecked for details.
    [javac] Creating empty <https://ci-builds.apache.org/job/POI/job/POI-DSL-Windows-1.14/ws/build\classes\org\apache\poi\ddf\package-info.class>
    [javac] Creating empty <https://ci-builds.apache.org/job/POI/job/POI-DSL-Windows-1.14/ws/build\classes\org\apache\poi\hssf\package-info.class>
    [javac] Creating empty <https://ci-builds.apache.org/job/POI/job/POI-DSL-Windows-1.14/ws/build\classes\org\apache\poi\poifs\dev\package-info.class>
    [javac] Creating empty <https://ci-builds.apache.org/job/POI/job/POI-DSL-Windows-1.14/ws/build\classes\org\apache\poi\util\package-info.class>
    [javac] Creating empty <https://ci-builds.apache.org/job/POI/job/POI-DSL-Windows-1.14/ws/build\classes\org\apache\poi\poifs\common\package-info.class>
    [javac] Creating empty <https://ci-builds.apache.org/job/POI/job/POI-DSL-Windows-1.14/ws/build\classes\org\apache\poi\hssf\record\package-info.class>
    [javac] Creating empty <https://ci-builds.apache.org/job/POI/job/POI-DSL-Windows-1.14/ws/build\classes\org\apache\poi\poifs\package-info.class>
    [javac] Creating empty <https://ci-builds.apache.org/job/POI/job/POI-DSL-Windows-1.14/ws/build\classes\org\apache\poi\poifs\crypt\package-info.class>
    [javac] Creating empty <https://ci-builds.apache.org/job/POI/job/POI-DSL-Windows-1.14/ws/build\classes\org\apache\poi\hpsf\wellknown\package-info.class>
    [javac] Creating empty <https://ci-builds.apache.org/job/POI/job/POI-DSL-Windows-1.14/ws/build\classes\org\apache\poi\hssf\dev\package-info.class>
    [javac] Creating empty <https://ci-builds.apache.org/job/POI/job/POI-DSL-Windows-1.14/ws/build\classes\org\apache\poi\ss\formula\package-info.class>
    [javac] Creating empty <https://ci-builds.apache.org/job/POI/job/POI-DSL-Windows-1.14/ws/build\classes\org\apache\poi\hpsf\package-info.class>
    [javac] Creating empty <https://ci-builds.apache.org/job/POI/job/POI-DSL-Windows-1.14/ws/build\classes\org\apache\poi\poifs\property\package-info.class>
    [javac] Creating empty <https://ci-builds.apache.org/job/POI/job/POI-DSL-Windows-1.14/ws/build\classes\org\apache\poi\poifs\filesystem\package-info.class>
    [javac] Creating empty <https://ci-builds.apache.org/job/POI/job/POI-DSL-Windows-1.14/ws/build\classes\org\apache\poi\ss\formula\ptg\package-info.class>
    [javac] Creating empty <https://ci-builds.apache.org/job/POI/job/POI-DSL-Windows-1.14/ws/build\classes\org\apache\poi\poifs\storage\package-info.class>
    [javac] Creating empty <https://ci-builds.apache.org/job/POI/job/POI-DSL-Windows-1.14/ws/build\classes\org\apache\poi\hssf\eventusermodel\package-info.class>
    [javac] Creating empty <https://ci-builds.apache.org/job/POI/job/POI-DSL-Windows-1.14/ws/build\classes\org\apache\poi\hssf\record\aggregates\package-info.class>
    [javac] Creating empty <https://ci-builds.apache.org/job/POI/job/POI-DSL-Windows-1.14/ws/build\classes\org\apache\poi\ss\format\package-info.class>
    [javac] Creating empty <https://ci-builds.apache.org/job/POI/job/POI-DSL-Windows-1.14/ws/build\classes\org\apache\poi\hssf\model\package-info.class>
    [javac] Creating empty <https://ci-builds.apache.org/job/POI/job/POI-DSL-Windows-1.14/ws/build\classes\org\apache\poi\hssf\usermodel\package-info.class>
    [javac] Creating empty <https://ci-builds.apache.org/job/POI/job/POI-DSL-Windows-1.14/ws/build\classes\org\apache\poi\hssf\util\package-info.class>
    [javac] Creating empty <https://ci-builds.apache.org/job/POI/job/POI-DSL-Windows-1.14/ws/build\classes\org\apache\poi\poifs\eventfilesystem\package-info.class>
    [mkdir] Created dir: <https://ci-builds.apache.org/job/POI/job/POI-DSL-Windows-1.14/ws/build\dist\maven\poi>
      [jar] Building jar: <https://ci-builds.apache.org/job/POI/job/POI-DSL-Windows-1.14/ws/build\dist\maven\poi\poi-5.0.1-SNAPSHOT.jar>
    [javac] Compiling 517 source files to <https://ci-builds.apache.org/job/POI/job/POI-DSL-Windows-1.14/ws/build\test-classes>
    [javac] Ignoring source, target and bootclasspath as release has been set
    [javac] Note: Some input files use or override a deprecated API.
    [javac] Note: Recompile with -Xlint:deprecation for details.
    [javac] Note: <https://ci-builds.apache.org/job/POI/job/POI-DSL-Windows-1.14/ws/src\testcases\org\apache\poi\sl\usermodel\BaseTestSlideShow.java> uses unchecked or unsafe operations.
    [javac] Note: Recompile with -Xlint:unchecked for details.
      [jar] Building jar: <https://ci-builds.apache.org/job/POI/job/POI-DSL-Windows-1.14/ws/build\dist\maven\poi-tests\poi-5.0.1-SNAPSHOT-tests.jar>
      [jar] Building jar: <https://ci-builds.apache.org/job/POI/job/POI-DSL-Windows-1.14/ws/build\dist\maven\poi\poi-5.0.1-SNAPSHOT-sources.jar>

compile-scratchpad:
    [javac] Compiling 515 source files to <https://ci-builds.apache.org/job/POI/job/POI-DSL-Windows-1.14/ws/build\scratchpad-classes>
    [javac] Ignoring source, target and bootclasspath as release has been set
    [javac] Note: Some input files use or override a deprecated API.
    [javac] Note: Recompile with -Xlint:deprecation for details.
    [javac] Note: Some input files use unchecked or unsafe operations.
    [javac] Note: Recompile with -Xlint:unchecked for details.
    [mkdir] Created dir: <https://ci-builds.apache.org/job/POI/job/POI-DSL-Windows-1.14/ws/build\dist\maven\poi-scratchpad>
      [jar] Building jar: <https://ci-builds.apache.org/job/POI/job/POI-DSL-Windows-1.14/ws/build\dist\maven\poi-scratchpad\poi-scratchpad-5.0.1-SNAPSHOT.jar>
    [javac] Compiling 197 source files to <https://ci-builds.apache.org/job/POI/job/POI-DSL-Windows-1.14/ws/build\scratchpad-test-classes>
    [javac] Ignoring source, target and bootclasspath as release has been set
    [javac] Note: Some input files use or override a deprecated API.
    [javac] Note: Recompile with -Xlint:deprecation for details.
      [jar] Building jar: <https://ci-builds.apache.org/job/POI/job/POI-DSL-Windows-1.14/ws/build\dist\maven\poi-scratchpad-tests\poi-scratchpad-5.0.1-SNAPSHOT-tests.jar>
      [jar] Building jar: <https://ci-builds.apache.org/job/POI/job/POI-DSL-Windows-1.14/ws/build\dist\maven\poi-scratchpad\poi-scratchpad-5.0.1-SNAPSHOT-sources.jar>

check-compiled-ooxml-xsds:

compile-ooxml-xsds:
    [mkdir] Created dir: <https://ci-builds.apache.org/job/POI/job/POI-DSL-Windows-1.14/ws/build\xmlbean-xsds>
     [copy] Copying 8 files to <https://ci-builds.apache.org/job/POI/job/POI-DSL-Windows-1.14/ws/build\xmlbean-xsds>
     [copy] Copying 28 resources to <https://ci-builds.apache.org/job/POI/job/POI-DSL-Windows-1.14/ws/build\xmlbean-xsds>
    [mkdir] Created dir: <https://ci-builds.apache.org/job/POI/job/POI-DSL-Windows-1.14/ws/build\xmlbean-sources>
    [mkdir] Created dir: <https://ci-builds.apache.org/job/POI/job/POI-DSL-Windows-1.14/ws/build\xmlbean-classes>
  [xmlbean] SchemaCompiler  Metadata LOAD:org/apache/xmlbeans/metadata GEN:org/apache/poi/schemas/ooxml
  [xmlbean] Time to build schema type system: 3.478 seconds
  [xmlbean] Time to generate code: 70.435 seconds
    [javac] Compiling 5064 source files to <https://ci-builds.apache.org/job/POI/job/POI-DSL-Windows-1.14/ws/build\xmlbean-classes>
    [javac] Ignoring source, target and bootclasspath as release has been set
    [mkdir] Created dir: <https://ci-builds.apache.org/job/POI/job/POI-DSL-Windows-1.14/ws/build\dist\maven\poi-ooxml-full>
      [jar] Building jar: <https://ci-builds.apache.org/job/POI/job/POI-DSL-Windows-1.14/ws/build\dist\maven\poi-ooxml-full\poi-ooxml-full-5.0.1-SNAPSHOT.jar>
      [jar] Building jar: <https://ci-builds.apache.org/job/POI/job/POI-DSL-Windows-1.14/ws/build\dist\maven\poi-ooxml-full\poi-ooxml-full-5.0.1-SNAPSHOT-sources.jar>

compile-ooxml:
    [javac] Compiling 620 source files to <https://ci-builds.apache.org/job/POI/job/POI-DSL-Windows-1.14/ws/build\ooxml-classes>
    [javac] Ignoring source, target and bootclasspath as release has been set
    [javac] Note: Some input files use or override a deprecated API.
    [javac] Note: Recompile with -Xlint:deprecation for details.
    [javac] Note: Some input files use unchecked or unsafe operations.
    [javac] Note: Recompile with -Xlint:unchecked for details.
    [javac] Creating empty <https://ci-builds.apache.org/job/POI/job/POI-DSL-Windows-1.14/ws/build\ooxml-classes\org\apache\poi\xwpf\package-info.class>
    [javac] Creating empty <https://ci-builds.apache.org/job/POI/job/POI-DSL-Windows-1.14/ws/build\ooxml-classes\org\apache\poi\xssf\binary\package-info.class>
    [javac] Compiling 1 source file to <https://ci-builds.apache.org/job/POI/job/POI-DSL-Windows-1.14/ws/src\multimodule\ooxml\java9>
    [javac] error: the unnamed module reads package org.apache.batik.xml from both batik.xml and batik.all
    [javac] error: the unnamed module reads package org.apache.batik.transcoder from both batik.transcoder and batik.all
    [javac] error: the unnamed module reads package org.apache.batik.transcoder.print from both batik.transcoder and batik.all
    [javac] error: the unnamed module reads package org.apache.batik.transcoder.wmf from both batik.transcoder and batik.all
    [javac] error: the unnamed module reads package org.apache.batik.transcoder.wmf.tosvg from both batik.transcoder and batik.all
    [javac] error: the unnamed module reads package org.apache.batik.transcoder.svg2svg from both batik.transcoder and batik.all
    [javac] error: the unnamed module reads package org.apache.batik.transcoder.image from both batik.transcoder and batik.all
    [javac] error: the unnamed module reads package org.apache.batik.transcoder.image.resources from both batik.transcoder and batik.all
    [javac] error: the unnamed module reads package org.apache.batik.transcoder.keys from both batik.transcoder and batik.all
    [javac] error: the unnamed module reads package org.apache.batik.apps.rasterizer from both batik.svgrasterizer and batik.all
    [javac] error: the unnamed module reads package org.apache.batik.parser from both batik.parser and batik.all
    [javac] error: the unnamed module reads package org.apache.batik.gvt from both batik.gvt and batik.all
    [javac] error: the unnamed module reads package org.apache.batik.gvt.renderer from both batik.gvt and batik.all
    [javac] error: the unnamed module reads package org.apache.batik.gvt.text from both batik.gvt and batik.all
    [javac] error: the unnamed module reads package org.apache.batik.gvt.filter from both batik.gvt and batik.all
    [javac] error: the unnamed module reads package org.apache.batik.gvt.font from both batik.gvt and batik.all
    [javac] error: the unnamed module reads package org.apache.batik.gvt.event from both batik.gvt and batik.all
    [javac] error: the unnamed module reads package org.apache.batik.gvt.flow from both batik.gvt and batik.all
    [javac] error: the unnamed module reads package org.apache.batik.dom from both batik.dom and batik.all
    [javac] error: the unnamed module reads package org.apache.batik.dom.xbl from both batik.dom and batik.all
    [javac] error: the unnamed module reads package org.apache.batik.dom.traversal from both batik.dom and batik.all
    [javac] error: the unnamed module reads package org.apache.batik.dom.util from both batik.dom and batik.all
    [javac] error: the unnamed module reads package org.apache.batik.dom.events from both batik.dom and batik.all
    [javac] error: the unnamed module reads package org.apache.batik.css.engine from both batik.css and batik.all
    [javac] error: the unnamed module reads package org.apache.batik.css.engine.value from both batik.css and batik.all
    [javac] error: the unnamed module reads package org.apache.batik.css.engine.value.svg from both batik.css and batik.all
    [javac] error: the unnamed module reads package org.apache.batik.css.engine.value.css2 from both batik.css and batik.all
    [javac] error: the unnamed module reads package org.apache.batik.css.engine.value.svg12 from both batik.css and batik.all
    [javac] error: the unnamed module reads package org.apache.batik.css.engine.sac from both batik.css and batik.all
    [javac] error: the unnamed module reads package org.apache.batik.css.dom from both batik.css and batik.all
    [javac] error: the unnamed module reads package org.apache.batik.css.parser from both batik.css and batik.all
    [javac] error: the unnamed module reads package org.apache.batik.constants from both batik.constants and batik.all
    [javac] error: the unnamed module reads package org.apache.batik.bridge from both batik.bridge and batik.all
    [javac] error: the unnamed module reads package org.apache.batik.bridge.svg12 from both batik.bridge and batik.all
    [javac] error: the unnamed module reads package org.apache.batik.script from both batik.all and batik.script
    [javac] error: the unnamed module reads package org.apache.batik.script.jpython from both batik.all and batik.script
    [javac] error: the unnamed module reads package org.apache.batik.script.rhino from both batik.all and batik.script
    [javac] error: the unnamed module reads package org.apache.batik.dom.svg from both batik.all and batik.svg.dom
    [javac] error: the unnamed module reads package org.apache.batik.dom.svg12 from both batik.all and batik.svg.dom
    [javac] error: the unnamed module reads package org.apache.batik.w3c.dom from both batik.all and batik.ext
    [javac] error: the unnamed module reads package org.apache.batik.w3c.dom.events from both batik.all and batik.ext
    [javac] error: the unnamed module reads package org.apache.batik.anim from both batik.all and batik.anim
    [javac] error: the unnamed module reads package org.apache.batik.anim.timing from both batik.all and batik.anim
    [javac] error: the unnamed module reads package org.apache.batik.anim.values from both batik.all and batik.anim
    [javac] error: the unnamed module reads package org.apache.batik.anim.dom from both batik.all and batik.anim
    [javac] error: the unnamed module reads package org.apache.batik from both batik.all and batik.util
    [javac] error: the unnamed module reads package org.apache.batik.util from both batik.all and batik.util
    [javac] error: the unnamed module reads package org.apache.batik.util.resources from both batik.all and batik.util
    [javac] error: the unnamed module reads package org.apache.batik.util.io from both batik.all and batik.util
    [javac] error: the unnamed module reads package org.apache.batik.ext.swing from both batik.all and batik.awt.util
    [javac] error: the unnamed module reads package org.apache.batik.ext.awt from both batik.all and batik.awt.util
    [javac] error: the unnamed module reads package org.apache.batik.ext.awt.geom from both batik.all and batik.awt.util
    [javac] error: the unnamed module reads package org.apache.batik.ext.awt.font from both batik.all and batik.awt.util
    [javac] error: the unnamed module reads package org.apache.batik.ext.awt.image from both batik.all and batik.awt.util
    [javac] error: the unnamed module reads package org.apache.batik.ext.awt.image.renderable from both batik.all and batik.awt.util
    [javac] error: the unnamed module reads package org.apache.batik.ext.awt.image.rendered from both batik.all and batik.awt.util
    [javac] error: the unnamed module reads package org.apache.batik.ext.awt.image.spi from both batik.all and batik.awt.util
    [javac] error: the unnamed module reads package org.apache.batik.ext.awt.g2d from both batik.all and batik.awt.util
    [javac] error: the unnamed module reads package org.apache.batik.ext.awt.color from both batik.all and batik.awt.util
    [javac] error: the unnamed module reads package org.apache.batik.svggen from both batik.all and batik.svggen
    [javac] error: the unnamed module reads package org.apache.batik.svggen.font from both batik.all and batik.svggen
    [javac] error: the unnamed module reads package org.apache.batik.svggen.font.table from both batik.all and batik.svggen
    [javac] error: the unnamed module reads package org.apache.batik.i18n from both batik.all and batik.i18n
    [javac] error: the unnamed module reads package org.apache.batik.ext.awt.image.codec.png from both batik.all and batik.codec
    [javac] error: the unnamed module reads package org.apache.batik.ext.awt.image.codec.imageio from both batik.all and batik.codec
    [javac] error: the unnamed module reads package org.apache.batik.ext.awt.image.codec.util from both batik.all and batik.codec
    [javac] error: module de.rototor.pdfbox.graphics2d reads package org.apache.batik.xml from both batik.xml and batik.all
    [javac] error: module de.rototor.pdfbox.graphics2d reads package org.apache.batik.transcoder from both batik.transcoder and batik.all
    [javac] error: module de.rototor.pdfbox.graphics2d reads package org.apache.batik.transcoder.print from both batik.transcoder and batik.all
    [javac] error: module de.rototor.pdfbox.graphics2d reads package org.apache.batik.transcoder.wmf from both batik.transcoder and batik.all
    [javac] error: module de.rototor.pdfbox.graphics2d reads package org.apache.batik.transcoder.wmf.tosvg from both batik.transcoder and batik.all
    [javac] error: module de.rototor.pdfbox.graphics2d reads package org.apache.batik.transcoder.svg2svg from both batik.transcoder and batik.all
    [javac] error: module de.rototor.pdfbox.graphics2d reads package org.apache.batik.transcoder.image from both batik.transcoder and batik.all
    [javac] error: module de.rototor.pdfbox.graphics2d reads package org.apache.batik.transcoder.image.resources from both batik.transcoder and batik.all
    [javac] error: module de.rototor.pdfbox.graphics2d reads package org.apache.batik.transcoder.keys from both batik.transcoder and batik.all
    [javac] error: module de.rototor.pdfbox.graphics2d reads package org.apache.batik.apps.rasterizer from both batik.svgrasterizer and batik.all
    [javac] error: module de.rototor.pdfbox.graphics2d reads package org.apache.batik.parser from both batik.parser and batik.all
    [javac] error: module de.rototor.pdfbox.graphics2d reads package org.apache.batik.gvt from both batik.gvt and batik.all
    [javac] error: module de.rototor.pdfbox.graphics2d reads package org.apache.batik.gvt.renderer from both batik.gvt and batik.all
    [javac] error: module de.rototor.pdfbox.graphics2d reads package org.apache.batik.gvt.text from both batik.gvt and batik.all
    [javac] error: module de.rototor.pdfbox.graphics2d reads package org.apache.batik.gvt.filter from both batik.gvt and batik.all
    [javac] error: module de.rototor.pdfbox.graphics2d reads package org.apache.batik.gvt.font from both batik.gvt and batik.all
    [javac] error: module de.rototor.pdfbox.graphics2d reads package org.apache.batik.gvt.event from both batik.gvt and batik.all
    [javac] error: module de.rototor.pdfbox.graphics2d reads package org.apache.batik.gvt.flow from both batik.gvt and batik.all
    [javac] error: module de.rototor.pdfbox.graphics2d reads package org.apache.batik.dom from both batik.dom and batik.all
    [javac] error: module de.rototor.pdfbox.graphics2d reads package org.apache.batik.dom.xbl from both batik.dom and batik.all
    [javac] error: module de.rototor.pdfbox.graphics2d reads package org.apache.batik.dom.traversal from both batik.dom and batik.all
    [javac] error: module de.rototor.pdfbox.graphics2d reads package org.apache.batik.dom.util from both batik.dom and batik.all
    [javac] error: module de.rototor.pdfbox.graphics2d reads package org.apache.batik.dom.events from both batik.dom and batik.all
    [javac] error: module de.rototor.pdfbox.graphics2d reads package org.apache.batik.css.engine from both batik.css and batik.all
    [javac] error: module de.rototor.pdfbox.graphics2d reads package org.apache.batik.css.engine.value from both batik.css and batik.all
    [javac] error: module de.rototor.pdfbox.graphics2d reads package org.apache.batik.css.engine.value.svg from both batik.css and batik.all
    [javac] error: module de.rototor.pdfbox.graphics2d reads package org.apache.batik.css.engine.value.css2 from both batik.css and batik.all
    [javac] error: module de.rototor.pdfbox.graphics2d reads package org.apache.batik.css.engine.value.svg12 from both batik.css and batik.all
    [javac] error: module de.rototor.pdfbox.graphics2d reads package org.apache.batik.css.engine.sac from both batik.css and batik.all
    [javac] error: module de.rototor.pdfbox.graphics2d reads package org.apache.batik.css.dom from both batik.css and batik.all
    [javac] error: module de.rototor.pdfbox.graphics2d reads package org.apache.batik.css.parser from both batik.css and batik.all
    [javac] error: module de.rototor.pdfbox.graphics2d reads package org.apache.batik.constants from both batik.constants and batik.all
    [javac] error: module de.rototor.pdfbox.graphics2d reads package org.apache.batik.bridge from both batik.bridge and batik.all
    [javac] error: module de.rototor.pdfbox.graphics2d reads package org.apache.batik.bridge.svg12 from both batik.bridge and batik.all
    [javac] 100 errors
    [javac] only showing the first 100 errors, of 3697 total; use -Xmaxerrs if you would like to see more

BUILD FAILED
<https://ci-builds.apache.org/job/POI/job/POI-DSL-Windows-1.14/ws/build.xml>:1226: The following error occurred while executing this line:
<https://ci-builds.apache.org/job/POI/job/POI-DSL-Windows-1.14/ws/build.xml>:1064: Compile failed; see the compiler error output for details.

Total time: 7 minutes 17 seconds
Build step 'Invoke Ant' marked build as failure
[SpotBugs] Skipping execution of recorder since overall result is 'FAILURE'
Archiving artifacts
[Fast Archiver] Compressed 2.79 MB of artifacts by 24.6% relative to #42
[WARNINGS] Skipping publisher since build result is FAILURE
Recording test results
ERROR: Step ‘Publish JUnit test result report’ failed: No test report files were found. Configuration error?

---------------------------------------------------------------------
To unsubscribe, e-mail: [hidden email]
For additional commands, e-mail: [hidden email]