Build failed in Jenkins: POI » POI-DSL-Windows-1.14 #28

classic Classic list List threaded Threaded
7 messages Options
Reply | Threaded
Open this post in threaded view
|

Build failed in Jenkins: POI » POI-DSL-Windows-1.14 #28

Apache Jenkins Server
See <https://ci-builds.apache.org/job/POI/job/POI-DSL-Windows-1.14/28/display/redirect>

Changes:


------------------------------------------
[...truncated 730.01 KB...]
        at org.tmatesoft.svn.core.internal.io.dav.http.HTTPConnection.request(HTTPConnection.java:352)
        at org.tmatesoft.svn.core.internal.io.dav.http.HTTPConnection.request(HTTPConnection.java:340)
        at org.tmatesoft.svn.core.internal.io.dav.DAVConnection.performHttpRequest(DAVConnection.java:910)
        at org.tmatesoft.svn.core.internal.io.dav.DAVConnection.doReport(DAVConnection.java:363)
        at org.tmatesoft.svn.core.internal.io.dav.DAVRepository.runReport(DAVRepository.java:1361)
        at org.tmatesoft.svn.core.internal.io.dav.DAVRepository.update(DAVRepository.java:859)
        at org.tmatesoft.svn.core.internal.wc2.ng.SvnNgAbstractUpdate.updateInternal(SvnNgAbstractUpdate.java:263)
        at org.tmatesoft.svn.core.internal.wc2.ng.SvnNgAbstractUpdate.update(SvnNgAbstractUpdate.java:115)
        at org.tmatesoft.svn.core.internal.wc2.ng.SvnNgAbstractUpdate.checkout(SvnNgAbstractUpdate.java:877)
        at org.tmatesoft.svn.core.internal.wc2.ng.SvnNgCheckout.run(SvnNgCheckout.java:26)
        at org.tmatesoft.svn.core.internal.wc2.ng.SvnNgCheckout.run(SvnNgCheckout.java:11)
        at org.tmatesoft.svn.core.internal.wc2.ng.SvnNgOperationRunner.run(SvnNgOperationRunner.java:20)
        at org.tmatesoft.svn.core.internal.wc2.SvnOperationRunner.run(SvnOperationRunner.java:21)
        at org.tmatesoft.svn.core.wc2.SvnOperationFactory.run(SvnOperationFactory.java:1239)
        at org.tmatesoft.svn.core.wc2.SvnOperation.run(SvnOperation.java:294)
        at hudson.scm.subversion.CheckoutUpdater$SubversionUpdateTask.perform(CheckoutUpdater.java:130)
        at hudson.scm.subversion.WorkspaceUpdater$UpdateTask.delegateTo(WorkspaceUpdater.java:168)
        at hudson.scm.subversion.WorkspaceUpdater$UpdateTask.delegateTo(WorkspaceUpdater.java:176)
        at hudson.scm.subversion.UpdateUpdater$TaskImpl.perform(UpdateUpdater.java:185)
        at hudson.scm.subversion.WorkspaceUpdater$UpdateTask.delegateTo(WorkspaceUpdater.java:168)
        at hudson.scm.SubversionSCM$CheckOutTask.perform(SubversionSCM.java:1031)
        at hudson.scm.SubversionSCM$CheckOutTask.invoke(SubversionSCM.java:1007)
        at hudson.scm.SubversionSCM$CheckOutTask.invoke(SubversionSCM.java:980)
        at hudson.FilePath$FileCallableWrapper.call(FilePath.java:3073)
        at hudson.remoting.UserRequest.perform(UserRequest.java:211)
        at hudson.remoting.UserRequest.perform(UserRequest.java:54)
        at hudson.remoting.Request$2.run(Request.java:369)
        at hudson.remoting.InterceptingExecutorService$1.call(InterceptingExecutorService.java:72)
        at java.util.concurrent.FutureTask.run(Unknown Source)
        at java.util.concurrent.ThreadPoolExecutor.runWorker(Unknown Source)
        at java.util.concurrent.ThreadPoolExecutor$Worker.run(Unknown Source)
        at hudson.remoting.Engine$1.lambda$newThread$0(Engine.java:117)
        at java.lang.Thread.run(Unknown Source)
Caused by: javax.net.ssl.SSLException: SSL peer shut down incorrectly
        at sun.security.ssl.InputRecord.readV3Record(Unknown Source)
        at sun.security.ssl.InputRecord.read(Unknown Source)
        at sun.security.ssl.SSLSocketImpl.readRecord(Unknown Source)
        at sun.security.ssl.SSLSocketImpl.readDataRecord(Unknown Source)
        at sun.security.ssl.AppInputStream.read(Unknown Source)
        at java.io.BufferedInputStream.fill(Unknown Source)
        at java.io.BufferedInputStream.read(Unknown Source)
        at org.tmatesoft.svn.core.internal.util.ChunkedInputStream.readCRLF(ChunkedInputStream.java:85)
        at org.tmatesoft.svn.core.internal.util.ChunkedInputStream.nextChunk(ChunkedInputStream.java:95)
        at org.tmatesoft.svn.core.internal.util.ChunkedInputStream.read(ChunkedInputStream.java:69)
        at java.util.zip.InflaterInputStream.fill(Unknown Source)
        at java.util.zip.InflaterInputStream.read(Unknown Source)
        at java.util.zip.GZIPInputStream.read(Unknown Source)
        at sun.nio.cs.StreamDecoder.readBytes(Unknown Source)
        at sun.nio.cs.StreamDecoder.implRead(Unknown Source)
        at sun.nio.cs.StreamDecoder.read(Unknown Source)
        at java.io.InputStreamReader.read(Unknown Source)
        at org.tmatesoft.svn.core.internal.io.dav.http.XMLReader.read(XMLReader.java:39)
        at com.sun.org.apache.xerces.internal.impl.XMLEntityScanner.load(Unknown Source)
        at com.sun.org.apache.xerces.internal.impl.XMLEntityScanner.peekChar(Unknown Source)
        at com.sun.org.apache.xerces.internal.impl.XMLDocumentFragmentScannerImpl$FragmentContentDriver.next(Unknown Source)
        at com.sun.org.apache.xerces.internal.impl.XMLDocumentScannerImpl.next(Unknown Source)
        at com.sun.org.apache.xerces.internal.impl.XMLNSDocumentScannerImpl.next(Unknown Source)
        at com.sun.org.apache.xerces.internal.impl.XMLDocumentFragmentScannerImpl.scanDocument(Unknown Source)
        at com.sun.org.apache.xerces.internal.parsers.XML11Configuration.parse(Unknown Source)
        at com.sun.org.apache.xerces.internal.parsers.XML11Configuration.parse(Unknown Source)
        at com.sun.org.apache.xerces.internal.parsers.XMLParser.parse(Unknown Source)
        at com.sun.org.apache.xerces.internal.parsers.AbstractSAXParser.parse(Unknown Source)
        at com.sun.org.apache.xerces.internal.jaxp.SAXParserImpl$JAXPSAXParser.parse(Unknown Source)
        at org.tmatesoft.svn.core.internal.io.dav.http.HTTPConnection.readData(HTTPConnection.java:898)
        at org.tmatesoft.svn.core.internal.io.dav.http.HTTPConnection.readData(HTTPConnection.java:863)
        at org.tmatesoft.svn.core.internal.io.dav.http.HTTPRequest.dispatch(HTTPRequest.java:220)
        at org.tmatesoft.svn.core.internal.io.dav.http.HTTPConnection.request(HTTPConnection.java:451)
        ... 33 more
javax.net.ssl.SSLException: SSL peer shut down incorrectly
        at sun.security.ssl.InputRecord.readV3Record(Unknown Source)
        at sun.security.ssl.InputRecord.read(Unknown Source)
        at sun.security.ssl.SSLSocketImpl.readRecord(Unknown Source)
        at sun.security.ssl.SSLSocketImpl.readDataRecord(Unknown Source)
        at sun.security.ssl.AppInputStream.read(Unknown Source)
        at java.io.BufferedInputStream.fill(Unknown Source)
        at java.io.BufferedInputStream.read(Unknown Source)
        at org.tmatesoft.svn.core.internal.util.ChunkedInputStream.readCRLF(ChunkedInputStream.java:85)
        at org.tmatesoft.svn.core.internal.util.ChunkedInputStream.nextChunk(ChunkedInputStream.java:95)
        at org.tmatesoft.svn.core.internal.util.ChunkedInputStream.read(ChunkedInputStream.java:69)
        at java.util.zip.InflaterInputStream.fill(Unknown Source)
        at java.util.zip.InflaterInputStream.read(Unknown Source)
        at java.util.zip.GZIPInputStream.read(Unknown Source)
        at sun.nio.cs.StreamDecoder.readBytes(Unknown Source)
        at sun.nio.cs.StreamDecoder.implRead(Unknown Source)
        at sun.nio.cs.StreamDecoder.read(Unknown Source)
        at java.io.InputStreamReader.read(Unknown Source)
        at org.tmatesoft.svn.core.internal.io.dav.http.XMLReader.read(XMLReader.java:39)
        at com.sun.org.apache.xerces.internal.impl.XMLEntityScanner.load(Unknown Source)
        at com.sun.org.apache.xerces.internal.impl.XMLEntityScanner.peekChar(Unknown Source)
        at com.sun.org.apache.xerces.internal.impl.XMLDocumentFragmentScannerImpl$FragmentContentDriver.next(Unknown Source)
        at com.sun.org.apache.xerces.internal.impl.XMLDocumentScannerImpl.next(Unknown Source)
        at com.sun.org.apache.xerces.internal.impl.XMLNSDocumentScannerImpl.next(Unknown Source)
        at com.sun.org.apache.xerces.internal.impl.XMLDocumentFragmentScannerImpl.scanDocument(Unknown Source)
        at com.sun.org.apache.xerces.internal.parsers.XML11Configuration.parse(Unknown Source)
        at com.sun.org.apache.xerces.internal.parsers.XML11Configuration.parse(Unknown Source)
        at com.sun.org.apache.xerces.internal.parsers.XMLParser.parse(Unknown Source)
        at com.sun.org.apache.xerces.internal.parsers.AbstractSAXParser.parse(Unknown Source)
        at com.sun.org.apache.xerces.internal.jaxp.SAXParserImpl$JAXPSAXParser.parse(Unknown Source)
        at org.tmatesoft.svn.core.internal.io.dav.http.HTTPConnection.readData(HTTPConnection.java:898)
        at org.tmatesoft.svn.core.internal.io.dav.http.HTTPConnection.readData(HTTPConnection.java:863)
        at org.tmatesoft.svn.core.internal.io.dav.http.HTTPRequest.dispatch(HTTPRequest.java:220)
        at org.tmatesoft.svn.core.internal.io.dav.http.HTTPConnection.request(HTTPConnection.java:451)
Caused: org.tmatesoft.svn.core.SVNException: svn: E175002: SSL peer shut down incorrectly
svn: E175002: REPORT request failed on '/repos/asf/!svn/vcc/default'
        at org.tmatesoft.svn.core.internal.wc.SVNErrorManager.error(SVNErrorManager.java:112)
        at org.tmatesoft.svn.core.internal.wc.SVNErrorManager.error(SVNErrorManager.java:96)
        at org.tmatesoft.svn.core.internal.io.dav.http.HTTPConnection.request(HTTPConnection.java:765)
        at org.tmatesoft.svn.core.internal.io.dav.http.HTTPConnection.request(HTTPConnection.java:352)
        at org.tmatesoft.svn.core.internal.io.dav.http.HTTPConnection.request(HTTPConnection.java:340)
        at org.tmatesoft.svn.core.internal.io.dav.DAVConnection.performHttpRequest(DAVConnection.java:910)
        at org.tmatesoft.svn.core.internal.io.dav.DAVConnection.doReport(DAVConnection.java:363)
        at org.tmatesoft.svn.core.internal.io.dav.DAVRepository.runReport(DAVRepository.java:1361)
        at org.tmatesoft.svn.core.internal.io.dav.DAVRepository.update(DAVRepository.java:859)
        at org.tmatesoft.svn.core.internal.wc2.ng.SvnNgAbstractUpdate.updateInternal(SvnNgAbstractUpdate.java:263)
        at org.tmatesoft.svn.core.internal.wc2.ng.SvnNgAbstractUpdate.update(SvnNgAbstractUpdate.java:115)
        at org.tmatesoft.svn.core.internal.wc2.ng.SvnNgAbstractUpdate.checkout(SvnNgAbstractUpdate.java:877)
        at org.tmatesoft.svn.core.internal.wc2.ng.SvnNgCheckout.run(SvnNgCheckout.java:26)
        at org.tmatesoft.svn.core.internal.wc2.ng.SvnNgCheckout.run(SvnNgCheckout.java:11)
        at org.tmatesoft.svn.core.internal.wc2.ng.SvnNgOperationRunner.run(SvnNgOperationRunner.java:20)
        at org.tmatesoft.svn.core.internal.wc2.SvnOperationRunner.run(SvnOperationRunner.java:21)
        at org.tmatesoft.svn.core.wc2.SvnOperationFactory.run(SvnOperationFactory.java:1239)
        at org.tmatesoft.svn.core.wc2.SvnOperation.run(SvnOperation.java:294)
        at hudson.scm.subversion.CheckoutUpdater$SubversionUpdateTask.perform(CheckoutUpdater.java:130)
Also:   hudson.remoting.Channel$CallSiteStackTrace: Remote call to JNLP4-connect connection from static.62.73.9.176.clients.your-server.de/176.9.73.62:51332
                at hudson.remoting.Channel.attachCallSiteStackTrace(Channel.java:1788)
                at hudson.remoting.UserRequest$ExceptionResponse.retrieve(UserRequest.java:356)
                at hudson.remoting.Channel.call(Channel.java:998)
                at hudson.FilePath.act(FilePath.java:1069)
                at hudson.FilePath.act(FilePath.java:1058)
                at hudson.scm.SubversionSCM.checkout(SubversionSCM.java:927)
                at hudson.scm.SubversionSCM.checkout(SubversionSCM.java:857)
                at hudson.scm.SCM.checkout(SCM.java:505)
                at hudson.model.AbstractProject.checkout(AbstractProject.java:1206)
                at hudson.model.AbstractBuild$AbstractBuildExecution.defaultCheckout(AbstractBuild.java:574)
                at jenkins.scm.SCMCheckoutStrategy.checkout(SCMCheckoutStrategy.java:86)
                at hudson.model.AbstractBuild$AbstractBuildExecution.run(AbstractBuild.java:499)
                at hudson.model.Run.execute(Run.java:1880)
                at hudson.model.FreeStyleBuild.run(FreeStyleBuild.java:43)
                at hudson.model.ResourceController.execute(ResourceController.java:97)
                at hudson.model.Executor.run(Executor.java:428)
Caused: java.io.IOException: Failed to check out https://svn.apache.org/repos/asf/poi/trunk
        at hudson.scm.subversion.CheckoutUpdater$SubversionUpdateTask.perform(CheckoutUpdater.java:141)
        at hudson.scm.subversion.WorkspaceUpdater$UpdateTask.delegateTo(WorkspaceUpdater.java:168)
        at hudson.scm.subversion.WorkspaceUpdater$UpdateTask.delegateTo(WorkspaceUpdater.java:176)
        at hudson.scm.subversion.UpdateUpdater$TaskImpl.perform(UpdateUpdater.java:185)
        at hudson.scm.subversion.WorkspaceUpdater$UpdateTask.delegateTo(WorkspaceUpdater.java:168)
        at hudson.scm.SubversionSCM$CheckOutTask.perform(SubversionSCM.java:1031)
        at hudson.scm.SubversionSCM$CheckOutTask.invoke(SubversionSCM.java:1007)
        at hudson.scm.SubversionSCM$CheckOutTask.invoke(SubversionSCM.java:980)
        at hudson.FilePath$FileCallableWrapper.call(FilePath.java:3073)
        at hudson.remoting.UserRequest.perform(UserRequest.java:211)
        at hudson.remoting.UserRequest.perform(UserRequest.java:54)
        at hudson.remoting.Request$2.run(Request.java:369)
        at hudson.remoting.InterceptingExecutorService$1.call(InterceptingExecutorService.java:72)
        at java.util.concurrent.FutureTask.run(Unknown Source)
        at java.util.concurrent.ThreadPoolExecutor.runWorker(Unknown Source)
        at java.util.concurrent.ThreadPoolExecutor$Worker.run(Unknown Source)
        at hudson.remoting.Engine$1.lambda$newThread$0(Engine.java:117)
        at java.lang.Thread.run(Unknown Source)
Retrying after 10 seconds
Updating https://svn.apache.org/repos/asf/poi/trunk at revision '2021-01-10T14:00:48.479 -0800'
Workspace appear to be locked, so getting a fresh workspace
Cleaning local Directory .
Also:   Also:   java.nio.file.FileSystemException: <https://ci-builds.apache.org/job/POI/job/POI-DSL-Windows-1.14/ws/.svn\svn.7e95bc3a-05f0-42d7-a859-fa23fc775834.tmp>: The process cannot access the file because it is being used by another process.

                        at sun.nio.fs.WindowsException.translateToIOException(Unknown Source)
                        at sun.nio.fs.WindowsException.rethrowAsIOException(Unknown Source)
                        at sun.nio.fs.WindowsException.rethrowAsIOException(Unknown Source)
                        at sun.nio.fs.WindowsFileSystemProvider.implDelete(Unknown Source)
                        at sun.nio.fs.AbstractFileSystemProvider.deleteIfExists(Unknown Source)
                        at java.nio.file.Files.deleteIfExists(Unknown Source)
                        at jenkins.util.io.PathRemover.removeOrMakeRemovableThenRemove(PathRemover.java:237)
        Also:   java.nio.file.FileSystemException: <https://ci-builds.apache.org/job/POI/job/POI-DSL-Windows-1.14/ws/.svn\svn.7e95bc3a-05f0-42d7-a859-fa23fc775834.tmp>: The process cannot access the file because it is being used by another process.

                        at sun.nio.fs.WindowsException.translateToIOException(Unknown Source)
                        at sun.nio.fs.WindowsException.rethrowAsIOException(Unknown Source)
                        at sun.nio.fs.WindowsException.rethrowAsIOException(Unknown Source)
                        at sun.nio.fs.WindowsFileSystemProvider.implDelete(Unknown Source)
                        at sun.nio.fs.AbstractFileSystemProvider.deleteIfExists(Unknown Source)
                        at java.nio.file.Files.deleteIfExists(Unknown Source)
                        at jenkins.util.io.PathRemover.removeOrMakeRemovableThenRemove(PathRemover.java:241)
jenkins.util.io.CompositeIOException: Unable to remove file <https://ci-builds.apache.org/job/POI/job/POI-DSL-Windows-1.14/ws/.svn\svn.7e95bc3a-05f0-42d7-a859-fa23fc775834.tmp>
                at jenkins.util.io.PathRemover.removeOrMakeRemovableThenRemove(PathRemover.java:252)
                at jenkins.util.io.PathRemover.tryRemoveFile(PathRemover.java:205)
                at jenkins.util.io.PathRemover.tryRemoveRecursive(PathRemover.java:216)
                at jenkins.util.io.PathRemover.tryRemoveDirectoryContents(PathRemover.java:226)
                at jenkins.util.io.PathRemover.tryRemoveRecursive(PathRemover.java:215)
                at jenkins.util.io.PathRemover.tryRemoveDirectoryContents(PathRemover.java:226)
                at jenkins.util.io.PathRemover.forceRemoveDirectoryContents(PathRemover.java:87)
Also:   Also:   java.nio.file.DirectoryNotEmptyException: <https://ci-builds.apache.org/job/POI/job/POI-DSL-Windows-1.14/ws/.svn>
                        at sun.nio.fs.WindowsFileSystemProvider.implDelete(Unknown Source)
                        at sun.nio.fs.AbstractFileSystemProvider.deleteIfExists(Unknown Source)
                        at java.nio.file.Files.deleteIfExists(Unknown Source)
                        at jenkins.util.io.PathRemover.removeOrMakeRemovableThenRemove(PathRemover.java:237)
        Also:   java.nio.file.DirectoryNotEmptyException: <https://ci-builds.apache.org/job/POI/job/POI-DSL-Windows-1.14/ws/.svn>
                        at sun.nio.fs.WindowsFileSystemProvider.implDelete(Unknown Source)
                        at sun.nio.fs.AbstractFileSystemProvider.deleteIfExists(Unknown Source)
                        at java.nio.file.Files.deleteIfExists(Unknown Source)
                        at jenkins.util.io.PathRemover.removeOrMakeRemovableThenRemove(PathRemover.java:241)
jenkins.util.io.CompositeIOException: Unable to remove directory <https://ci-builds.apache.org/job/POI/job/POI-DSL-Windows-1.14/ws/.svn> with directory contents: [<https://ci-builds.apache.org/job/POI/job/POI-DSL-Windows-1.14/ws/.svn\svn.7e95bc3a-05f0-42d7-a859-fa23fc775834.tmp]>
                at jenkins.util.io.PathRemover.removeOrMakeRemovableThenRemove(PathRemover.java:250)
                at jenkins.util.io.PathRemover.tryRemoveFile(PathRemover.java:205)
                at jenkins.util.io.PathRemover.tryRemoveRecursive(PathRemover.java:216)
                at jenkins.util.io.PathRemover.tryRemoveDirectoryContents(PathRemover.java:226)
                at jenkins.util.io.PathRemover.forceRemoveDirectoryContents(PathRemover.java:87)
Also:   hudson.remoting.Channel$CallSiteStackTrace: Remote call to JNLP4-connect connection from static.62.73.9.176.clients.your-server.de/176.9.73.62:51332
                at hudson.remoting.Channel.attachCallSiteStackTrace(Channel.java:1788)
                at hudson.remoting.UserRequest$ExceptionResponse.retrieve(UserRequest.java:356)
                at hudson.remoting.Channel.call(Channel.java:998)
                at hudson.FilePath.act(FilePath.java:1069)
                at hudson.FilePath.act(FilePath.java:1058)
                at hudson.scm.SubversionSCM.checkout(SubversionSCM.java:927)
                at hudson.scm.SubversionSCM.checkout(SubversionSCM.java:857)
                at hudson.scm.SCM.checkout(SCM.java:505)
                at hudson.model.AbstractProject.checkout(AbstractProject.java:1206)
                at hudson.model.AbstractBuild$AbstractBuildExecution.defaultCheckout(AbstractBuild.java:574)
                at jenkins.scm.SCMCheckoutStrategy.checkout(SCMCheckoutStrategy.java:86)
                at hudson.model.AbstractBuild$AbstractBuildExecution.run(AbstractBuild.java:499)
                at hudson.model.Run.execute(Run.java:1880)
                at hudson.model.FreeStyleBuild.run(FreeStyleBuild.java:43)
                at hudson.model.ResourceController.execute(ResourceController.java:97)
                at hudson.model.Executor.run(Executor.java:428)
jenkins.util.io.CompositeIOException: Unable to delete '<https://ci-builds.apache.org/job/POI/job/POI-DSL-Windows-1.14/ws/.'.> Tried 3 times (of a maximum of 3) waiting 0.1 sec between attempts.
        at jenkins.util.io.PathRemover.forceRemoveDirectoryContents(PathRemover.java:90)
        at hudson.Util.deleteContentsRecursive(Util.java:261)
        at hudson.Util.deleteContentsRecursive(Util.java:250)
        at hudson.scm.subversion.CheckoutUpdater$SubversionUpdateTask.perform(CheckoutUpdater.java:90)
        at hudson.scm.subversion.WorkspaceUpdater$UpdateTask.delegateTo(WorkspaceUpdater.java:168)
        at hudson.scm.subversion.WorkspaceUpdater$UpdateTask.delegateTo(WorkspaceUpdater.java:176)
        at hudson.scm.subversion.UpdateUpdater$TaskImpl.perform(UpdateUpdater.java:185)
        at hudson.scm.subversion.WorkspaceUpdater$UpdateTask.delegateTo(WorkspaceUpdater.java:168)
        at hudson.scm.SubversionSCM$CheckOutTask.perform(SubversionSCM.java:1031)
        at hudson.scm.SubversionSCM$CheckOutTask.invoke(SubversionSCM.java:1007)
        at hudson.scm.SubversionSCM$CheckOutTask.invoke(SubversionSCM.java:980)
        at hudson.FilePath$FileCallableWrapper.call(FilePath.java:3073)
        at hudson.remoting.UserRequest.perform(UserRequest.java:211)
        at hudson.remoting.UserRequest.perform(UserRequest.java:54)
        at hudson.remoting.Request$2.run(Request.java:369)
        at hudson.remoting.InterceptingExecutorService$1.call(InterceptingExecutorService.java:72)
        at java.util.concurrent.FutureTask.run(Unknown Source)
        at java.util.concurrent.ThreadPoolExecutor.runWorker(Unknown Source)
        at java.util.concurrent.ThreadPoolExecutor$Worker.run(Unknown Source)
        at hudson.remoting.Engine$1.lambda$newThread$0(Engine.java:117)
        at java.lang.Thread.run(Unknown Source)
[SpotBugs] Skipping execution of recorder since overall result is 'FAILURE'
Archiving artifacts
[WARNINGS] Skipping publisher since build result is FAILURE
Recording test results
ERROR: Step ‘Publish JUnit test result report’ failed: No test report files were found. Configuration error?

---------------------------------------------------------------------
To unsubscribe, e-mail: [hidden email]
For additional commands, e-mail: [hidden email]

Reply | Threaded
Open this post in threaded view
|

Build failed in Jenkins: POI » POI-DSL-Windows-1.14 #29

Apache Jenkins Server
See <https://ci-builds.apache.org/job/POI/job/POI-DSL-Windows-1.14/29/display/redirect>

Changes:


------------------------------------------
[...truncated 373.49 KB...]
     [echo] Ran org.apache.poi.ss.formula.functions.TestIndirectFunctionFromSpreadsheet
     [echo] Tests run: 11, Failures: 0, Aborted: 0, Skipped: 0, Time elapsed: 0.007003 sec
     [echo] Ran org.apache.poi.ss.formula.functions.TestIntercept
     [echo] Tests run: 4, Failures: 0, Aborted: 0, Skipped: 0, Time elapsed: 0.003000 sec
     [echo] Ran org.apache.poi.ss.formula.functions.TestIrr
     [echo] Tests run: 3, Failures: 0, Aborted: 0, Skipped: 0, Time elapsed: 0.003001 sec
     [echo] Ran org.apache.poi.ss.formula.functions.TestIsBlank
     [echo] Tests run: 1, Failures: 0, Aborted: 0, Skipped: 0, Time elapsed: 0.001002 sec
     [echo] Ran org.apache.poi.ss.formula.functions.TestLeftRight
     [echo] Tests run: 2, Failures: 0, Aborted: 0, Skipped: 0, Time elapsed: 0.000998 sec
     [echo] Ran org.apache.poi.ss.formula.functions.TestLen
     [echo] Tests run: 3, Failures: 0, Aborted: 0, Skipped: 0, Time elapsed: 0.000995 sec
     [echo] Ran org.apache.poi.ss.formula.functions.TestLogicalFunction
     [echo] Tests run: 2, Failures: 0, Aborted: 0, Skipped: 0, Time elapsed: 0.000999 sec
     [echo] Ran org.apache.poi.ss.formula.functions.TestLogicalFunctionsFromSpreadsheet
     [echo] Tests run: 15, Failures: 0, Aborted: 0, Skipped: 0, Time elapsed: 0.009005 sec
     [echo] Ran org.apache.poi.ss.formula.functions.TestLookupFunctionsFromSpreadsheet
     [echo] Tests run: 205, Failures: 0, Aborted: 0, Skipped: 0, Time elapsed: 0.136053 sec
     [echo] Ran org.apache.poi.ss.formula.functions.TestMatch
     [echo] Tests run: 9, Failures: 0, Aborted: 0, Skipped: 0, Time elapsed: 0.005001 sec
     [echo] Ran org.apache.poi.ss.formula.functions.TestMatchFunctionsFromSpreadsheet
     [echo] Tests run: 14, Failures: 0, Aborted: 0, Skipped: 0, Time elapsed: 0.010001 sec
     [echo] Ran org.apache.poi.ss.formula.functions.TestMathX
     [echo] Tests run: 23, Failures: 0, Aborted: 0, Skipped: 0, Time elapsed: 0.008001 sec
     [echo] Ran org.apache.poi.ss.formula.functions.TestMid
     [echo] Tests run: 4, Failures: 0, Aborted: 0, Skipped: 0, Time elapsed: 0.002001 sec
     [echo] Ran org.apache.poi.ss.formula.functions.TestMirr
     [echo] Tests run: 4, Failures: 0, Aborted: 0, Skipped: 0, Time elapsed: 0.004003 sec
     [echo] Ran org.apache.poi.ss.formula.functions.TestMultiOperandNumericFunction
     [echo] Tests run: 3, Failures: 0, Aborted: 0, Skipped: 0, Time elapsed: 0.000000 sec
     [echo] Ran org.apache.poi.ss.formula.functions.TestNper
     [echo] Tests run: 2, Failures: 0, Aborted: 0, Skipped: 0, Time elapsed: 0.001001 sec
     [echo] Ran org.apache.poi.ss.formula.functions.TestNpv
     [echo] Tests run: 2, Failures: 0, Aborted: 0, Skipped: 0, Time elapsed: 0.002001 sec
     [echo] Ran org.apache.poi.ss.formula.functions.TestOct2Dec
     [echo] Tests run: 2, Failures: 0, Aborted: 0, Skipped: 0, Time elapsed: 0.001000 sec
     [echo] Ran org.apache.poi.ss.formula.functions.TestOffset
     [echo] Tests run: 21, Failures: 0, Aborted: 0, Skipped: 0, Time elapsed: 0.016007 sec
     [echo] Ran org.apache.poi.ss.formula.functions.TestPPMT
     [echo] Tests run: 1, Failures: 0, Aborted: 0, Skipped: 0, Time elapsed: 0.002999 sec
     [echo] Ran org.apache.poi.ss.formula.functions.TestPmt
     [echo] Tests run: 2, Failures: 0, Aborted: 0, Skipped: 0, Time elapsed: 0.000000 sec
     [echo] Ran org.apache.poi.ss.formula.functions.TestPoisson
     [echo] Tests run: 6, Failures: 0, Aborted: 0, Skipped: 0, Time elapsed: 0.001000 sec
     [echo] Ran org.apache.poi.ss.formula.functions.TestProduct
     [echo] Tests run: 4, Failures: 0, Aborted: 0, Skipped: 0, Time elapsed: 0.001000 sec
     [echo] Ran org.apache.poi.ss.formula.functions.TestQuotient
     [echo] Tests run: 2, Failures: 0, Aborted: 0, Skipped: 0, Time elapsed: 0.001000 sec
     [echo] Ran org.apache.poi.ss.formula.functions.TestQuotientFunctionsFromSpreadsheet
     [echo] Tests run: 8, Failures: 0, Aborted: 0, Skipped: 0, Time elapsed: 0.004002 sec
     [echo] Ran org.apache.poi.ss.formula.functions.TestRank
     [echo] Tests run: 1, Failures: 0, Aborted: 0, Skipped: 0, Time elapsed: 0.002001 sec
     [echo] Ran org.apache.poi.ss.formula.functions.TestRelationalOperations
     [echo] Tests run: 5, Failures: 0, Aborted: 0, Skipped: 0, Time elapsed: 0.001001 sec
     [echo] Ran org.apache.poi.ss.formula.functions.TestReptFunctionsFromSpreadsheet
     [echo] Tests run: 5, Failures: 0, Aborted: 0, Skipped: 0, Time elapsed: 0.004001 sec
     [echo] Ran org.apache.poi.ss.formula.functions.TestRomanFunctionsFromSpreadsheet
     [echo] Tests run: 35, Failures: 0, Aborted: 0, Skipped: 0, Time elapsed: 0.011004 sec
     [echo] Ran org.apache.poi.ss.formula.functions.TestRoundFuncs
     [echo] Tests run: 5, Failures: 0, Aborted: 0, Skipped: 1, Time elapsed: 0.000999 sec
     [echo] Ran org.apache.poi.ss.formula.functions.TestRowCol
     [echo] Tests run: 4, Failures: 0, Aborted: 0, Skipped: 0, Time elapsed: 0.001000 sec
     [echo] Ran org.apache.poi.ss.formula.functions.TestSlope
     [echo] Tests run: 3, Failures: 0, Aborted: 0, Skipped: 0, Time elapsed: 0.001000 sec
     [echo] Ran org.apache.poi.ss.formula.functions.TestStatsLib
     [echo] Tests run: 8, Failures: 0, Aborted: 0, Skipped: 0, Time elapsed: 0.001000 sec
     [echo] Ran org.apache.poi.ss.formula.functions.TestSubstitute
     [echo] Tests run: 5, Failures: 0, Aborted: 0, Skipped: 0, Time elapsed: 0.001001 sec
     [echo] Ran org.apache.poi.ss.formula.functions.TestSubtotal
     [echo] Tests run: 11, Failures: 0, Aborted: 0, Skipped: 0, Time elapsed: 0.007003 sec
     [echo] Ran org.apache.poi.ss.formula.functions.TestSumif
     [echo] Tests run: 3, Failures: 0, Aborted: 0, Skipped: 0, Time elapsed: 0.001000 sec
     [echo] Ran org.apache.poi.ss.formula.functions.TestSumifs
     [echo] Tests run: 7, Failures: 0, Aborted: 0, Skipped: 0, Time elapsed: 0.004002 sec
     [echo] Ran org.apache.poi.ss.formula.functions.TestSumproduct
     [echo] Tests run: 5, Failures: 0, Aborted: 0, Skipped: 0, Time elapsed: 0.000999 sec
     [echo] Ran org.apache.poi.ss.formula.functions.TestTFunc
     [echo] Tests run: 5, Failures: 0, Aborted: 0, Skipped: 0, Time elapsed: 0.001000 sec
     [echo] Ran org.apache.poi.ss.formula.functions.TestText
     [echo] Tests run: 4, Failures: 0, Aborted: 0, Skipped: 0, Time elapsed: 0.003001 sec
     [echo] Ran org.apache.poi.ss.formula.functions.TestTime
     [echo] Tests run: 2, Failures: 0, Aborted: 0, Skipped: 0, Time elapsed: 0.003000 sec
     [echo] Ran org.apache.poi.ss.formula.functions.TestTrendFunctionsFromSpreadsheet
     [echo] Tests run: 41, Failures: 0, Aborted: 0, Skipped: 0, Time elapsed: 0.042017 sec
     [echo] Ran org.apache.poi.ss.formula.functions.TestTrim
     [echo] Tests run: 3, Failures: 0, Aborted: 0, Skipped: 0, Time elapsed: 0.000999 sec
     [echo] Ran org.apache.poi.ss.formula.functions.TestTrunc
     [echo] Tests run: 7, Failures: 0, Aborted: 0, Skipped: 0, Time elapsed: 0.002000 sec
     [echo] Ran org.apache.poi.ss.formula.functions.TestTwoOperandNumericFunctionsFromSpreadsheet
     [echo] Tests run: 34, Failures: 0, Aborted: 0, Skipped: 0, Time elapsed: 0.027009 sec
     [echo] Ran org.apache.poi.ss.formula.functions.TestValue
     [echo] Tests run: 2, Failures: 0, Aborted: 0, Skipped: 0, Time elapsed: 0.001001 sec
     [echo] Ran org.apache.poi.ss.formula.functions.TestWeekNumFunctionsFromSpreadsheet
     [echo] Tests run: 7, Failures: 0, Aborted: 0, Skipped: 0, Time elapsed: 0.007005 sec
     [echo] Ran org.apache.poi.ss.formula.functions.TestWeekNumFunctionsFromSpreadsheet2013
     [echo] Tests run: 7, Failures: 0, Aborted: 0, Skipped: 0, Time elapsed: 0.006002 sec
     [echo] Ran org.apache.poi.ss.formula.functions.TestWeekdayFunc
     [echo] Tests run: 2, Failures: 0, Aborted: 0, Skipped: 0, Time elapsed: 0.000998 sec
     [echo] Ran org.apache.poi.ss.formula.functions.TestXYNumericFunction
     [echo] Tests run: 3, Failures: 0, Aborted: 0, Skipped: 0, Time elapsed: 0.002001 sec
     [echo] Ran org.apache.poi.ss.formula.ptg.TestAbstractFunctionPtg
     [echo] Tests run: 3, Failures: 0, Aborted: 0, Skipped: 0, Time elapsed: 0.001000 sec
     [echo] Ran org.apache.poi.ss.formula.ptg.TestArea3DPtg
     [echo] Tests run: 1, Failures: 0, Aborted: 0, Skipped: 0, Time elapsed: 0.001000 sec
     [echo] Ran org.apache.poi.ss.formula.ptg.TestAreaErrPtg
     [echo] Tests run: 1, Failures: 0, Aborted: 0, Skipped: 0, Time elapsed: 0.002000 sec
     [echo] Ran org.apache.poi.ss.formula.ptg.TestAreaPtg
     [echo] Tests run: 5, Failures: 0, Aborted: 0, Skipped: 0, Time elapsed: 0.001994 sec
     [echo] Ran org.apache.poi.ss.formula.ptg.TestArrayPtg
     [echo] Tests run: 5, Failures: 0, Aborted: 0, Skipped: 0, Time elapsed: 0.002001 sec
     [echo] Ran org.apache.poi.ss.formula.ptg.TestAttrPtg
     [echo] Tests run: 1, Failures: 0, Aborted: 0, Skipped: 0, Time elapsed: 0.000000 sec
     [echo] Ran org.apache.poi.ss.formula.ptg.TestErrPtg
     [echo] Tests run: 1, Failures: 0, Aborted: 0, Skipped: 0, Time elapsed: 0.001005 sec
     [echo] Ran org.apache.poi.ss.formula.ptg.TestExternalFunctionFormulas
     [echo] Tests run: 3, Failures: 0, Aborted: 0, Skipped: 0, Time elapsed: 0.003001 sec
     [echo] Ran org.apache.poi.ss.formula.ptg.TestExternalNameReference
     [echo] Tests run: 3, Failures: 0, Aborted: 0, Skipped: 0, Time elapsed: 0.004000 sec
     [echo] Ran org.apache.poi.ss.formula.ptg.TestFuncPtg
     [echo] Tests run: 2, Failures: 0, Aborted: 0, Skipped: 0, Time elapsed: 0.000000 sec
     [echo] Ran org.apache.poi.ss.formula.ptg.TestFuncVarPtg
     [echo] Tests run: 1, Failures: 0, Aborted: 0, Skipped: 0, Time elapsed: 0.000000 sec
     [echo] Ran org.apache.poi.ss.formula.ptg.TestIntersectionPtg
     [echo] Tests run: 1, Failures: 0, Aborted: 0, Skipped: 0, Time elapsed: 0.001000 sec
     [echo] Ran org.apache.poi.ss.formula.ptg.TestPercentPtg
     [echo] Tests run: 1, Failures: 0, Aborted: 0, Skipped: 0, Time elapsed: 0.001001 sec
     [echo] Ran org.apache.poi.ss.formula.ptg.TestRangePtg
     [echo] Tests run: 1, Failures: 0, Aborted: 0, Skipped: 0, Time elapsed: 0.001000 sec
     [echo] Ran org.apache.poi.ss.formula.ptg.TestRef3DPtg
     [echo] Tests run: 1, Failures: 0, Aborted: 0, Skipped: 0, Time elapsed: 0.001000 sec
     [echo] Ran org.apache.poi.ss.formula.ptg.TestReferencePtg
     [echo] Tests run: 4, Failures: 0, Aborted: 0, Skipped: 0, Time elapsed: 0.006002 sec
     [echo] Ran org.apache.poi.ss.formula.ptg.TestUnionPtg
     [echo] Tests run: 1, Failures: 0, Aborted: 0, Skipped: 0, Time elapsed: 0.000999 sec
     [echo] Ran org.apache.poi.ss.formula.udf.TestAggregatingUDFFinder
     [echo] Tests run: 2, Failures: 0, Aborted: 0, Skipped: 0, Time elapsed: 0.000000 sec
     [echo] Ran org.apache.poi.ss.formula.udf.TestDefaultUDFFinder
     [echo] Tests run: 1, Failures: 0, Aborted: 0, Skipped: 0, Time elapsed: 0.000000 sec
     [echo] Ran org.apache.poi.ss.usermodel.TestDataFormatter
     [echo] Tests run: 37, Failures: 0, Aborted: 0, Skipped: 1, Time elapsed: 0.348128 sec
     [echo] Ran org.apache.poi.ss.usermodel.TestDateUtil
     [echo] Tests run: 26, Failures: 0, Aborted: 0, Skipped: 0, Time elapsed: 0.017006 sec
     [echo] Ran org.apache.poi.ss.usermodel.TestExcelStyleDateFormatter
     [echo] Tests run: 4, Failures: 0, Aborted: 0, Skipped: 0, Time elapsed: 0.016007 sec
     [echo] Ran org.apache.poi.ss.usermodel.TestFractionFormat
     [echo] Tests run: 5, Failures: 0, Aborted: 0, Skipped: 1, Time elapsed: 0.250097 sec
     [echo] Ran org.apache.poi.ss.usermodel.TestHSSFBorderStyle
     [echo] Tests run: 1, Failures: 0, Aborted: 0, Skipped: 0, Time elapsed: 0.001000 sec
     [echo] Ran org.apache.poi.ss.usermodel.TestIndexedColors
     [echo] Tests run: 3, Failures: 0, Aborted: 0, Skipped: 0, Time elapsed: 0.000999 sec
     [echo] Ran org.apache.poi.ss.util.TestAreaReference
     [echo] Tests run: 3, Failures: 0, Aborted: 0, Skipped: 0, Time elapsed: 0.000999 sec
     [echo] Ran org.apache.poi.ss.util.TestCellAddress
     [echo] Tests run: 6, Failures: 0, Aborted: 0, Skipped: 0, Time elapsed: 0.002002 sec
     [echo] Ran org.apache.poi.ss.util.TestCellRangeAddress
     [echo] Tests run: 14, Failures: 0, Aborted: 0, Skipped: 0, Time elapsed: 0.004002 sec
     [echo] Ran org.apache.poi.ss.util.TestCellRangeUtil
     [echo] Tests run: 1, Failures: 0, Aborted: 0, Skipped: 0, Time elapsed: 0.000000 sec
     [echo] Ran org.apache.poi.ss.util.TestCellReference
     [echo] Tests run: 27, Failures: 0, Aborted: 0, Skipped: 0, Time elapsed: 0.221089 sec
     [echo] Ran org.apache.poi.ss.util.TestDateFormatConverter
     [echo] Tests run: 4, Failures: 0, Aborted: 0, Skipped: 0, Time elapsed: 3.686429 sec
     [echo] Ran org.apache.poi.ss.util.TestDateParser
     [echo] Tests run: 5, Failures: 0, Aborted: 0, Skipped: 0, Time elapsed: 0.004001 sec
     [echo] Ran org.apache.poi.ss.util.TestExpandedDouble
     [echo] Tests run: 3, Failures: 0, Aborted: 0, Skipped: 0, Time elapsed: 0.001000 sec
     [echo] Ran org.apache.poi.ss.util.TestHSSFCellUtil
     [echo] Tests run: 14, Failures: 0, Aborted: 0, Skipped: 0, Time elapsed: 0.019009 sec
     [echo] Ran org.apache.poi.ss.util.TestNumberComparer
     [echo] Tests run: 4, Failures: 0, Aborted: 0, Skipped: 0, Time elapsed: 0.030012 sec
     [echo] Ran org.apache.poi.ss.util.TestNumberToTextConverter
     [echo] Tests run: 2, Failures: 0, Aborted: 0, Skipped: 0, Time elapsed: 0.006001 sec
     [echo] Ran org.apache.poi.ss.util.TestPropertyTemplate
     [echo] Tests run: 8, Failures: 0, Aborted: 0, Skipped: 0, Time elapsed: 0.014005 sec
     [echo] Ran org.apache.poi.ss.util.TestRegionUtil
     [echo] Tests run: 10, Failures: 0, Aborted: 0, Skipped: 0, Time elapsed: 0.014007 sec
     [echo] Ran org.apache.poi.ss.util.TestSheetBuilder
     [echo] Tests run: 3, Failures: 0, Aborted: 0, Skipped: 0, Time elapsed: 0.003002 sec
     [echo] Ran org.apache.poi.ss.util.TestSheetUtil
     [echo] Tests run: 7, Failures: 0, Aborted: 0, Skipped: 0, Time elapsed: 0.005005 sec
     [echo] Ran org.apache.poi.ss.util.TestWorkbookUtil
     [echo] Tests run: 1, Failures: 0, Aborted: 0, Skipped: 0, Time elapsed: 0.000000 sec
     [echo] Ran org.apache.poi.ss.util.cellwalk.TestCellWalk
     [echo] Tests run: 1, Failures: 0, Aborted: 0, Skipped: 0, Time elapsed: 0.003002 sec
     [echo] Ran org.apache.poi.util.TestArrayUtil
     [echo] Tests run: 1, Failures: 0, Aborted: 0, Skipped: 0, Time elapsed: 0.002001 sec
     [echo] Ran org.apache.poi.util.TestBitField
     [echo] Tests run: 16, Failures: 0, Aborted: 0, Skipped: 0, Time elapsed: 0.003001 sec
     [echo] Ran org.apache.poi.util.TestByteField
     [echo] Tests run: 5, Failures: 0, Aborted: 0, Skipped: 0, Time elapsed: 0.002001 sec
     [echo] Ran org.apache.poi.util.TestHexDump
     [echo] Tests run: 6, Failures: 0, Aborted: 0, Skipped: 0, Time elapsed: 0.005002 sec
     [echo] Ran org.apache.poi.util.TestIOUtils
     [echo] Tests run: 36, Failures: 0, Aborted: 0, Skipped: 0, Time elapsed: 0.050020 sec
     [echo] Ran org.apache.poi.util.TestIntList
     [echo] Tests run: 19, Failures: 0, Aborted: 0, Skipped: 0, Time elapsed: 0.033014 sec
     [echo] Ran org.apache.poi.util.TestIntegerField
     [echo] Tests run: 5, Failures: 0, Aborted: 0, Skipped: 0, Time elapsed: 0.003001 sec
     [echo] Ran org.apache.poi.util.TestLittleEndian
     [echo] Tests run: 15, Failures: 0, Aborted: 0, Skipped: 0, Time elapsed: 0.003001 sec
     [echo] Ran org.apache.poi.util.TestLittleEndianStreams
     [echo] Tests run: 5, Failures: 0, Aborted: 0, Skipped: 0, Time elapsed: 0.001000 sec
     [echo] Ran org.apache.poi.util.TestLocaleUtil
     [echo] Tests run: 3, Failures: 0, Aborted: 0, Skipped: 0, Time elapsed: 0.000997 sec
     [echo] Ran org.apache.poi.util.TestLongField
     [echo] Tests run: 5, Failures: 0, Aborted: 0, Skipped: 0, Time elapsed: 0.002002 sec
     [echo] Ran org.apache.poi.util.TestPOILogFactory
     [echo] Tests run: 1, Failures: 0, Aborted: 0, Skipped: 0, Time elapsed: 0.001001 sec
     [echo] Ran org.apache.poi.util.TestPOILogger
     [echo] Tests run: 1, Failures: 0, Aborted: 0, Skipped: 0, Time elapsed: 0.001000 sec
     [echo] Ran org.apache.poi.util.TestRLEDecompressingInputStream
     [echo] Tests run: 4, Failures: 0, Aborted: 0, Skipped: 0, Time elapsed: 0.000000 sec
     [echo] Ran org.apache.poi.util.TestShortField
     [echo] Tests run: 5, Failures: 0, Aborted: 0, Skipped: 0, Time elapsed: 0.002000 sec
     [echo] Ran org.apache.poi.util.TestStringCodepointsIterable
     [echo] Tests run: 1, Failures: 0, Aborted: 0, Skipped: 0, Time elapsed: 0.000000 sec
     [echo] Ran org.apache.poi.util.TestStringUtil
     [echo] Tests run: 7, Failures: 0, Aborted: 0, Skipped: 0, Time elapsed: 0.003003 sec
     [echo] Ran org.apache.poi.util.TestTempFile
     [echo] Tests run: 4, Failures: 0, Aborted: 0, Skipped: 0, Time elapsed: 0.012005 sec
     [echo] Ran org.apache.poi.util.TestXMLHelper
     [echo] Tests run: 8, Failures: 0, Aborted: 0, Skipped: 0, Time elapsed: 0.282107 sec

-test-excelant-write-testfile:

test:

compile-integration:
    [javac] Compiling 28 source files to <https://ci-builds.apache.org/job/POI/job/POI-DSL-Windows-1.14/ws/build\integration-test-classes>
    [javac] Ignoring source, target and bootclasspath as release has been set
    [mkdir] Created dir: <https://ci-builds.apache.org/job/POI/job/POI-DSL-Windows-1.14/ws/build\integration-test-classes\META-INF\versions\9>
    [javac] Compiling 1 source file to <https://ci-builds.apache.org/job/POI/job/POI-DSL-Windows-1.14/ws/build\integration-test-classes\META-INF\versions\9>
      [jar] Building jar: <https://ci-builds.apache.org/job/POI/job/POI-DSL-Windows-1.14/ws/build\dist\maven\poi-integration\poi-integration-5.0.1.jar>

-test-integration-check:

test-integration:

BUILD FAILED
<https://ci-builds.apache.org/job/POI/job/POI-DSL-Windows-1.14/ws/build.xml>:1709: The following error occurred while executing this line:
<https://ci-builds.apache.org/job/POI/job/POI-DSL-Windows-1.14/ws/build.xml>:1256: Some test(s) have failure(s)

Total time: 24 minutes 31 seconds
Build step 'Invoke Ant' marked build as failure
[SpotBugs] Skipping execution of recorder since overall result is 'FAILURE'
Archiving artifacts
[Fast Archiver] Compressed 11.30 MB of artifacts by 26.8% relative to #27
[WARNINGS] Skipping publisher since build result is FAILURE
Recording test results

---------------------------------------------------------------------
To unsubscribe, e-mail: [hidden email]
For additional commands, e-mail: [hidden email]

Reply | Threaded
Open this post in threaded view
|

Build failed in Jenkins: POI » POI-DSL-Windows-1.14 #30

Apache Jenkins Server
See <https://ci-builds.apache.org/job/POI/job/POI-DSL-Windows-1.14/30/display/redirect?page=changes>

Changes:

[Andreas Beeker] Integration test - fix filenames with windows path separator

[Andreas Beeker] Remove superfluous test

[Andreas Beeker] Sonar fixes
add asserts to tests


------------------------------------------
[...truncated 754.12 KB...]
     [echo] Ran org.apache.poi.ss.formula.functions.TestIndirect
     [echo] Tests run: 3, Failures: 0, Aborted: 0, Skipped: 0, Time elapsed: 0.005003 sec
     [echo] Ran org.apache.poi.ss.formula.functions.TestIndirectFunctionFromSpreadsheet
     [echo] Tests run: 11, Failures: 0, Aborted: 0, Skipped: 0, Time elapsed: 0.007006 sec
     [echo] Ran org.apache.poi.ss.formula.functions.TestIntercept
     [echo] Tests run: 4, Failures: 0, Aborted: 0, Skipped: 0, Time elapsed: 0.003003 sec
     [echo] Ran org.apache.poi.ss.formula.functions.TestIrr
     [echo] Tests run: 3, Failures: 0, Aborted: 0, Skipped: 0, Time elapsed: 0.003002 sec
     [echo] Ran org.apache.poi.ss.formula.functions.TestIsBlank
     [echo] Tests run: 1, Failures: 0, Aborted: 0, Skipped: 0, Time elapsed: 0.001001 sec
     [echo] Ran org.apache.poi.ss.formula.functions.TestLeftRight
     [echo] Tests run: 2, Failures: 0, Aborted: 0, Skipped: 0, Time elapsed: 0.001001 sec
     [echo] Ran org.apache.poi.ss.formula.functions.TestLen
     [echo] Tests run: 3, Failures: 0, Aborted: 0, Skipped: 0, Time elapsed: 0.001003 sec
     [echo] Ran org.apache.poi.ss.formula.functions.TestLogicalFunction
     [echo] Tests run: 2, Failures: 0, Aborted: 0, Skipped: 0, Time elapsed: 0.002001 sec
     [echo] Ran org.apache.poi.ss.formula.functions.TestLogicalFunctionsFromSpreadsheet
     [echo] Tests run: 15, Failures: 0, Aborted: 0, Skipped: 0, Time elapsed: 0.009007 sec
     [echo] Ran org.apache.poi.ss.formula.functions.TestLookupFunctionsFromSpreadsheet
     [echo] Tests run: 205, Failures: 0, Aborted: 0, Skipped: 0, Time elapsed: 0.159155 sec
     [echo] Ran org.apache.poi.ss.formula.functions.TestMatch
     [echo] Tests run: 9, Failures: 0, Aborted: 0, Skipped: 0, Time elapsed: 0.006007 sec
     [echo] Ran org.apache.poi.ss.formula.functions.TestMatchFunctionsFromSpreadsheet
     [echo] Tests run: 14, Failures: 0, Aborted: 0, Skipped: 0, Time elapsed: 0.010010 sec
     [echo] Ran org.apache.poi.ss.formula.functions.TestMathX
     [echo] Tests run: 23, Failures: 0, Aborted: 0, Skipped: 0, Time elapsed: 0.008008 sec
     [echo] Ran org.apache.poi.ss.formula.functions.TestMid
     [echo] Tests run: 4, Failures: 0, Aborted: 0, Skipped: 0, Time elapsed: 0.001001 sec
     [echo] Ran org.apache.poi.ss.formula.functions.TestMirr
     [echo] Tests run: 4, Failures: 0, Aborted: 0, Skipped: 0, Time elapsed: 0.005003 sec
     [echo] Ran org.apache.poi.ss.formula.functions.TestMultiOperandNumericFunction
     [echo] Tests run: 3, Failures: 0, Aborted: 0, Skipped: 0, Time elapsed: 0.001002 sec
     [echo] Ran org.apache.poi.ss.formula.functions.TestNper
     [echo] Tests run: 2, Failures: 0, Aborted: 0, Skipped: 0, Time elapsed: 0.001001 sec
     [echo] Ran org.apache.poi.ss.formula.functions.TestNpv
     [echo] Tests run: 2, Failures: 0, Aborted: 0, Skipped: 0, Time elapsed: 0.003003 sec
     [echo] Ran org.apache.poi.ss.formula.functions.TestOct2Dec
     [echo] Tests run: 2, Failures: 0, Aborted: 0, Skipped: 0, Time elapsed: 0.000000 sec
     [echo] Ran org.apache.poi.ss.formula.functions.TestOffset
     [echo] Tests run: 21, Failures: 0, Aborted: 0, Skipped: 0, Time elapsed: 0.016016 sec
     [echo] Ran org.apache.poi.ss.formula.functions.TestPPMT
     [echo] Tests run: 1, Failures: 0, Aborted: 0, Skipped: 0, Time elapsed: 0.002002 sec
     [echo] Ran org.apache.poi.ss.formula.functions.TestPmt
     [echo] Tests run: 2, Failures: 0, Aborted: 0, Skipped: 0, Time elapsed: 0.001001 sec
     [echo] Ran org.apache.poi.ss.formula.functions.TestPoisson
     [echo] Tests run: 6, Failures: 0, Aborted: 0, Skipped: 0, Time elapsed: 0.001001 sec
     [echo] Ran org.apache.poi.ss.formula.functions.TestProduct
     [echo] Tests run: 4, Failures: 0, Aborted: 0, Skipped: 0, Time elapsed: 0.001001 sec
     [echo] Ran org.apache.poi.ss.formula.functions.TestQuotient
     [echo] Tests run: 2, Failures: 0, Aborted: 0, Skipped: 0, Time elapsed: 0.001001 sec
     [echo] Ran org.apache.poi.ss.formula.functions.TestQuotientFunctionsFromSpreadsheet
     [echo] Tests run: 8, Failures: 0, Aborted: 0, Skipped: 0, Time elapsed: 0.006006 sec
     [echo] Ran org.apache.poi.ss.formula.functions.TestRank
     [echo] Tests run: 1, Failures: 0, Aborted: 0, Skipped: 0, Time elapsed: 0.005005 sec
     [echo] Ran org.apache.poi.ss.formula.functions.TestRelationalOperations
     [echo] Tests run: 5, Failures: 0, Aborted: 0, Skipped: 0, Time elapsed: 0.001999 sec
     [echo] Ran org.apache.poi.ss.formula.functions.TestReptFunctionsFromSpreadsheet
     [echo] Tests run: 5, Failures: 0, Aborted: 0, Skipped: 0, Time elapsed: 0.009008 sec
     [echo] Ran org.apache.poi.ss.formula.functions.TestRomanFunctionsFromSpreadsheet
     [echo] Tests run: 35, Failures: 0, Aborted: 0, Skipped: 0, Time elapsed: 0.023022 sec
     [echo] Ran org.apache.poi.ss.formula.functions.TestRoundFuncs
     [echo] Tests run: 5, Failures: 0, Aborted: 0, Skipped: 1, Time elapsed: 0.001000 sec
     [echo] Ran org.apache.poi.ss.formula.functions.TestRowCol
     [echo] Tests run: 4, Failures: 0, Aborted: 0, Skipped: 0, Time elapsed: 0.002002 sec
     [echo] Ran org.apache.poi.ss.formula.functions.TestSlope
     [echo] Tests run: 3, Failures: 0, Aborted: 0, Skipped: 0, Time elapsed: 0.001001 sec
     [echo] Ran org.apache.poi.ss.formula.functions.TestStatsLib
     [echo] Tests run: 8, Failures: 0, Aborted: 0, Skipped: 0, Time elapsed: 0.003005 sec
     [echo] Ran org.apache.poi.ss.formula.functions.TestSubstitute
     [echo] Tests run: 5, Failures: 0, Aborted: 0, Skipped: 0, Time elapsed: 0.001001 sec
     [echo] Ran org.apache.poi.ss.formula.functions.TestSubtotal
     [echo] Tests run: 11, Failures: 0, Aborted: 0, Skipped: 0, Time elapsed: 0.011013 sec
     [echo] Ran org.apache.poi.ss.formula.functions.TestSumif
     [echo] Tests run: 3, Failures: 0, Aborted: 0, Skipped: 0, Time elapsed: 0.002001 sec
     [echo] Ran org.apache.poi.ss.formula.functions.TestSumifs
     [echo] Tests run: 7, Failures: 0, Aborted: 0, Skipped: 0, Time elapsed: 0.005005 sec
     [echo] Ran org.apache.poi.ss.formula.functions.TestSumproduct
     [echo] Tests run: 5, Failures: 0, Aborted: 0, Skipped: 0, Time elapsed: 0.002002 sec
     [echo] Ran org.apache.poi.ss.formula.functions.TestTFunc
     [echo] Tests run: 5, Failures: 0, Aborted: 0, Skipped: 0, Time elapsed: 0.001002 sec
     [echo] Ran org.apache.poi.ss.formula.functions.TestText
     [echo] Tests run: 4, Failures: 0, Aborted: 0, Skipped: 0, Time elapsed: 0.003003 sec
     [echo] Ran org.apache.poi.ss.formula.functions.TestTime
     [echo] Tests run: 2, Failures: 0, Aborted: 0, Skipped: 0, Time elapsed: 0.004004 sec
     [echo] Ran org.apache.poi.ss.formula.functions.TestTrendFunctionsFromSpreadsheet
     [echo] Tests run: 41, Failures: 0, Aborted: 0, Skipped: 0, Time elapsed: 0.057055 sec
     [echo] Ran org.apache.poi.ss.formula.functions.TestTrim
     [echo] Tests run: 3, Failures: 0, Aborted: 0, Skipped: 0, Time elapsed: 0.001001 sec
     [echo] Ran org.apache.poi.ss.formula.functions.TestTrunc
     [echo] Tests run: 7, Failures: 0, Aborted: 0, Skipped: 0, Time elapsed: 0.002004 sec
     [echo] Ran org.apache.poi.ss.formula.functions.TestTwoOperandNumericFunctionsFromSpreadsheet
     [echo] Tests run: 34, Failures: 0, Aborted: 0, Skipped: 0, Time elapsed: 0.022022 sec
     [echo] Ran org.apache.poi.ss.formula.functions.TestValue
     [echo] Tests run: 2, Failures: 0, Aborted: 0, Skipped: 0, Time elapsed: 0.001000 sec
     [echo] Ran org.apache.poi.ss.formula.functions.TestWeekNumFunctionsFromSpreadsheet
     [echo] Tests run: 7, Failures: 0, Aborted: 0, Skipped: 0, Time elapsed: 0.006004 sec
     [echo] Ran org.apache.poi.ss.formula.functions.TestWeekNumFunctionsFromSpreadsheet2013
     [echo] Tests run: 7, Failures: 0, Aborted: 0, Skipped: 0, Time elapsed: 0.006006 sec
     [echo] Ran org.apache.poi.ss.formula.functions.TestWeekdayFunc
     [echo] Tests run: 2, Failures: 0, Aborted: 0, Skipped: 0, Time elapsed: 0.002005 sec
     [echo] Ran org.apache.poi.ss.formula.functions.TestXYNumericFunction
     [echo] Tests run: 3, Failures: 0, Aborted: 0, Skipped: 0, Time elapsed: 0.002005 sec
     [echo] Ran org.apache.poi.ss.formula.ptg.TestAbstractFunctionPtg
     [echo] Tests run: 3, Failures: 0, Aborted: 0, Skipped: 0, Time elapsed: 0.002002 sec
     [echo] Ran org.apache.poi.ss.formula.ptg.TestArea3DPtg
     [echo] Tests run: 1, Failures: 0, Aborted: 0, Skipped: 0, Time elapsed: 0.001002 sec
     [echo] Ran org.apache.poi.ss.formula.ptg.TestAreaErrPtg
     [echo] Tests run: 1, Failures: 0, Aborted: 0, Skipped: 0, Time elapsed: 0.001001 sec
     [echo] Ran org.apache.poi.ss.formula.ptg.TestAreaPtg
     [echo] Tests run: 5, Failures: 0, Aborted: 0, Skipped: 0, Time elapsed: 0.001002 sec
     [echo] Ran org.apache.poi.ss.formula.ptg.TestArrayPtg
     [echo] Tests run: 5, Failures: 0, Aborted: 0, Skipped: 0, Time elapsed: 0.001000 sec
     [echo] Ran org.apache.poi.ss.formula.ptg.TestAttrPtg
     [echo] Tests run: 1, Failures: 0, Aborted: 0, Skipped: 0, Time elapsed: 0.000000 sec
     [echo] Ran org.apache.poi.ss.formula.ptg.TestErrPtg
     [echo] Tests run: 1, Failures: 0, Aborted: 0, Skipped: 0, Time elapsed: 0.002002 sec
     [echo] Ran org.apache.poi.ss.formula.ptg.TestExternalFunctionFormulas
     [echo] Tests run: 3, Failures: 0, Aborted: 0, Skipped: 0, Time elapsed: 0.005003 sec
     [echo] Ran org.apache.poi.ss.formula.ptg.TestExternalNameReference
     [echo] Tests run: 3, Failures: 0, Aborted: 0, Skipped: 0, Time elapsed: 0.005005 sec
     [echo] Ran org.apache.poi.ss.formula.ptg.TestFuncPtg
     [echo] Tests run: 2, Failures: 0, Aborted: 0, Skipped: 0, Time elapsed: 0.001001 sec
     [echo] Ran org.apache.poi.ss.formula.ptg.TestFuncVarPtg
     [echo] Tests run: 1, Failures: 0, Aborted: 0, Skipped: 0, Time elapsed: 0.000000 sec
     [echo] Ran org.apache.poi.ss.formula.ptg.TestIntersectionPtg
     [echo] Tests run: 1, Failures: 0, Aborted: 0, Skipped: 0, Time elapsed: 0.001001 sec
     [echo] Ran org.apache.poi.ss.formula.ptg.TestPercentPtg
     [echo] Tests run: 1, Failures: 0, Aborted: 0, Skipped: 0, Time elapsed: 0.001003 sec
     [echo] Ran org.apache.poi.ss.formula.ptg.TestRangePtg
     [echo] Tests run: 1, Failures: 0, Aborted: 0, Skipped: 0, Time elapsed: 0.001001 sec
     [echo] Ran org.apache.poi.ss.formula.ptg.TestRef3DPtg
     [echo] Tests run: 1, Failures: 0, Aborted: 0, Skipped: 0, Time elapsed: 0.001001 sec
     [echo] Ran org.apache.poi.ss.formula.ptg.TestReferencePtg
     [echo] Tests run: 4, Failures: 0, Aborted: 0, Skipped: 0, Time elapsed: 0.007007 sec
     [echo] Ran org.apache.poi.ss.formula.ptg.TestUnionPtg
     [echo] Tests run: 1, Failures: 0, Aborted: 0, Skipped: 0, Time elapsed: 0.002002 sec
     [echo] Ran org.apache.poi.ss.formula.udf.TestAggregatingUDFFinder
     [echo] Tests run: 2, Failures: 0, Aborted: 0, Skipped: 0, Time elapsed: 0.001001 sec
     [echo] Ran org.apache.poi.ss.formula.udf.TestDefaultUDFFinder
     [echo] Tests run: 1, Failures: 0, Aborted: 0, Skipped: 0, Time elapsed: 0.001003 sec
     [echo] Ran org.apache.poi.ss.usermodel.TestDataFormatter
     [echo] Tests run: 37, Failures: 0, Aborted: 0, Skipped: 1, Time elapsed: 0.433413 sec
     [echo] Ran org.apache.poi.ss.usermodel.TestDateUtil
     [echo] Tests run: 26, Failures: 0, Aborted: 0, Skipped: 0, Time elapsed: 0.019018 sec
     [echo] Ran org.apache.poi.ss.usermodel.TestExcelStyleDateFormatter
     [echo] Tests run: 123, Failures: 0, Aborted: 0, Skipped: 0, Time elapsed: 0.077074 sec
     [echo] Ran org.apache.poi.ss.usermodel.TestFractionFormat
     [echo] Tests run: 5, Failures: 0, Aborted: 0, Skipped: 1, Time elapsed: 0.298285 sec
     [echo] Ran org.apache.poi.ss.usermodel.TestHSSFBorderStyle
     [echo] Tests run: 1, Failures: 0, Aborted: 0, Skipped: 0, Time elapsed: 0.002002 sec
     [echo] Ran org.apache.poi.ss.usermodel.TestIndexedColors
     [echo] Tests run: 3, Failures: 0, Aborted: 0, Skipped: 0, Time elapsed: 0.002002 sec
     [echo] Ran org.apache.poi.ss.util.TestAreaReference
     [echo] Tests run: 3, Failures: 0, Aborted: 0, Skipped: 0, Time elapsed: 0.001000 sec
     [echo] Ran org.apache.poi.ss.util.TestCellAddress
     [echo] Tests run: 6, Failures: 0, Aborted: 0, Skipped: 0, Time elapsed: 0.001001 sec
     [echo] Ran org.apache.poi.ss.util.TestCellRangeAddress
     [echo] Tests run: 14, Failures: 0, Aborted: 0, Skipped: 0, Time elapsed: 0.005005 sec
     [echo] Ran org.apache.poi.ss.util.TestCellRangeUtil
     [echo] Tests run: 1, Failures: 0, Aborted: 0, Skipped: 0, Time elapsed: 0.001000 sec
     [echo] Ran org.apache.poi.ss.util.TestCellReference
     [echo] Tests run: 27, Failures: 0, Aborted: 0, Skipped: 0, Time elapsed: 0.234222 sec
     [echo] Ran org.apache.poi.ss.util.TestDateFormatConverter
     [echo] Tests run: 18, Failures: 0, Aborted: 0, Skipped: 0, Time elapsed: 4.234045 sec
     [echo] Ran org.apache.poi.ss.util.TestDateParser
     [echo] Tests run: 5, Failures: 0, Aborted: 0, Skipped: 0, Time elapsed: 0.006005 sec
     [echo] Ran org.apache.poi.ss.util.TestExpandedDouble
     [echo] Tests run: 18, Failures: 0, Aborted: 0, Skipped: 0, Time elapsed: 0.011010 sec
     [echo] Ran org.apache.poi.ss.util.TestHSSFCellUtil
     [echo] Tests run: 14, Failures: 0, Aborted: 0, Skipped: 0, Time elapsed: 0.014014 sec
     [echo] Ran org.apache.poi.ss.util.TestNumberComparer
     [echo] Tests run: 115, Failures: 0, Aborted: 0, Skipped: 0, Time elapsed: 0.090085 sec
     [echo] Ran org.apache.poi.ss.util.TestNumberToTextConverter
     [echo] Tests run: 2, Failures: 0, Aborted: 0, Skipped: 0, Time elapsed: 0.011010 sec
     [echo] Ran org.apache.poi.ss.util.TestPropertyTemplate
     [echo] Tests run: 8, Failures: 0, Aborted: 0, Skipped: 0, Time elapsed: 0.030030 sec
     [echo] Ran org.apache.poi.ss.util.TestRegionUtil
     [echo] Tests run: 10, Failures: 0, Aborted: 0, Skipped: 0, Time elapsed: 0.012012 sec
     [echo] Ran org.apache.poi.ss.util.TestSheetBuilder
     [echo] Tests run: 3, Failures: 0, Aborted: 0, Skipped: 0, Time elapsed: 0.003003 sec
     [echo] Ran org.apache.poi.ss.util.TestSheetUtil
     [echo] Tests run: 7, Failures: 0, Aborted: 0, Skipped: 0, Time elapsed: 0.004004 sec
     [echo] Ran org.apache.poi.ss.util.TestWorkbookUtil
     [echo] Tests run: 1, Failures: 0, Aborted: 0, Skipped: 0, Time elapsed: 0.001001 sec
     [echo] Ran org.apache.poi.ss.util.cellwalk.TestCellWalk
     [echo] Tests run: 1, Failures: 0, Aborted: 0, Skipped: 0, Time elapsed: 0.003003 sec
     [echo] Ran org.apache.poi.util.TestArrayUtil
     [echo] Tests run: 1, Failures: 0, Aborted: 0, Skipped: 0, Time elapsed: 0.002001 sec
     [echo] Ran org.apache.poi.util.TestBitField
     [echo] Tests run: 16, Failures: 0, Aborted: 0, Skipped: 0, Time elapsed: 0.002001 sec
     [echo] Ran org.apache.poi.util.TestByteField
     [echo] Tests run: 5, Failures: 0, Aborted: 0, Skipped: 0, Time elapsed: 0.002002 sec
     [echo] Ran org.apache.poi.util.TestHexDump
     [echo] Tests run: 8, Failures: 0, Aborted: 0, Skipped: 0, Time elapsed: 0.006006 sec
     [echo] Ran org.apache.poi.util.TestIOUtils
     [echo] Tests run: 36, Failures: 0, Aborted: 0, Skipped: 0, Time elapsed: 0.058058 sec
     [echo] Ran org.apache.poi.util.TestIntList
     [echo] Tests run: 19, Failures: 0, Aborted: 0, Skipped: 0, Time elapsed: 0.047045 sec
     [echo] Ran org.apache.poi.util.TestIntegerField
     [echo] Tests run: 5, Failures: 0, Aborted: 0, Skipped: 0, Time elapsed: 0.003002 sec
     [echo] Ran org.apache.poi.util.TestLittleEndian
     [echo] Tests run: 15, Failures: 0, Aborted: 0, Skipped: 0, Time elapsed: 0.003003 sec
     [echo] Ran org.apache.poi.util.TestLittleEndianStreams
     [echo] Tests run: 5, Failures: 0, Aborted: 0, Skipped: 0, Time elapsed: 0.002001 sec
     [echo] Ran org.apache.poi.util.TestLocaleUtil
     [echo] Tests run: 3, Failures: 0, Aborted: 0, Skipped: 0, Time elapsed: 0.001003 sec
     [echo] Ran org.apache.poi.util.TestLongField
     [echo] Tests run: 5, Failures: 0, Aborted: 0, Skipped: 0, Time elapsed: 0.001001 sec
     [echo] Ran org.apache.poi.util.TestPOILogger
     [echo] Tests run: 1, Failures: 0, Aborted: 0, Skipped: 0, Time elapsed: 0.000000 sec
     [echo] Ran org.apache.poi.util.TestRLEDecompressingInputStream
     [echo] Tests run: 4, Failures: 0, Aborted: 0, Skipped: 0, Time elapsed: 0.001001 sec
     [echo] Ran org.apache.poi.util.TestShortField
     [echo] Tests run: 5, Failures: 0, Aborted: 0, Skipped: 0, Time elapsed: 0.002002 sec
     [echo] Ran org.apache.poi.util.TestStringCodepointsIterable
     [echo] Tests run: 1, Failures: 0, Aborted: 0, Skipped: 0, Time elapsed: 0.001000 sec
     [echo] Ran org.apache.poi.util.TestStringUtil
     [echo] Tests run: 7, Failures: 0, Aborted: 0, Skipped: 0, Time elapsed: 0.003003 sec
     [echo] Ran org.apache.poi.util.TestTempFile
     [echo] Tests run: 4, Failures: 0, Aborted: 0, Skipped: 0, Time elapsed: 0.010008 sec
     [echo] Ran org.apache.poi.util.TestXMLHelper
     [echo] Tests run: 8, Failures: 0, Aborted: 0, Skipped: 0, Time elapsed: 0.330313 sec

-test-excelant-write-testfile:

test:

compile-integration:
    [javac] Compiling 28 source files to <https://ci-builds.apache.org/job/POI/job/POI-DSL-Windows-1.14/ws/build\integration-test-classes>
    [javac] Ignoring source, target and bootclasspath as release has been set
    [mkdir] Created dir: <https://ci-builds.apache.org/job/POI/job/POI-DSL-Windows-1.14/ws/build\integration-test-classes\META-INF\versions\9>
    [javac] Compiling 1 source file to <https://ci-builds.apache.org/job/POI/job/POI-DSL-Windows-1.14/ws/build\integration-test-classes\META-INF\versions\9>
      [jar] Building jar: <https://ci-builds.apache.org/job/POI/job/POI-DSL-Windows-1.14/ws/build\dist\maven\poi-integration\poi-integration-5.0.1.jar>

-test-integration-check:

test-integration:

BUILD FAILED
<https://ci-builds.apache.org/job/POI/job/POI-DSL-Windows-1.14/ws/build.xml>:1709: The following error occurred while executing this line:
<https://ci-builds.apache.org/job/POI/job/POI-DSL-Windows-1.14/ws/build.xml>:1256: Some test(s) have failure(s)

Total time: 22 minutes 48 seconds
Build step 'Invoke Ant' marked build as failure
[SpotBugs] Skipping execution of recorder since overall result is 'FAILURE'
Archiving artifacts
[Fast Archiver] Compressed 8.66 MB of artifacts by 35.0% relative to #27
[WARNINGS] Skipping publisher since build result is FAILURE
Recording test results

---------------------------------------------------------------------
To unsubscribe, e-mail: [hidden email]
For additional commands, e-mail: [hidden email]

Reply | Threaded
Open this post in threaded view
|

Build failed in Jenkins: POI » POI-DSL-Windows-1.14 #31

Apache Jenkins Server
See <https://ci-builds.apache.org/job/POI/job/POI-DSL-Windows-1.14/31/display/redirect>

Changes:


------------------------------------------
[...truncated 115.19 KB...]
                        at sun.nio.fs.WindowsFileSystemProvider.implDelete(Unknown Source)
                        at sun.nio.fs.AbstractFileSystemProvider.deleteIfExists(Unknown Source)
                        at java.nio.file.Files.deleteIfExists(Unknown Source)
                        at jenkins.util.io.PathRemover.removeOrMakeRemovableThenRemove(PathRemover.java:237)
        Also:   java.nio.file.FileSystemException: <https://ci-builds.apache.org/job/POI/job/POI-DSL-Windows-1.14/ws/.svn\svn.e486ca95-5a81-495c-900c-83b55cb2b3e8.tmp>: The process cannot access the file because it is being used by another process.

                        at sun.nio.fs.WindowsException.translateToIOException(Unknown Source)
                        at sun.nio.fs.WindowsException.rethrowAsIOException(Unknown Source)
                        at sun.nio.fs.WindowsException.rethrowAsIOException(Unknown Source)
                        at sun.nio.fs.WindowsFileSystemProvider.implDelete(Unknown Source)
                        at sun.nio.fs.AbstractFileSystemProvider.deleteIfExists(Unknown Source)
                        at java.nio.file.Files.deleteIfExists(Unknown Source)
                        at jenkins.util.io.PathRemover.removeOrMakeRemovableThenRemove(PathRemover.java:241)
jenkins.util.io.CompositeIOException: Unable to remove file <https://ci-builds.apache.org/job/POI/job/POI-DSL-Windows-1.14/ws/.svn\svn.e486ca95-5a81-495c-900c-83b55cb2b3e8.tmp>
                at jenkins.util.io.PathRemover.removeOrMakeRemovableThenRemove(PathRemover.java:252)
                at jenkins.util.io.PathRemover.tryRemoveFile(PathRemover.java:205)
                at jenkins.util.io.PathRemover.tryRemoveRecursive(PathRemover.java:216)
                at jenkins.util.io.PathRemover.tryRemoveDirectoryContents(PathRemover.java:226)
                at jenkins.util.io.PathRemover.tryRemoveRecursive(PathRemover.java:215)
                at jenkins.util.io.PathRemover.tryRemoveDirectoryContents(PathRemover.java:226)
                at jenkins.util.io.PathRemover.forceRemoveDirectoryContents(PathRemover.java:87)
Also:   Also:   java.nio.file.DirectoryNotEmptyException: <https://ci-builds.apache.org/job/POI/job/POI-DSL-Windows-1.14/ws/.svn>
                        at sun.nio.fs.WindowsFileSystemProvider.implDelete(Unknown Source)
                        at sun.nio.fs.AbstractFileSystemProvider.deleteIfExists(Unknown Source)
                        at java.nio.file.Files.deleteIfExists(Unknown Source)
                        at jenkins.util.io.PathRemover.removeOrMakeRemovableThenRemove(PathRemover.java:237)
        Also:   java.nio.file.DirectoryNotEmptyException: <https://ci-builds.apache.org/job/POI/job/POI-DSL-Windows-1.14/ws/.svn>
                        at sun.nio.fs.WindowsFileSystemProvider.implDelete(Unknown Source)
                        at sun.nio.fs.AbstractFileSystemProvider.deleteIfExists(Unknown Source)
                        at java.nio.file.Files.deleteIfExists(Unknown Source)
                        at jenkins.util.io.PathRemover.removeOrMakeRemovableThenRemove(PathRemover.java:241)
jenkins.util.io.CompositeIOException: Unable to remove directory <https://ci-builds.apache.org/job/POI/job/POI-DSL-Windows-1.14/ws/.svn> with directory contents: [<https://ci-builds.apache.org/job/POI/job/POI-DSL-Windows-1.14/ws/.svn\svn.e486ca95-5a81-495c-900c-83b55cb2b3e8.tmp]>
                at jenkins.util.io.PathRemover.removeOrMakeRemovableThenRemove(PathRemover.java:250)
                at jenkins.util.io.PathRemover.tryRemoveFile(PathRemover.java:205)
                at jenkins.util.io.PathRemover.tryRemoveRecursive(PathRemover.java:216)
                at jenkins.util.io.PathRemover.tryRemoveDirectoryContents(PathRemover.java:226)
                at jenkins.util.io.PathRemover.forceRemoveDirectoryContents(PathRemover.java:87)
Also:   hudson.remoting.Channel$CallSiteStackTrace: Remote call to JNLP4-connect connection from jenkins-win-he-de-2.apache.org/144.76.15.28:57998
                at hudson.remoting.Channel.attachCallSiteStackTrace(Channel.java:1788)
                at hudson.remoting.UserRequest$ExceptionResponse.retrieve(UserRequest.java:356)
                at hudson.remoting.Channel.call(Channel.java:998)
                at hudson.FilePath.act(FilePath.java:1069)
                at hudson.FilePath.act(FilePath.java:1058)
                at hudson.scm.SubversionSCM.checkout(SubversionSCM.java:927)
                at hudson.scm.SubversionSCM.checkout(SubversionSCM.java:857)
                at hudson.scm.SCM.checkout(SCM.java:505)
                at hudson.model.AbstractProject.checkout(AbstractProject.java:1206)
                at hudson.model.AbstractBuild$AbstractBuildExecution.defaultCheckout(AbstractBuild.java:574)
                at jenkins.scm.SCMCheckoutStrategy.checkout(SCMCheckoutStrategy.java:86)
                at hudson.model.AbstractBuild$AbstractBuildExecution.run(AbstractBuild.java:499)
                at hudson.model.Run.execute(Run.java:1880)
                at hudson.model.FreeStyleBuild.run(FreeStyleBuild.java:43)
                at hudson.model.ResourceController.execute(ResourceController.java:97)
                at hudson.model.Executor.run(Executor.java:428)
jenkins.util.io.CompositeIOException: Unable to delete '<https://ci-builds.apache.org/job/POI/job/POI-DSL-Windows-1.14/ws/.'.> Tried 3 times (of a maximum of 3) waiting 0.1 sec between attempts.
        at jenkins.util.io.PathRemover.forceRemoveDirectoryContents(PathRemover.java:90)
        at hudson.Util.deleteContentsRecursive(Util.java:261)
        at hudson.Util.deleteContentsRecursive(Util.java:250)
        at hudson.scm.subversion.CheckoutUpdater$SubversionUpdateTask.perform(CheckoutUpdater.java:90)
        at hudson.scm.subversion.WorkspaceUpdater$UpdateTask.delegateTo(WorkspaceUpdater.java:168)
        at hudson.scm.subversion.WorkspaceUpdater$UpdateTask.delegateTo(WorkspaceUpdater.java:176)
        at hudson.scm.subversion.UpdateUpdater$TaskImpl.perform(UpdateUpdater.java:185)
        at hudson.scm.subversion.WorkspaceUpdater$UpdateTask.delegateTo(WorkspaceUpdater.java:168)
        at hudson.scm.SubversionSCM$CheckOutTask.perform(SubversionSCM.java:1031)
        at hudson.scm.SubversionSCM$CheckOutTask.invoke(SubversionSCM.java:1007)
        at hudson.scm.SubversionSCM$CheckOutTask.invoke(SubversionSCM.java:980)
        at hudson.FilePath$FileCallableWrapper.call(FilePath.java:3073)
        at hudson.remoting.UserRequest.perform(UserRequest.java:211)
        at hudson.remoting.UserRequest.perform(UserRequest.java:54)
        at hudson.remoting.Request$2.run(Request.java:369)
        at hudson.remoting.InterceptingExecutorService$1.call(InterceptingExecutorService.java:72)
        at java.util.concurrent.FutureTask.run(Unknown Source)
        at java.util.concurrent.ThreadPoolExecutor.runWorker(Unknown Source)
        at java.util.concurrent.ThreadPoolExecutor$Worker.run(Unknown Source)
        at hudson.remoting.Engine$1.lambda$newThread$0(Engine.java:117)
        at java.lang.Thread.run(Unknown Source)
Retrying after 10 seconds
Checking out a fresh workspace because there's no workspace at F:\jenkins\jenkins-slave\712657a4\workspace\POI\POI-DSL-Windows-1.14
Cleaning local Directory .
Also:   Also:   java.nio.file.FileSystemException: <https://ci-builds.apache.org/job/POI/job/POI-DSL-Windows-1.14/ws/.svn\svn.e486ca95-5a81-495c-900c-83b55cb2b3e8.tmp>: The process cannot access the file because it is being used by another process.

                        at sun.nio.fs.WindowsException.translateToIOException(Unknown Source)
                        at sun.nio.fs.WindowsException.rethrowAsIOException(Unknown Source)
                        at sun.nio.fs.WindowsException.rethrowAsIOException(Unknown Source)
                        at sun.nio.fs.WindowsFileSystemProvider.implDelete(Unknown Source)
                        at sun.nio.fs.AbstractFileSystemProvider.deleteIfExists(Unknown Source)
                        at java.nio.file.Files.deleteIfExists(Unknown Source)
                        at jenkins.util.io.PathRemover.removeOrMakeRemovableThenRemove(PathRemover.java:237)
        Also:   java.nio.file.FileSystemException: <https://ci-builds.apache.org/job/POI/job/POI-DSL-Windows-1.14/ws/.svn\svn.e486ca95-5a81-495c-900c-83b55cb2b3e8.tmp>: The process cannot access the file because it is being used by another process.

                        at sun.nio.fs.WindowsException.translateToIOException(Unknown Source)
                        at sun.nio.fs.WindowsException.rethrowAsIOException(Unknown Source)
                        at sun.nio.fs.WindowsException.rethrowAsIOException(Unknown Source)
                        at sun.nio.fs.WindowsFileSystemProvider.implDelete(Unknown Source)
                        at sun.nio.fs.AbstractFileSystemProvider.deleteIfExists(Unknown Source)
                        at java.nio.file.Files.deleteIfExists(Unknown Source)
                        at jenkins.util.io.PathRemover.removeOrMakeRemovableThenRemove(PathRemover.java:241)
jenkins.util.io.CompositeIOException: Unable to remove file <https://ci-builds.apache.org/job/POI/job/POI-DSL-Windows-1.14/ws/.svn\svn.e486ca95-5a81-495c-900c-83b55cb2b3e8.tmp>
                at jenkins.util.io.PathRemover.removeOrMakeRemovableThenRemove(PathRemover.java:252)
                at jenkins.util.io.PathRemover.tryRemoveFile(PathRemover.java:205)
                at jenkins.util.io.PathRemover.tryRemoveRecursive(PathRemover.java:216)
                at jenkins.util.io.PathRemover.tryRemoveDirectoryContents(PathRemover.java:226)
                at jenkins.util.io.PathRemover.tryRemoveRecursive(PathRemover.java:215)
                at jenkins.util.io.PathRemover.tryRemoveDirectoryContents(PathRemover.java:226)
                at jenkins.util.io.PathRemover.forceRemoveDirectoryContents(PathRemover.java:87)
Also:   Also:   java.nio.file.DirectoryNotEmptyException: <https://ci-builds.apache.org/job/POI/job/POI-DSL-Windows-1.14/ws/.svn>
                        at sun.nio.fs.WindowsFileSystemProvider.implDelete(Unknown Source)
                        at sun.nio.fs.AbstractFileSystemProvider.deleteIfExists(Unknown Source)
                        at java.nio.file.Files.deleteIfExists(Unknown Source)
                        at jenkins.util.io.PathRemover.removeOrMakeRemovableThenRemove(PathRemover.java:237)
        Also:   java.nio.file.DirectoryNotEmptyException: <https://ci-builds.apache.org/job/POI/job/POI-DSL-Windows-1.14/ws/.svn>
                        at sun.nio.fs.WindowsFileSystemProvider.implDelete(Unknown Source)
                        at sun.nio.fs.AbstractFileSystemProvider.deleteIfExists(Unknown Source)
                        at java.nio.file.Files.deleteIfExists(Unknown Source)
                        at jenkins.util.io.PathRemover.removeOrMakeRemovableThenRemove(PathRemover.java:241)
jenkins.util.io.CompositeIOException: Unable to remove directory <https://ci-builds.apache.org/job/POI/job/POI-DSL-Windows-1.14/ws/.svn> with directory contents: [<https://ci-builds.apache.org/job/POI/job/POI-DSL-Windows-1.14/ws/.svn\svn.e486ca95-5a81-495c-900c-83b55cb2b3e8.tmp]>
                at jenkins.util.io.PathRemover.removeOrMakeRemovableThenRemove(PathRemover.java:250)
                at jenkins.util.io.PathRemover.tryRemoveFile(PathRemover.java:205)
                at jenkins.util.io.PathRemover.tryRemoveRecursive(PathRemover.java:216)
                at jenkins.util.io.PathRemover.tryRemoveDirectoryContents(PathRemover.java:226)
                at jenkins.util.io.PathRemover.forceRemoveDirectoryContents(PathRemover.java:87)
Also:   hudson.remoting.Channel$CallSiteStackTrace: Remote call to JNLP4-connect connection from jenkins-win-he-de-2.apache.org/144.76.15.28:57998
                at hudson.remoting.Channel.attachCallSiteStackTrace(Channel.java:1788)
                at hudson.remoting.UserRequest$ExceptionResponse.retrieve(UserRequest.java:356)
                at hudson.remoting.Channel.call(Channel.java:998)
                at hudson.FilePath.act(FilePath.java:1069)
                at hudson.FilePath.act(FilePath.java:1058)
                at hudson.scm.SubversionSCM.checkout(SubversionSCM.java:927)
                at hudson.scm.SubversionSCM.checkout(SubversionSCM.java:857)
                at hudson.scm.SCM.checkout(SCM.java:505)
                at hudson.model.AbstractProject.checkout(AbstractProject.java:1206)
                at hudson.model.AbstractBuild$AbstractBuildExecution.defaultCheckout(AbstractBuild.java:574)
                at jenkins.scm.SCMCheckoutStrategy.checkout(SCMCheckoutStrategy.java:86)
                at hudson.model.AbstractBuild$AbstractBuildExecution.run(AbstractBuild.java:499)
                at hudson.model.Run.execute(Run.java:1880)
                at hudson.model.FreeStyleBuild.run(FreeStyleBuild.java:43)
                at hudson.model.ResourceController.execute(ResourceController.java:97)
                at hudson.model.Executor.run(Executor.java:428)
jenkins.util.io.CompositeIOException: Unable to delete '<https://ci-builds.apache.org/job/POI/job/POI-DSL-Windows-1.14/ws/.'.> Tried 3 times (of a maximum of 3) waiting 0.1 sec between attempts.
        at jenkins.util.io.PathRemover.forceRemoveDirectoryContents(PathRemover.java:90)
        at hudson.Util.deleteContentsRecursive(Util.java:261)
        at hudson.Util.deleteContentsRecursive(Util.java:250)
        at hudson.scm.subversion.CheckoutUpdater$SubversionUpdateTask.perform(CheckoutUpdater.java:90)
        at hudson.scm.subversion.WorkspaceUpdater$UpdateTask.delegateTo(WorkspaceUpdater.java:168)
        at hudson.scm.subversion.WorkspaceUpdater$UpdateTask.delegateTo(WorkspaceUpdater.java:176)
        at hudson.scm.subversion.UpdateUpdater$TaskImpl.perform(UpdateUpdater.java:132)
        at hudson.scm.subversion.WorkspaceUpdater$UpdateTask.delegateTo(WorkspaceUpdater.java:168)
        at hudson.scm.SubversionSCM$CheckOutTask.perform(SubversionSCM.java:1031)
        at hudson.scm.SubversionSCM$CheckOutTask.invoke(SubversionSCM.java:1007)
        at hudson.scm.SubversionSCM$CheckOutTask.invoke(SubversionSCM.java:980)
        at hudson.FilePath$FileCallableWrapper.call(FilePath.java:3073)
        at hudson.remoting.UserRequest.perform(UserRequest.java:211)
        at hudson.remoting.UserRequest.perform(UserRequest.java:54)
        at hudson.remoting.Request$2.run(Request.java:369)
        at hudson.remoting.InterceptingExecutorService$1.call(InterceptingExecutorService.java:72)
        at java.util.concurrent.FutureTask.run(Unknown Source)
        at java.util.concurrent.ThreadPoolExecutor.runWorker(Unknown Source)
        at java.util.concurrent.ThreadPoolExecutor$Worker.run(Unknown Source)
        at hudson.remoting.Engine$1.lambda$newThread$0(Engine.java:117)
        at java.lang.Thread.run(Unknown Source)
Retrying after 10 seconds
Checking out a fresh workspace because there's no workspace at F:\jenkins\jenkins-slave\712657a4\workspace\POI\POI-DSL-Windows-1.14
Cleaning local Directory .
Also:   Also:   java.nio.file.FileSystemException: <https://ci-builds.apache.org/job/POI/job/POI-DSL-Windows-1.14/ws/.svn\svn.e486ca95-5a81-495c-900c-83b55cb2b3e8.tmp>: The process cannot access the file because it is being used by another process.

                        at sun.nio.fs.WindowsException.translateToIOException(Unknown Source)
                        at sun.nio.fs.WindowsException.rethrowAsIOException(Unknown Source)
                        at sun.nio.fs.WindowsException.rethrowAsIOException(Unknown Source)
                        at sun.nio.fs.WindowsFileSystemProvider.implDelete(Unknown Source)
                        at sun.nio.fs.AbstractFileSystemProvider.deleteIfExists(Unknown Source)
                        at java.nio.file.Files.deleteIfExists(Unknown Source)
                        at jenkins.util.io.PathRemover.removeOrMakeRemovableThenRemove(PathRemover.java:237)
        Also:   java.nio.file.FileSystemException: <https://ci-builds.apache.org/job/POI/job/POI-DSL-Windows-1.14/ws/.svn\svn.e486ca95-5a81-495c-900c-83b55cb2b3e8.tmp>: The process cannot access the file because it is being used by another process.

                        at sun.nio.fs.WindowsException.translateToIOException(Unknown Source)
                        at sun.nio.fs.WindowsException.rethrowAsIOException(Unknown Source)
                        at sun.nio.fs.WindowsException.rethrowAsIOException(Unknown Source)
                        at sun.nio.fs.WindowsFileSystemProvider.implDelete(Unknown Source)
                        at sun.nio.fs.AbstractFileSystemProvider.deleteIfExists(Unknown Source)
                        at java.nio.file.Files.deleteIfExists(Unknown Source)
                        at jenkins.util.io.PathRemover.removeOrMakeRemovableThenRemove(PathRemover.java:241)
jenkins.util.io.CompositeIOException: Unable to remove file <https://ci-builds.apache.org/job/POI/job/POI-DSL-Windows-1.14/ws/.svn\svn.e486ca95-5a81-495c-900c-83b55cb2b3e8.tmp>
                at jenkins.util.io.PathRemover.removeOrMakeRemovableThenRemove(PathRemover.java:252)
                at jenkins.util.io.PathRemover.tryRemoveFile(PathRemover.java:205)
                at jenkins.util.io.PathRemover.tryRemoveRecursive(PathRemover.java:216)
                at jenkins.util.io.PathRemover.tryRemoveDirectoryContents(PathRemover.java:226)
                at jenkins.util.io.PathRemover.tryRemoveRecursive(PathRemover.java:215)
                at jenkins.util.io.PathRemover.tryRemoveDirectoryContents(PathRemover.java:226)
                at jenkins.util.io.PathRemover.forceRemoveDirectoryContents(PathRemover.java:87)
Also:   Also:   java.nio.file.DirectoryNotEmptyException: <https://ci-builds.apache.org/job/POI/job/POI-DSL-Windows-1.14/ws/.svn>
                        at sun.nio.fs.WindowsFileSystemProvider.implDelete(Unknown Source)
                        at sun.nio.fs.AbstractFileSystemProvider.deleteIfExists(Unknown Source)
                        at java.nio.file.Files.deleteIfExists(Unknown Source)
                        at jenkins.util.io.PathRemover.removeOrMakeRemovableThenRemove(PathRemover.java:237)
        Also:   java.nio.file.DirectoryNotEmptyException: <https://ci-builds.apache.org/job/POI/job/POI-DSL-Windows-1.14/ws/.svn>
                        at sun.nio.fs.WindowsFileSystemProvider.implDelete(Unknown Source)
                        at sun.nio.fs.AbstractFileSystemProvider.deleteIfExists(Unknown Source)
                        at java.nio.file.Files.deleteIfExists(Unknown Source)
                        at jenkins.util.io.PathRemover.removeOrMakeRemovableThenRemove(PathRemover.java:241)
jenkins.util.io.CompositeIOException: Unable to remove directory <https://ci-builds.apache.org/job/POI/job/POI-DSL-Windows-1.14/ws/.svn> with directory contents: [<https://ci-builds.apache.org/job/POI/job/POI-DSL-Windows-1.14/ws/.svn\svn.e486ca95-5a81-495c-900c-83b55cb2b3e8.tmp]>
                at jenkins.util.io.PathRemover.removeOrMakeRemovableThenRemove(PathRemover.java:250)
                at jenkins.util.io.PathRemover.tryRemoveFile(PathRemover.java:205)
                at jenkins.util.io.PathRemover.tryRemoveRecursive(PathRemover.java:216)
                at jenkins.util.io.PathRemover.tryRemoveDirectoryContents(PathRemover.java:226)
                at jenkins.util.io.PathRemover.forceRemoveDirectoryContents(PathRemover.java:87)
Also:   hudson.remoting.Channel$CallSiteStackTrace: Remote call to JNLP4-connect connection from jenkins-win-he-de-2.apache.org/144.76.15.28:57998
                at hudson.remoting.Channel.attachCallSiteStackTrace(Channel.java:1788)
                at hudson.remoting.UserRequest$ExceptionResponse.retrieve(UserRequest.java:356)
                at hudson.remoting.Channel.call(Channel.java:998)
                at hudson.FilePath.act(FilePath.java:1069)
                at hudson.FilePath.act(FilePath.java:1058)
                at hudson.scm.SubversionSCM.checkout(SubversionSCM.java:927)
                at hudson.scm.SubversionSCM.checkout(SubversionSCM.java:857)
                at hudson.scm.SCM.checkout(SCM.java:505)
                at hudson.model.AbstractProject.checkout(AbstractProject.java:1206)
                at hudson.model.AbstractBuild$AbstractBuildExecution.defaultCheckout(AbstractBuild.java:574)
                at jenkins.scm.SCMCheckoutStrategy.checkout(SCMCheckoutStrategy.java:86)
                at hudson.model.AbstractBuild$AbstractBuildExecution.run(AbstractBuild.java:499)
                at hudson.model.Run.execute(Run.java:1880)
                at hudson.model.FreeStyleBuild.run(FreeStyleBuild.java:43)
                at hudson.model.ResourceController.execute(ResourceController.java:97)
                at hudson.model.Executor.run(Executor.java:428)
jenkins.util.io.CompositeIOException: Unable to delete '<https://ci-builds.apache.org/job/POI/job/POI-DSL-Windows-1.14/ws/.'.> Tried 3 times (of a maximum of 3) waiting 0.1 sec between attempts.
        at jenkins.util.io.PathRemover.forceRemoveDirectoryContents(PathRemover.java:90)
        at hudson.Util.deleteContentsRecursive(Util.java:261)
        at hudson.Util.deleteContentsRecursive(Util.java:250)
        at hudson.scm.subversion.CheckoutUpdater$SubversionUpdateTask.perform(CheckoutUpdater.java:90)
        at hudson.scm.subversion.WorkspaceUpdater$UpdateTask.delegateTo(WorkspaceUpdater.java:168)
        at hudson.scm.subversion.WorkspaceUpdater$UpdateTask.delegateTo(WorkspaceUpdater.java:176)
        at hudson.scm.subversion.UpdateUpdater$TaskImpl.perform(UpdateUpdater.java:132)
        at hudson.scm.subversion.WorkspaceUpdater$UpdateTask.delegateTo(WorkspaceUpdater.java:168)
        at hudson.scm.SubversionSCM$CheckOutTask.perform(SubversionSCM.java:1031)
        at hudson.scm.SubversionSCM$CheckOutTask.invoke(SubversionSCM.java:1007)
        at hudson.scm.SubversionSCM$CheckOutTask.invoke(SubversionSCM.java:980)
        at hudson.FilePath$FileCallableWrapper.call(FilePath.java:3073)
        at hudson.remoting.UserRequest.perform(UserRequest.java:211)
        at hudson.remoting.UserRequest.perform(UserRequest.java:54)
        at hudson.remoting.Request$2.run(Request.java:369)
        at hudson.remoting.InterceptingExecutorService$1.call(InterceptingExecutorService.java:72)
        at java.util.concurrent.FutureTask.run(Unknown Source)
        at java.util.concurrent.ThreadPoolExecutor.runWorker(Unknown Source)
        at java.util.concurrent.ThreadPoolExecutor$Worker.run(Unknown Source)
        at hudson.remoting.Engine$1.lambda$newThread$0(Engine.java:117)
        at java.lang.Thread.run(Unknown Source)
[SpotBugs] Skipping execution of recorder since overall result is 'FAILURE'
Archiving artifacts
[WARNINGS] Skipping publisher since build result is FAILURE
Recording test results
ERROR: Step ‘Publish JUnit test result report’ failed: No test report files were found. Configuration error?

---------------------------------------------------------------------
To unsubscribe, e-mail: [hidden email]
For additional commands, e-mail: [hidden email]

Reply | Threaded
Open this post in threaded view
|

Build failed in Jenkins: POI » POI-DSL-Windows-1.14 #32

Apache Jenkins Server
See <https://ci-builds.apache.org/job/POI/job/POI-DSL-Windows-1.14/32/display/redirect>

Changes:


------------------------------------------
[...truncated 319.22 KB...]
                        at sun.nio.fs.WindowsFileSystemProvider.implDelete(Unknown Source)
                        at sun.nio.fs.AbstractFileSystemProvider.deleteIfExists(Unknown Source)
                        at java.nio.file.Files.deleteIfExists(Unknown Source)
                        at jenkins.util.io.PathRemover.removeOrMakeRemovableThenRemove(PathRemover.java:237)
        Also:   java.nio.file.FileSystemException: <https://ci-builds.apache.org/job/POI/job/POI-DSL-Windows-1.14/ws/.svn\svn.edf0d1ab-1730-484a-8a31-01ccd57f59cb.tmp>: The process cannot access the file because it is being used by another process.

                        at sun.nio.fs.WindowsException.translateToIOException(Unknown Source)
                        at sun.nio.fs.WindowsException.rethrowAsIOException(Unknown Source)
                        at sun.nio.fs.WindowsException.rethrowAsIOException(Unknown Source)
                        at sun.nio.fs.WindowsFileSystemProvider.implDelete(Unknown Source)
                        at sun.nio.fs.AbstractFileSystemProvider.deleteIfExists(Unknown Source)
                        at java.nio.file.Files.deleteIfExists(Unknown Source)
                        at jenkins.util.io.PathRemover.removeOrMakeRemovableThenRemove(PathRemover.java:241)
jenkins.util.io.CompositeIOException: Unable to remove file <https://ci-builds.apache.org/job/POI/job/POI-DSL-Windows-1.14/ws/.svn\svn.edf0d1ab-1730-484a-8a31-01ccd57f59cb.tmp>
                at jenkins.util.io.PathRemover.removeOrMakeRemovableThenRemove(PathRemover.java:252)
                at jenkins.util.io.PathRemover.tryRemoveFile(PathRemover.java:205)
                at jenkins.util.io.PathRemover.tryRemoveRecursive(PathRemover.java:216)
                at jenkins.util.io.PathRemover.tryRemoveDirectoryContents(PathRemover.java:226)
                at jenkins.util.io.PathRemover.tryRemoveRecursive(PathRemover.java:215)
                at jenkins.util.io.PathRemover.tryRemoveDirectoryContents(PathRemover.java:226)
                at jenkins.util.io.PathRemover.forceRemoveDirectoryContents(PathRemover.java:87)
Also:   Also:   java.nio.file.DirectoryNotEmptyException: <https://ci-builds.apache.org/job/POI/job/POI-DSL-Windows-1.14/ws/.svn>
                        at sun.nio.fs.WindowsFileSystemProvider.implDelete(Unknown Source)
                        at sun.nio.fs.AbstractFileSystemProvider.deleteIfExists(Unknown Source)
                        at java.nio.file.Files.deleteIfExists(Unknown Source)
                        at jenkins.util.io.PathRemover.removeOrMakeRemovableThenRemove(PathRemover.java:237)
        Also:   java.nio.file.DirectoryNotEmptyException: <https://ci-builds.apache.org/job/POI/job/POI-DSL-Windows-1.14/ws/.svn>
                        at sun.nio.fs.WindowsFileSystemProvider.implDelete(Unknown Source)
                        at sun.nio.fs.AbstractFileSystemProvider.deleteIfExists(Unknown Source)
                        at java.nio.file.Files.deleteIfExists(Unknown Source)
                        at jenkins.util.io.PathRemover.removeOrMakeRemovableThenRemove(PathRemover.java:241)
jenkins.util.io.CompositeIOException: Unable to remove directory <https://ci-builds.apache.org/job/POI/job/POI-DSL-Windows-1.14/ws/.svn> with directory contents: [<https://ci-builds.apache.org/job/POI/job/POI-DSL-Windows-1.14/ws/.svn\svn.edf0d1ab-1730-484a-8a31-01ccd57f59cb.tmp]>
                at jenkins.util.io.PathRemover.removeOrMakeRemovableThenRemove(PathRemover.java:250)
                at jenkins.util.io.PathRemover.tryRemoveFile(PathRemover.java:205)
                at jenkins.util.io.PathRemover.tryRemoveRecursive(PathRemover.java:216)
                at jenkins.util.io.PathRemover.tryRemoveDirectoryContents(PathRemover.java:226)
                at jenkins.util.io.PathRemover.forceRemoveDirectoryContents(PathRemover.java:87)
Also:   hudson.remoting.Channel$CallSiteStackTrace: Remote call to JNLP4-connect connection from static.62.73.9.176.clients.your-server.de/176.9.73.62:53252
                at hudson.remoting.Channel.attachCallSiteStackTrace(Channel.java:1788)
                at hudson.remoting.UserRequest$ExceptionResponse.retrieve(UserRequest.java:356)
                at hudson.remoting.Channel.call(Channel.java:998)
                at hudson.FilePath.act(FilePath.java:1069)
                at hudson.FilePath.act(FilePath.java:1058)
                at hudson.scm.SubversionSCM.checkout(SubversionSCM.java:927)
                at hudson.scm.SubversionSCM.checkout(SubversionSCM.java:857)
                at hudson.scm.SCM.checkout(SCM.java:505)
                at hudson.model.AbstractProject.checkout(AbstractProject.java:1206)
                at hudson.model.AbstractBuild$AbstractBuildExecution.defaultCheckout(AbstractBuild.java:574)
                at jenkins.scm.SCMCheckoutStrategy.checkout(SCMCheckoutStrategy.java:86)
                at hudson.model.AbstractBuild$AbstractBuildExecution.run(AbstractBuild.java:499)
                at hudson.model.Run.execute(Run.java:1880)
                at hudson.model.FreeStyleBuild.run(FreeStyleBuild.java:43)
                at hudson.model.ResourceController.execute(ResourceController.java:97)
                at hudson.model.Executor.run(Executor.java:428)
jenkins.util.io.CompositeIOException: Unable to delete '<https://ci-builds.apache.org/job/POI/job/POI-DSL-Windows-1.14/ws/.'.> Tried 3 times (of a maximum of 3) waiting 0.1 sec between attempts.
        at jenkins.util.io.PathRemover.forceRemoveDirectoryContents(PathRemover.java:90)
        at hudson.Util.deleteContentsRecursive(Util.java:261)
        at hudson.Util.deleteContentsRecursive(Util.java:250)
        at hudson.scm.subversion.CheckoutUpdater$SubversionUpdateTask.perform(CheckoutUpdater.java:90)
        at hudson.scm.subversion.WorkspaceUpdater$UpdateTask.delegateTo(WorkspaceUpdater.java:168)
        at hudson.scm.subversion.WorkspaceUpdater$UpdateTask.delegateTo(WorkspaceUpdater.java:176)
        at hudson.scm.subversion.UpdateUpdater$TaskImpl.perform(UpdateUpdater.java:185)
        at hudson.scm.subversion.WorkspaceUpdater$UpdateTask.delegateTo(WorkspaceUpdater.java:168)
        at hudson.scm.SubversionSCM$CheckOutTask.perform(SubversionSCM.java:1031)
        at hudson.scm.SubversionSCM$CheckOutTask.invoke(SubversionSCM.java:1007)
        at hudson.scm.SubversionSCM$CheckOutTask.invoke(SubversionSCM.java:980)
        at hudson.FilePath$FileCallableWrapper.call(FilePath.java:3073)
        at hudson.remoting.UserRequest.perform(UserRequest.java:211)
        at hudson.remoting.UserRequest.perform(UserRequest.java:54)
        at hudson.remoting.Request$2.run(Request.java:369)
        at hudson.remoting.InterceptingExecutorService$1.call(InterceptingExecutorService.java:72)
        at java.util.concurrent.FutureTask.run(Unknown Source)
        at java.util.concurrent.ThreadPoolExecutor.runWorker(Unknown Source)
        at java.util.concurrent.ThreadPoolExecutor$Worker.run(Unknown Source)
        at hudson.remoting.Engine$1.lambda$newThread$0(Engine.java:117)
        at java.lang.Thread.run(Unknown Source)
Retrying after 10 seconds
Checking out a fresh workspace because there's no workspace at F:\jenkins\jenkins-slave\712657a4\workspace\POI\POI-DSL-Windows-1.14
Cleaning local Directory .
Also:   Also:   java.nio.file.FileSystemException: <https://ci-builds.apache.org/job/POI/job/POI-DSL-Windows-1.14/ws/.svn\svn.edf0d1ab-1730-484a-8a31-01ccd57f59cb.tmp>: The process cannot access the file because it is being used by another process.

                        at sun.nio.fs.WindowsException.translateToIOException(Unknown Source)
                        at sun.nio.fs.WindowsException.rethrowAsIOException(Unknown Source)
                        at sun.nio.fs.WindowsException.rethrowAsIOException(Unknown Source)
                        at sun.nio.fs.WindowsFileSystemProvider.implDelete(Unknown Source)
                        at sun.nio.fs.AbstractFileSystemProvider.deleteIfExists(Unknown Source)
                        at java.nio.file.Files.deleteIfExists(Unknown Source)
                        at jenkins.util.io.PathRemover.removeOrMakeRemovableThenRemove(PathRemover.java:237)
        Also:   java.nio.file.FileSystemException: <https://ci-builds.apache.org/job/POI/job/POI-DSL-Windows-1.14/ws/.svn\svn.edf0d1ab-1730-484a-8a31-01ccd57f59cb.tmp>: The process cannot access the file because it is being used by another process.

                        at sun.nio.fs.WindowsException.translateToIOException(Unknown Source)
                        at sun.nio.fs.WindowsException.rethrowAsIOException(Unknown Source)
                        at sun.nio.fs.WindowsException.rethrowAsIOException(Unknown Source)
                        at sun.nio.fs.WindowsFileSystemProvider.implDelete(Unknown Source)
                        at sun.nio.fs.AbstractFileSystemProvider.deleteIfExists(Unknown Source)
                        at java.nio.file.Files.deleteIfExists(Unknown Source)
                        at jenkins.util.io.PathRemover.removeOrMakeRemovableThenRemove(PathRemover.java:241)
jenkins.util.io.CompositeIOException: Unable to remove file <https://ci-builds.apache.org/job/POI/job/POI-DSL-Windows-1.14/ws/.svn\svn.edf0d1ab-1730-484a-8a31-01ccd57f59cb.tmp>
                at jenkins.util.io.PathRemover.removeOrMakeRemovableThenRemove(PathRemover.java:252)
                at jenkins.util.io.PathRemover.tryRemoveFile(PathRemover.java:205)
                at jenkins.util.io.PathRemover.tryRemoveRecursive(PathRemover.java:216)
                at jenkins.util.io.PathRemover.tryRemoveDirectoryContents(PathRemover.java:226)
                at jenkins.util.io.PathRemover.tryRemoveRecursive(PathRemover.java:215)
                at jenkins.util.io.PathRemover.tryRemoveDirectoryContents(PathRemover.java:226)
                at jenkins.util.io.PathRemover.forceRemoveDirectoryContents(PathRemover.java:87)
Also:   Also:   java.nio.file.DirectoryNotEmptyException: <https://ci-builds.apache.org/job/POI/job/POI-DSL-Windows-1.14/ws/.svn>
                        at sun.nio.fs.WindowsFileSystemProvider.implDelete(Unknown Source)
                        at sun.nio.fs.AbstractFileSystemProvider.deleteIfExists(Unknown Source)
                        at java.nio.file.Files.deleteIfExists(Unknown Source)
                        at jenkins.util.io.PathRemover.removeOrMakeRemovableThenRemove(PathRemover.java:237)
        Also:   java.nio.file.DirectoryNotEmptyException: <https://ci-builds.apache.org/job/POI/job/POI-DSL-Windows-1.14/ws/.svn>
                        at sun.nio.fs.WindowsFileSystemProvider.implDelete(Unknown Source)
                        at sun.nio.fs.AbstractFileSystemProvider.deleteIfExists(Unknown Source)
                        at java.nio.file.Files.deleteIfExists(Unknown Source)
                        at jenkins.util.io.PathRemover.removeOrMakeRemovableThenRemove(PathRemover.java:241)
jenkins.util.io.CompositeIOException: Unable to remove directory <https://ci-builds.apache.org/job/POI/job/POI-DSL-Windows-1.14/ws/.svn> with directory contents: [<https://ci-builds.apache.org/job/POI/job/POI-DSL-Windows-1.14/ws/.svn\svn.edf0d1ab-1730-484a-8a31-01ccd57f59cb.tmp]>
                at jenkins.util.io.PathRemover.removeOrMakeRemovableThenRemove(PathRemover.java:250)
                at jenkins.util.io.PathRemover.tryRemoveFile(PathRemover.java:205)
                at jenkins.util.io.PathRemover.tryRemoveRecursive(PathRemover.java:216)
                at jenkins.util.io.PathRemover.tryRemoveDirectoryContents(PathRemover.java:226)
                at jenkins.util.io.PathRemover.forceRemoveDirectoryContents(PathRemover.java:87)
Also:   hudson.remoting.Channel$CallSiteStackTrace: Remote call to JNLP4-connect connection from static.62.73.9.176.clients.your-server.de/176.9.73.62:53252
                at hudson.remoting.Channel.attachCallSiteStackTrace(Channel.java:1788)
                at hudson.remoting.UserRequest$ExceptionResponse.retrieve(UserRequest.java:356)
                at hudson.remoting.Channel.call(Channel.java:998)
                at hudson.FilePath.act(FilePath.java:1069)
                at hudson.FilePath.act(FilePath.java:1058)
                at hudson.scm.SubversionSCM.checkout(SubversionSCM.java:927)
                at hudson.scm.SubversionSCM.checkout(SubversionSCM.java:857)
                at hudson.scm.SCM.checkout(SCM.java:505)
                at hudson.model.AbstractProject.checkout(AbstractProject.java:1206)
                at hudson.model.AbstractBuild$AbstractBuildExecution.defaultCheckout(AbstractBuild.java:574)
                at jenkins.scm.SCMCheckoutStrategy.checkout(SCMCheckoutStrategy.java:86)
                at hudson.model.AbstractBuild$AbstractBuildExecution.run(AbstractBuild.java:499)
                at hudson.model.Run.execute(Run.java:1880)
                at hudson.model.FreeStyleBuild.run(FreeStyleBuild.java:43)
                at hudson.model.ResourceController.execute(ResourceController.java:97)
                at hudson.model.Executor.run(Executor.java:428)
jenkins.util.io.CompositeIOException: Unable to delete '<https://ci-builds.apache.org/job/POI/job/POI-DSL-Windows-1.14/ws/.'.> Tried 3 times (of a maximum of 3) waiting 0.1 sec between attempts.
        at jenkins.util.io.PathRemover.forceRemoveDirectoryContents(PathRemover.java:90)
        at hudson.Util.deleteContentsRecursive(Util.java:261)
        at hudson.Util.deleteContentsRecursive(Util.java:250)
        at hudson.scm.subversion.CheckoutUpdater$SubversionUpdateTask.perform(CheckoutUpdater.java:90)
        at hudson.scm.subversion.WorkspaceUpdater$UpdateTask.delegateTo(WorkspaceUpdater.java:168)
        at hudson.scm.subversion.WorkspaceUpdater$UpdateTask.delegateTo(WorkspaceUpdater.java:176)
        at hudson.scm.subversion.UpdateUpdater$TaskImpl.perform(UpdateUpdater.java:132)
        at hudson.scm.subversion.WorkspaceUpdater$UpdateTask.delegateTo(WorkspaceUpdater.java:168)
        at hudson.scm.SubversionSCM$CheckOutTask.perform(SubversionSCM.java:1031)
        at hudson.scm.SubversionSCM$CheckOutTask.invoke(SubversionSCM.java:1007)
        at hudson.scm.SubversionSCM$CheckOutTask.invoke(SubversionSCM.java:980)
        at hudson.FilePath$FileCallableWrapper.call(FilePath.java:3073)
        at hudson.remoting.UserRequest.perform(UserRequest.java:211)
        at hudson.remoting.UserRequest.perform(UserRequest.java:54)
        at hudson.remoting.Request$2.run(Request.java:369)
        at hudson.remoting.InterceptingExecutorService$1.call(InterceptingExecutorService.java:72)
        at java.util.concurrent.FutureTask.run(Unknown Source)
        at java.util.concurrent.ThreadPoolExecutor.runWorker(Unknown Source)
        at java.util.concurrent.ThreadPoolExecutor$Worker.run(Unknown Source)
        at hudson.remoting.Engine$1.lambda$newThread$0(Engine.java:117)
        at java.lang.Thread.run(Unknown Source)
Retrying after 10 seconds
Checking out a fresh workspace because there's no workspace at F:\jenkins\jenkins-slave\712657a4\workspace\POI\POI-DSL-Windows-1.14
Cleaning local Directory .
Also:   Also:   java.nio.file.FileSystemException: <https://ci-builds.apache.org/job/POI/job/POI-DSL-Windows-1.14/ws/.svn\svn.edf0d1ab-1730-484a-8a31-01ccd57f59cb.tmp>: The process cannot access the file because it is being used by another process.

                        at sun.nio.fs.WindowsException.translateToIOException(Unknown Source)
                        at sun.nio.fs.WindowsException.rethrowAsIOException(Unknown Source)
                        at sun.nio.fs.WindowsException.rethrowAsIOException(Unknown Source)
                        at sun.nio.fs.WindowsFileSystemProvider.implDelete(Unknown Source)
                        at sun.nio.fs.AbstractFileSystemProvider.deleteIfExists(Unknown Source)
                        at java.nio.file.Files.deleteIfExists(Unknown Source)
                        at jenkins.util.io.PathRemover.removeOrMakeRemovableThenRemove(PathRemover.java:237)
        Also:   java.nio.file.FileSystemException: <https://ci-builds.apache.org/job/POI/job/POI-DSL-Windows-1.14/ws/.svn\svn.edf0d1ab-1730-484a-8a31-01ccd57f59cb.tmp>: The process cannot access the file because it is being used by another process.

                        at sun.nio.fs.WindowsException.translateToIOException(Unknown Source)
                        at sun.nio.fs.WindowsException.rethrowAsIOException(Unknown Source)
                        at sun.nio.fs.WindowsException.rethrowAsIOException(Unknown Source)
                        at sun.nio.fs.WindowsFileSystemProvider.implDelete(Unknown Source)
                        at sun.nio.fs.AbstractFileSystemProvider.deleteIfExists(Unknown Source)
                        at java.nio.file.Files.deleteIfExists(Unknown Source)
                        at jenkins.util.io.PathRemover.removeOrMakeRemovableThenRemove(PathRemover.java:241)
jenkins.util.io.CompositeIOException: Unable to remove file <https://ci-builds.apache.org/job/POI/job/POI-DSL-Windows-1.14/ws/.svn\svn.edf0d1ab-1730-484a-8a31-01ccd57f59cb.tmp>
                at jenkins.util.io.PathRemover.removeOrMakeRemovableThenRemove(PathRemover.java:252)
                at jenkins.util.io.PathRemover.tryRemoveFile(PathRemover.java:205)
                at jenkins.util.io.PathRemover.tryRemoveRecursive(PathRemover.java:216)
                at jenkins.util.io.PathRemover.tryRemoveDirectoryContents(PathRemover.java:226)
                at jenkins.util.io.PathRemover.tryRemoveRecursive(PathRemover.java:215)
                at jenkins.util.io.PathRemover.tryRemoveDirectoryContents(PathRemover.java:226)
                at jenkins.util.io.PathRemover.forceRemoveDirectoryContents(PathRemover.java:87)
Also:   Also:   java.nio.file.DirectoryNotEmptyException: <https://ci-builds.apache.org/job/POI/job/POI-DSL-Windows-1.14/ws/.svn>
                        at sun.nio.fs.WindowsFileSystemProvider.implDelete(Unknown Source)
                        at sun.nio.fs.AbstractFileSystemProvider.deleteIfExists(Unknown Source)
                        at java.nio.file.Files.deleteIfExists(Unknown Source)
                        at jenkins.util.io.PathRemover.removeOrMakeRemovableThenRemove(PathRemover.java:237)
        Also:   java.nio.file.DirectoryNotEmptyException: <https://ci-builds.apache.org/job/POI/job/POI-DSL-Windows-1.14/ws/.svn>
                        at sun.nio.fs.WindowsFileSystemProvider.implDelete(Unknown Source)
                        at sun.nio.fs.AbstractFileSystemProvider.deleteIfExists(Unknown Source)
                        at java.nio.file.Files.deleteIfExists(Unknown Source)
                        at jenkins.util.io.PathRemover.removeOrMakeRemovableThenRemove(PathRemover.java:241)
jenkins.util.io.CompositeIOException: Unable to remove directory <https://ci-builds.apache.org/job/POI/job/POI-DSL-Windows-1.14/ws/.svn> with directory contents: [<https://ci-builds.apache.org/job/POI/job/POI-DSL-Windows-1.14/ws/.svn\svn.edf0d1ab-1730-484a-8a31-01ccd57f59cb.tmp]>
                at jenkins.util.io.PathRemover.removeOrMakeRemovableThenRemove(PathRemover.java:250)
                at jenkins.util.io.PathRemover.tryRemoveFile(PathRemover.java:205)
                at jenkins.util.io.PathRemover.tryRemoveRecursive(PathRemover.java:216)
                at jenkins.util.io.PathRemover.tryRemoveDirectoryContents(PathRemover.java:226)
                at jenkins.util.io.PathRemover.forceRemoveDirectoryContents(PathRemover.java:87)
Also:   hudson.remoting.Channel$CallSiteStackTrace: Remote call to JNLP4-connect connection from static.62.73.9.176.clients.your-server.de/176.9.73.62:53252
                at hudson.remoting.Channel.attachCallSiteStackTrace(Channel.java:1788)
                at hudson.remoting.UserRequest$ExceptionResponse.retrieve(UserRequest.java:356)
                at hudson.remoting.Channel.call(Channel.java:998)
                at hudson.FilePath.act(FilePath.java:1069)
                at hudson.FilePath.act(FilePath.java:1058)
                at hudson.scm.SubversionSCM.checkout(SubversionSCM.java:927)
                at hudson.scm.SubversionSCM.checkout(SubversionSCM.java:857)
                at hudson.scm.SCM.checkout(SCM.java:505)
                at hudson.model.AbstractProject.checkout(AbstractProject.java:1206)
                at hudson.model.AbstractBuild$AbstractBuildExecution.defaultCheckout(AbstractBuild.java:574)
                at jenkins.scm.SCMCheckoutStrategy.checkout(SCMCheckoutStrategy.java:86)
                at hudson.model.AbstractBuild$AbstractBuildExecution.run(AbstractBuild.java:499)
                at hudson.model.Run.execute(Run.java:1880)
                at hudson.model.FreeStyleBuild.run(FreeStyleBuild.java:43)
                at hudson.model.ResourceController.execute(ResourceController.java:97)
                at hudson.model.Executor.run(Executor.java:428)
jenkins.util.io.CompositeIOException: Unable to delete '<https://ci-builds.apache.org/job/POI/job/POI-DSL-Windows-1.14/ws/.'.> Tried 3 times (of a maximum of 3) waiting 0.1 sec between attempts.
        at jenkins.util.io.PathRemover.forceRemoveDirectoryContents(PathRemover.java:90)
        at hudson.Util.deleteContentsRecursive(Util.java:261)
        at hudson.Util.deleteContentsRecursive(Util.java:250)
        at hudson.scm.subversion.CheckoutUpdater$SubversionUpdateTask.perform(CheckoutUpdater.java:90)
        at hudson.scm.subversion.WorkspaceUpdater$UpdateTask.delegateTo(WorkspaceUpdater.java:168)
        at hudson.scm.subversion.WorkspaceUpdater$UpdateTask.delegateTo(WorkspaceUpdater.java:176)
        at hudson.scm.subversion.UpdateUpdater$TaskImpl.perform(UpdateUpdater.java:132)
        at hudson.scm.subversion.WorkspaceUpdater$UpdateTask.delegateTo(WorkspaceUpdater.java:168)
        at hudson.scm.SubversionSCM$CheckOutTask.perform(SubversionSCM.java:1031)
        at hudson.scm.SubversionSCM$CheckOutTask.invoke(SubversionSCM.java:1007)
        at hudson.scm.SubversionSCM$CheckOutTask.invoke(SubversionSCM.java:980)
        at hudson.FilePath$FileCallableWrapper.call(FilePath.java:3073)
        at hudson.remoting.UserRequest.perform(UserRequest.java:211)
        at hudson.remoting.UserRequest.perform(UserRequest.java:54)
        at hudson.remoting.Request$2.run(Request.java:369)
        at hudson.remoting.InterceptingExecutorService$1.call(InterceptingExecutorService.java:72)
        at java.util.concurrent.FutureTask.run(Unknown Source)
        at java.util.concurrent.ThreadPoolExecutor.runWorker(Unknown Source)
        at java.util.concurrent.ThreadPoolExecutor$Worker.run(Unknown Source)
        at hudson.remoting.Engine$1.lambda$newThread$0(Engine.java:117)
        at java.lang.Thread.run(Unknown Source)
[SpotBugs] Skipping execution of recorder since overall result is 'FAILURE'
Archiving artifacts
[WARNINGS] Skipping publisher since build result is FAILURE
Recording test results
ERROR: Step ‘Publish JUnit test result report’ failed: No test report files were found. Configuration error?

---------------------------------------------------------------------
To unsubscribe, e-mail: [hidden email]
For additional commands, e-mail: [hidden email]

Reply | Threaded
Open this post in threaded view
|

Build failed in Jenkins: POI » POI-DSL-Windows-1.14 #33

Apache Jenkins Server
See <https://ci-builds.apache.org/job/POI/job/POI-DSL-Windows-1.14/33/display/redirect>

Changes:


------------------------------------------
[...truncated 582.16 KB...]
[junitlauncher] Tests run: 29, Failures: 0, Aborted: 0, Skipped: 0, Time elapsed: 0.329000 sec
[junitlauncher]
[junitlauncher] Running org.apache.poi.xssf.usermodel.TestXSSFTableColumn
[junitlauncher] Tests run: 3, Failures: 0, Aborted: 0, Skipped: 0, Time elapsed: 0.039000 sec
[junitlauncher]
[junitlauncher] Running org.apache.poi.xssf.usermodel.TestXSSFTextParagraph
[junitlauncher] Tests run: 1, Failures: 0, Aborted: 0, Skipped: 0, Time elapsed: 0.011000 sec
[junitlauncher]
[junitlauncher] Running org.apache.poi.xssf.usermodel.TestXSSFTextRun
[junitlauncher] Tests run: 1, Failures: 0, Aborted: 0, Skipped: 0, Time elapsed: 0.007000 sec
[junitlauncher]
[junitlauncher] Running org.apache.poi.xssf.usermodel.TestXSSFUnicodeSurrogates
[junitlauncher] Tests run: 1, Failures: 0, Aborted: 0, Skipped: 0, Time elapsed: 0.026000 sec
[junitlauncher]
[junitlauncher] Running org.apache.poi.xssf.usermodel.TestXSSFVMLDrawing
[junitlauncher] Tests run: 5, Failures: 0, Aborted: 0, Skipped: 0, Time elapsed: 0.107000 sec
[junitlauncher]
[junitlauncher] Running org.apache.poi.xssf.usermodel.TestXSSFWorkbook
[junitlauncher] Tests run: 62, Failures: 0, Aborted: 0, Skipped: 0, Time elapsed: 1.022000 sec
[junitlauncher]
[junitlauncher] Running org.apache.poi.xssf.usermodel.charts.TestXDDFChartLegend
[junitlauncher] Tests run: 3, Failures: 0, Aborted: 0, Skipped: 0, Time elapsed: 0.009000 sec
[junitlauncher]
[junitlauncher] Running org.apache.poi.xssf.usermodel.charts.TestXDDFManualLayout
[junitlauncher] Tests run: 2, Failures: 0, Aborted: 0, Skipped: 0, Time elapsed: 0.008000 sec
[junitlauncher]
[junitlauncher] Running org.apache.poi.xssf.usermodel.charts.TestXSSF3DChartData
[junitlauncher] Tests run: 1, Failures: 0, Aborted: 0, Skipped: 0, Time elapsed: 0.023000 sec
[junitlauncher]
[junitlauncher] Running org.apache.poi.xssf.usermodel.charts.TestXSSFCategoryAxis
[junitlauncher] Tests run: 1, Failures: 0, Aborted: 0, Skipped: 0, Time elapsed: 0.005000 sec
[junitlauncher]
[junitlauncher] Running org.apache.poi.xssf.usermodel.charts.TestXSSFChartAxis
[junitlauncher] Tests run: 8, Failures: 0, Aborted: 0, Skipped: 0, Time elapsed: 0.052000 sec
[junitlauncher]
[junitlauncher] Running org.apache.poi.xssf.usermodel.charts.TestXSSFChartTitle
[junitlauncher] Tests run: 6, Failures: 0, Aborted: 0, Skipped: 0, Time elapsed: 0.089000 sec
[junitlauncher]
[junitlauncher] Running org.apache.poi.xssf.usermodel.charts.TestXSSFDateAxis
[junitlauncher] Tests run: 1, Failures: 0, Aborted: 0, Skipped: 0, Time elapsed: 0.010000 sec
[junitlauncher]
[junitlauncher] Running org.apache.poi.xssf.usermodel.charts.TestXSSFLineChartData
[junitlauncher] Tests run: 1, Failures: 0, Aborted: 0, Skipped: 0, Time elapsed: 0.009000 sec
[junitlauncher]
[junitlauncher] Running org.apache.poi.xssf.usermodel.charts.TestXSSFScatterChartData
[junitlauncher] Tests run: 1, Failures: 0, Aborted: 0, Skipped: 0, Time elapsed: 0.008000 sec
[junitlauncher]
[junitlauncher] Running org.apache.poi.xssf.usermodel.charts.TestXSSFValueAxis
[junitlauncher] Tests run: 1, Failures: 0, Aborted: 0, Skipped: 0, Time elapsed: 0.004000 sec
[junitlauncher]
[junitlauncher] Running org.apache.poi.xssf.usermodel.extensions.TestXSSFBorder
[junitlauncher] Tests run: 1, Failures: 0, Aborted: 0, Skipped: 0, Time elapsed: 0.001000 sec
[junitlauncher]
[junitlauncher] Running org.apache.poi.xssf.usermodel.extensions.TestXSSFCellFill
[junitlauncher] Tests run: 6, Failures: 0, Aborted: 0, Skipped: 0, Time elapsed: 0.027000 sec
[junitlauncher]
[junitlauncher] Running org.apache.poi.xssf.usermodel.extensions.TestXSSFHeaderFooter
[junitlauncher] Tests run: 10, Failures: 0, Aborted: 0, Skipped: 0, Time elapsed: 0.014000 sec
[junitlauncher]
[junitlauncher] Running org.apache.poi.xssf.usermodel.helpers.TestColumnHelper
[junitlauncher] Tests run: 16, Failures: 0, Aborted: 0, Skipped: 0, Time elapsed: 0.021000 sec
[junitlauncher]
[junitlauncher] Running org.apache.poi.xssf.usermodel.helpers.TestHeaderFooterHelper
[junitlauncher] Tests run: 2, Failures: 0, Aborted: 0, Skipped: 0, Time elapsed: 0.001000 sec
[junitlauncher]
[junitlauncher] Running org.apache.poi.xssf.usermodel.helpers.TestXSSFColumnShifting
[junitlauncher] Tests run: 2, Failures: 0, Aborted: 0, Skipped: 0, Time elapsed: 0.003000 sec
[junitlauncher]
[junitlauncher] Running org.apache.poi.xssf.util.TestCTColComparator
[junitlauncher] Tests run: 2, Failures: 0, Aborted: 0, Skipped: 0, Time elapsed: 0.001000 sec
[junitlauncher]
[junitlauncher] Running org.apache.poi.xssf.util.TestEvilUnclosedBRFixingInputStream
[junitlauncher] Tests run: 3, Failures: 0, Aborted: 0, Skipped: 0, Time elapsed: 0.002000 sec
[junitlauncher]
[junitlauncher] Running org.apache.poi.xssf.util.TestNumericRanges
[junitlauncher] Tests run: 2, Failures: 0, Aborted: 0, Skipped: 0, Time elapsed: 0.001000 sec
[junitlauncher]
[junitlauncher] Running org.apache.poi.xwpf.TestAllExtendedProperties
[junitlauncher] Tests run: 1, Failures: 0, Aborted: 0, Skipped: 0, Time elapsed: 0.037000 sec
[junitlauncher]
[junitlauncher] Running org.apache.poi.xwpf.TestDocumentProtection
[junitlauncher] Tests run: 10, Failures: 0, Aborted: 0, Skipped: 0, Time elapsed: 0.477000 sec
[junitlauncher]
[junitlauncher] Running org.apache.poi.xwpf.TestNecessaryOOXMLClasses
[junitlauncher] Tests run: 1, Failures: 0, Aborted: 0, Skipped: 0, Time elapsed: 0.014000 sec
[junitlauncher]
[junitlauncher] Running org.apache.poi.xwpf.TestPackageCorePropertiesGetKeywords
[junitlauncher] Tests run: 1, Failures: 0, Aborted: 0, Skipped: 0, Time elapsed: 0.017000 sec
[junitlauncher]
[junitlauncher] Running org.apache.poi.xwpf.TestXWPFBugs
[junitlauncher] Tests run: 4, Failures: 0, Aborted: 0, Skipped: 0, Time elapsed: 0.272000 sec
[junitlauncher]
[junitlauncher] Running org.apache.poi.xwpf.extractor.TestExternalEntities
[junitlauncher] Tests run: 1, Failures: 0, Aborted: 0, Skipped: 0, Time elapsed: 0.021000 sec
[junitlauncher]
[junitlauncher] Running org.apache.poi.xwpf.extractor.TestXWPFWordExtractor
[junitlauncher] Tests run: 24, Failures: 0, Aborted: 0, Skipped: 0, Time elapsed: 1.112000 sec
[junitlauncher]
[junitlauncher] Running org.apache.poi.xwpf.model.TestXWPFDecorators
[junitlauncher] Tests run: 2, Failures: 0, Aborted: 0, Skipped: 0, Time elapsed: 0.047000 sec
[junitlauncher]
[junitlauncher] Running org.apache.poi.xwpf.model.TestXWPFHeaderFooterPolicy
[junitlauncher] Tests run: 3, Failures: 0, Aborted: 0, Skipped: 0, Time elapsed: 0.196000 sec
[junitlauncher]
[junitlauncher] Running org.apache.poi.xwpf.usermodel.TestChangeTracking
[junitlauncher] Tests run: 3, Failures: 0, Aborted: 0, Skipped: 0, Time elapsed: 0.043000 sec
[junitlauncher]
[junitlauncher] Running org.apache.poi.xwpf.usermodel.TestColumn
[junitlauncher] Tests run: 4, Failures: 0, Aborted: 0, Skipped: 0, Time elapsed: 0.069000 sec
[junitlauncher]
[junitlauncher] Running org.apache.poi.xwpf.usermodel.TestXWPFAbstractNum
[junitlauncher] Tests run: 1, Failures: 0, Aborted: 0, Skipped: 0, Time elapsed: 0.001000 sec
[junitlauncher]
[junitlauncher] Running org.apache.poi.xwpf.usermodel.TestXWPFBugs
[junitlauncher] Tests run: 10, Failures: 0, Aborted: 0, Skipped: 0, Time elapsed: 0.280000 sec
[junitlauncher]
[junitlauncher] Running org.apache.poi.xwpf.usermodel.TestXWPFChart
[junitlauncher] Tests run: 4, Failures: 0, Aborted: 0, Skipped: 0, Time elapsed: 0.065000 sec
[junitlauncher]
[junitlauncher] Running org.apache.poi.xwpf.usermodel.TestXWPFComment
[junitlauncher] Tests run: 1, Failures: 0, Aborted: 0, Skipped: 0, Time elapsed: 0.018000 sec
[junitlauncher]
[junitlauncher] Running org.apache.poi.xwpf.usermodel.TestXWPFDocument
[junitlauncher] Tests run: 21, Failures: 0, Aborted: 0, Skipped: 1, Time elapsed: 0.430000 sec
[junitlauncher]
[junitlauncher] Running org.apache.poi.xwpf.usermodel.TestXWPFEndnote
[junitlauncher] Tests run: 4, Failures: 0, Aborted: 0, Skipped: 0, Time elapsed: 0.015000 sec
[junitlauncher]
[junitlauncher] Running org.apache.poi.xwpf.usermodel.TestXWPFEndnotes
[junitlauncher] Tests run: 2, Failures: 0, Aborted: 0, Skipped: 0, Time elapsed: 0.007000 sec
[junitlauncher]
[junitlauncher] Running org.apache.poi.xwpf.usermodel.TestXWPFFootnote
[junitlauncher] Tests run: 4, Failures: 0, Aborted: 0, Skipped: 0, Time elapsed: 0.016000 sec
[junitlauncher]
[junitlauncher] Running org.apache.poi.xwpf.usermodel.TestXWPFFootnotes
[junitlauncher] Tests run: 3, Failures: 0, Aborted: 0, Skipped: 0, Time elapsed: 0.021000 sec
[junitlauncher]
[junitlauncher] Running org.apache.poi.xwpf.usermodel.TestXWPFHeader
[junitlauncher] Tests run: 6, Failures: 0, Aborted: 0, Skipped: 0, Time elapsed: 0.143000 sec
[junitlauncher]
[junitlauncher] Running org.apache.poi.xwpf.usermodel.TestXWPFHeadings
[junitlauncher] Tests run: 1, Failures: 0, Aborted: 0, Skipped: 0, Time elapsed: 0.047000 sec
[junitlauncher]
[junitlauncher] Running org.apache.poi.xwpf.usermodel.TestXWPFNumbering
[junitlauncher] Tests run: 8, Failures: 0, Aborted: 0, Skipped: 0, Time elapsed: 0.075000 sec
[junitlauncher]
[junitlauncher] Running org.apache.poi.xwpf.usermodel.TestXWPFParagraph
[junitlauncher] Tests run: 29, Failures: 0, Aborted: 0, Skipped: 0, Time elapsed: 0.297000 sec
[junitlauncher]
[junitlauncher] Running org.apache.poi.xwpf.usermodel.TestXWPFPictureData
[junitlauncher] Tests run: 5, Failures: 0, Aborted: 0, Skipped: 0, Time elapsed: 0.170000 sec
[junitlauncher]
[junitlauncher] Running org.apache.poi.xwpf.usermodel.TestXWPFRun
[junitlauncher] Tests run: 34, Failures: 0, Aborted: 0, Skipped: 0, Time elapsed: 0.202000 sec
[junitlauncher]
[junitlauncher] Running org.apache.poi.xwpf.usermodel.TestXWPFSDT
[junitlauncher] Tests run: 7, Failures: 0, Aborted: 0, Skipped: 0, Time elapsed: 0.171000 sec
[junitlauncher]
[junitlauncher] Running org.apache.poi.xwpf.usermodel.TestXWPFSmartTag
[junitlauncher] Tests run: 1, Failures: 0, Aborted: 0, Skipped: 0, Time elapsed: 0.025000 sec
[junitlauncher]
[junitlauncher] Running org.apache.poi.xwpf.usermodel.TestXWPFStyles
[junitlauncher] Tests run: 10, Failures: 0, Aborted: 0, Skipped: 0, Time elapsed: 0.132000 sec
[junitlauncher]
[junitlauncher] Running org.apache.poi.xwpf.usermodel.TestXWPFTable
[junitlauncher] Tests run: 17, Failures: 0, Aborted: 0, Skipped: 0, Time elapsed: 0.091000 sec
[junitlauncher]
[junitlauncher] Running org.apache.poi.xwpf.usermodel.TestXWPFTableCell
[junitlauncher] Tests run: 11, Failures: 0, Aborted: 0, Skipped: 1, Time elapsed: 0.062000 sec
[junitlauncher]
[junitlauncher] Running org.apache.poi.xwpf.usermodel.TestXWPFTableRow
[junitlauncher] Tests run: 8, Failures: 0, Aborted: 0, Skipped: 0, Time elapsed: 0.046000 sec

-test-ooxml-write-testfile:

compile-ooxml-lite:
     [echo] Create ooxml-lite schemas
    [javac] Compiling 1 source file to <https://ci-builds.apache.org/job/POI/job/POI-DSL-Windows-1.14/ws/src\multimodule\ooxml-lite\java9>
    [javac] <https://ci-builds.apache.org/job/POI/job/POI-DSL-Windows-1.14/ws/src\multimodule\ooxml-lite\java9\module-info.java>:22: warning: requires transitive directive for an automatic module
    [javac]     requires transitive org.apache.xmlbeans;
    [javac]                                   ^
    [javac] 1 warning
     [copy] Copying 1 file to <https://ci-builds.apache.org/job/POI/job/POI-DSL-Windows-1.14/ws/build>
     [copy] Copying 1 file to <https://ci-builds.apache.org/job/POI/job/POI-DSL-Windows-1.14/ws/build>
     [copy] Copying 1 file to <https://ci-builds.apache.org/job/POI/job/POI-DSL-Windows-1.14/ws/build>
    [mkdir] Created dir: <https://ci-builds.apache.org/job/POI/job/POI-DSL-Windows-1.14/ws/build\dist\maven\poi-ooxml-lite>
      [jar] Building jar: <https://ci-builds.apache.org/job/POI/job/POI-DSL-Windows-1.14/ws/build\dist\maven\poi-ooxml-lite\poi-ooxml-lite-5.0.1-SNAPSHOT.jar>

-test-excelant-check:

test-excelant:
[junitlauncher]
[junitlauncher] Running org.apache.poi.ss.excelant.TestBuildFile
[junitlauncher] Tests run: 14, Failures: 0, Aborted: 0, Skipped: 0, Time elapsed: 3.207000 sec
[junitlauncher]
[junitlauncher] Running org.apache.poi.ss.excelant.TestExcelAntPrecision
[junitlauncher] Tests run: 1, Failures: 0, Aborted: 0, Skipped: 0, Time elapsed: 0.005000 sec
[junitlauncher]
[junitlauncher] Running org.apache.poi.ss.excelant.TestExcelAntSet
[junitlauncher] Tests run: 2, Failures: 0, Aborted: 0, Skipped: 0, Time elapsed: 0.013000 sec
[junitlauncher]
[junitlauncher] Running org.apache.poi.ss.excelant.TestExcelAntSetDoubleCell
[junitlauncher] Tests run: 1, Failures: 0, Aborted: 0, Skipped: 0, Time elapsed: 0.002000 sec
[junitlauncher]
[junitlauncher] Running org.apache.poi.ss.excelant.TestExcelAntUserDefinedFunction
[junitlauncher] Tests run: 2, Failures: 0, Aborted: 0, Skipped: 0, Time elapsed: 0.003000 sec
[junitlauncher]
[junitlauncher] Running org.apache.poi.ss.excelant.util.TestExcelAntEvaluationResult
[junitlauncher] Tests run: 4, Failures: 0, Aborted: 0, Skipped: 0, Time elapsed: 0.005000 sec
[junitlauncher]
[junitlauncher] Running org.apache.poi.ss.excelant.util.TestExcelAntWorkbookUtil
[junitlauncher] Tests run: 23, Failures: 0, Aborted: 0, Skipped: 0, Time elapsed: 1.311000 sec
[junitlauncher]
[junitlauncher] Running org.apache.poi.ss.excelant.util.TestExcelAntWorkbookUtilFactory
[junitlauncher] Tests run: 2, Failures: 0, Aborted: 0, Skipped: 0, Time elapsed: 0.002000 sec

-test-excelant-write-testfile:

test:

compile-integration:
    [javac] Compiling 28 source files to <https://ci-builds.apache.org/job/POI/job/POI-DSL-Windows-1.14/ws/build\integration-test-classes>
    [javac] Ignoring source, target and bootclasspath as release has been set
    [mkdir] Created dir: <https://ci-builds.apache.org/job/POI/job/POI-DSL-Windows-1.14/ws/build\integration-test-classes\META-INF\versions\9>
    [javac] Compiling 1 source file to <https://ci-builds.apache.org/job/POI/job/POI-DSL-Windows-1.14/ws/build\integration-test-classes\META-INF\versions\9>
      [jar] Building jar: <https://ci-builds.apache.org/job/POI/job/POI-DSL-Windows-1.14/ws/build\dist\maven\poi-integration\poi-integration-5.0.1-SNAPSHOT.jar>

-test-integration-check:

test-integration:
[junitlauncher]
[junitlauncher] Running org.apache.poi.stress.TestAllFiles
[junitlauncher]    Failed: #1629 spreadsheet\54764.xlsx XSSF
[junitlauncher]    Failed: #2407 spreadsheet\poc-xmlbomb-empty.xlsx XSSF
[junitlauncher]    Failed: #2409 spreadsheet\poc-xmlbomb.xlsx XSSF
[junitlauncher]    Failed: #2428 spreadsheet\sample-beta.xlsx XSSF
[junitlauncher] Tests run: 7677, Failures: 4, Aborted: 0, Skipped: 0, Time elapsed: 193.537000 sec

BUILD FAILED
<https://ci-builds.apache.org/job/POI/job/POI-DSL-Windows-1.14/ws/build.xml>:1704: The following error occurred while executing this line:
<https://ci-builds.apache.org/job/POI/job/POI-DSL-Windows-1.14/ws/build.xml>:1254: Some test(s) have failure(s)

Total time: 22 minutes 0 seconds
Build step 'Invoke Ant' marked build as failure
[SpotBugs] Skipping execution of recorder since overall result is 'FAILURE'
Archiving artifacts
[Fast Archiver] Compressed 9.88 MB of artifacts by 30.7% relative to #27
[WARNINGS] Skipping publisher since build result is FAILURE
Recording test results

---------------------------------------------------------------------
To unsubscribe, e-mail: [hidden email]
For additional commands, e-mail: [hidden email]

Reply | Threaded
Open this post in threaded view
|

Jenkins build is back to normal : POI » POI-DSL-Windows-1.14 #34

Apache Jenkins Server
See <https://ci-builds.apache.org/job/POI/job/POI-DSL-Windows-1.14/34/display/redirect?page=changes>


---------------------------------------------------------------------
To unsubscribe, e-mail: [hidden email]
For additional commands, e-mail: [hidden email]