Build failed in Jenkins: POI » POI-DSL-Windows-1.14 #21

classic Classic list List threaded Threaded
5 messages Options
Reply | Threaded
Open this post in threaded view
|

Build failed in Jenkins: POI » POI-DSL-Windows-1.14 #21

Apache Jenkins Server
See <https://ci-builds.apache.org/job/POI/job/POI-DSL-Windows-1.14/21/display/redirect?page=changes>

Changes:

[Andreas Beeker] Forbidden-apis fix - Graphics2D.finalize() is deprecated by Java14

[Andreas Beeker] Sonar fixes

[Andreas Beeker] try to fix gradle sonarqube job

[Andreas Beeker] try to fix gradle sonarqube job

[PJ Fanning] [bug-65023] add col bugfix. Thanks to Paula Muldoon, This closes #212

[Andreas Beeker] upgrade pdfbox and pdfbox-graphics2d

[Andreas Beeker] try to fix distsourcebuild error

[Andreas Beeker] #65026 - Migrate tests to Junit 5


------------------------------------------
[...truncated 120.05 KB...]
      [get] Getting: https://repo1.maven.org/maven2/org/junit/platform/junit-platform-launcher/1.7.0/junit-platform-launcher-1.7.0.jar
      [get] To: <https://ci-builds.apache.org/job/POI/job/POI-DSL-Windows-1.14/ws/lib\main-tests\junit-platform-launcher-1.7.0.jar>
      [get] Getting: https://repo1.maven.org/maven2/org/junit/platform/junit-platform-engine/1.7.0/junit-platform-engine-1.7.0.jar
      [get] To: <https://ci-builds.apache.org/job/POI/job/POI-DSL-Windows-1.14/ws/lib\main-tests\junit-platform-engine-1.7.0.jar>
      [get] Getting: https://repo1.maven.org/maven2/org/junit/platform/junit-platform-commons/1.7.0/junit-platform-commons-1.7.0.jar
      [get] To: <https://ci-builds.apache.org/job/POI/job/POI-DSL-Windows-1.14/ws/lib\main-tests\junit-platform-commons-1.7.0.jar>
      [get] Getting: https://repo1.maven.org/maven2/org/opentest4j/opentest4j/1.2.0/opentest4j-1.2.0.jar
      [get] To: <https://ci-builds.apache.org/job/POI/job/POI-DSL-Windows-1.14/ws/lib\main-tests\opentest4j-1.2.0.jar>
      [get] Getting: https://repo1.maven.org/maven2/org/apiguardian/apiguardian-api/1.1.0/apiguardian-api-1.1.0.jar
      [get] To: <https://ci-builds.apache.org/job/POI/job/POI-DSL-Windows-1.14/ws/lib\main-tests\apiguardian-api-1.1.0.jar>
      [get] Destination already exists (skipping): <https://ci-builds.apache.org/job/POI/job/POI-DSL-Windows-1.14/ws/lib\main-tests\jmh-core-1.26.jar>
      [get] Destination already exists (skipping): <https://ci-builds.apache.org/job/POI/job/POI-DSL-Windows-1.14/ws/lib\main-tests\jmh-generator-annprocess-1.26.jar>
      [get] Destination already exists (skipping): <https://ci-builds.apache.org/job/POI/job/POI-DSL-Windows-1.14/ws/lib\main-tests\hamcrest-2.2.jar>
      [get] Destination already exists (skipping): <https://ci-builds.apache.org/job/POI/job/POI-DSL-Windows-1.14/ws/lib\main-tests\xmlunit-core-2.8.0.jar>
      [get] Destination already exists (skipping): <https://ci-builds.apache.org/job/POI/job/POI-DSL-Windows-1.14/ws/lib\main-tests\mockito-core-3.6.0.jar>
      [get] Destination already exists (skipping): <https://ci-builds.apache.org/job/POI/job/POI-DSL-Windows-1.14/ws/lib\main-tests\byte-buddy-1.10.18.jar>
      [get] Destination already exists (skipping): <https://ci-builds.apache.org/job/POI/job/POI-DSL-Windows-1.14/ws/lib\main-tests\byte-buddy-agent-1.10.18.jar>
      [get] Destination already exists (skipping): <https://ci-builds.apache.org/job/POI/job/POI-DSL-Windows-1.14/ws/lib\main-tests\objenesis-3.1.jar>
      [get] Destination already exists (skipping): <https://ci-builds.apache.org/job/POI/job/POI-DSL-Windows-1.14/ws/lib\excelant\ant-1.10.9.jar>
      [get] Destination already exists (skipping): <https://ci-builds.apache.org/job/POI/job/POI-DSL-Windows-1.14/ws/lib\excelant\ant-launcher-1.10.9.jar>
      [get] Getting: https://repo1.maven.org/maven2/org/slf4j/slf4j-api/1.7.30/slf4j-api-1.7.30.jar
      [get] To: <https://ci-builds.apache.org/job/POI/job/POI-DSL-Windows-1.14/ws/lib\main\slf4j-api-1.7.30.jar>
      [get] Getting: https://repo1.maven.org/maven2/org/slf4j/slf4j-api/1.7.30/slf4j-api-1.7.30.jar
      [get] To: <https://ci-builds.apache.org/job/POI/job/POI-DSL-Windows-1.14/ws/lib\main-tests\slf4j-api-1.7.30.jar>
      [get] Destination already exists (skipping): <https://ci-builds.apache.org/job/POI/job/POI-DSL-Windows-1.14/ws/lib\util\asm-9.0.jar>
      [get] Destination already exists (skipping): <https://ci-builds.apache.org/job/POI/job/POI-DSL-Windows-1.14/ws/lib\util\asm-commons-9.0.jar>
      [get] Destination already exists (skipping): <https://ci-builds.apache.org/job/POI/job/POI-DSL-Windows-1.14/ws/lib\util\asm-tree-9.0.jar>
      [get] Destination already exists (skipping): <https://ci-builds.apache.org/job/POI/job/POI-DSL-Windows-1.14/ws/lib\util\jacoco-0.8.6.zip>
      [get] Destination already exists (skipping): <https://ci-builds.apache.org/job/POI/job/POI-DSL-Windows-1.14/ws/lib\main\commons-collections4-4.4.jar>
      [get] Destination already exists (skipping): <https://ci-builds.apache.org/job/POI/job/POI-DSL-Windows-1.14/ws/lib\main\commons-math3-3.6.1.jar>
      [get] Destination already exists (skipping): <https://ci-builds.apache.org/job/POI/job/POI-DSL-Windows-1.14/ws/lib\main\SparseBitSet-1.2.jar>
    [unzip] Expanding: <https://ci-builds.apache.org/job/POI/job/POI-DSL-Windows-1.14/ws/lib\util\jacoco-0.8.6.zip> into <https://ci-builds.apache.org/job/POI/job/POI-DSL-Windows-1.14/ws/lib\util>
      [get] Destination already exists (skipping): <https://ci-builds.apache.org/job/POI/job/POI-DSL-Windows-1.14/ws/lib\util\apache-rat-0.13.jar>
      [get] Destination already exists (skipping): <https://ci-builds.apache.org/job/POI/job/POI-DSL-Windows-1.14/ws/lib\util\forbiddenapis-3.1.jar>
      [get] Destination already exists (skipping): <https://ci-builds.apache.org/job/POI/job/POI-DSL-Windows-1.14/ws/lib\ooxml-provided\bcprov-jdk15on-1.67.jar>
      [get] Destination already exists (skipping): <https://ci-builds.apache.org/job/POI/job/POI-DSL-Windows-1.14/ws/lib\ooxml-provided\bcpkix-jdk15on-1.67.jar>
      [get] Destination already exists (skipping): <https://ci-builds.apache.org/job/POI/job/POI-DSL-Windows-1.14/ws/lib\ooxml-provided\xmlsec-2.2.0.jar>

check-ooxml-jars:

fetch-ooxml-jars:
      [get] Destination already exists (skipping): <https://ci-builds.apache.org/job/POI/job/POI-DSL-Windows-1.14/ws/lib\ooxml\curvesapi-1.06.jar>
      [get] Getting: https://repo1.maven.org/maven2/org/apache/xmlbeans/xmlbeans/4.0.0/xmlbeans-4.0.0.jar
      [get] To: <https://ci-builds.apache.org/job/POI/job/POI-DSL-Windows-1.14/ws/lib\ooxml\xmlbeans-4.0.0.jar>
      [get] Destination already exists (skipping): <https://ci-builds.apache.org/job/POI/job/POI-DSL-Windows-1.14/ws/lib\ooxml\commons-compress-1.20.jar>
      [get] Destination already exists (skipping): <https://ci-builds.apache.org/job/POI/job/POI-DSL-Windows-1.14/ws/lib\ooxml-tests\reflections-0.9.12.jar>
      [get] Destination already exists (skipping): <https://ci-builds.apache.org/job/POI/job/POI-DSL-Windows-1.14/ws/lib\ooxml-tests\guava-30.0-jre.jar>
      [get] Destination already exists (skipping): <https://ci-builds.apache.org/job/POI/job/POI-DSL-Windows-1.14/ws/lib\ooxml-tests\javassist-3.27.0-GA.jar>
      [get] Destination already exists (skipping): <https://ci-builds.apache.org/job/POI/job/POI-DSL-Windows-1.14/ws/lib\ooxml-provided\batik-all-1.13.jar>
      [get] Destination already exists (skipping): <https://ci-builds.apache.org/job/POI/job/POI-DSL-Windows-1.14/ws/lib\ooxml-provided\xml-apis-ext-1.3.04.jar>
      [get] Destination already exists (skipping): <https://ci-builds.apache.org/job/POI/job/POI-DSL-Windows-1.14/ws/lib\ooxml-provided\xmlgraphics-commons-2.4.jar>
      [get] Getting: https://repo1.maven.org/maven2/org/apache/pdfbox/pdfbox/2.0.22/pdfbox-2.0.22.jar
      [get] To: <https://ci-builds.apache.org/job/POI/job/POI-DSL-Windows-1.14/ws/lib\ooxml-provided\pdfbox-2.0.22.jar>
      [get] Getting: https://repo1.maven.org/maven2/org/apache/pdfbox/fontbox/2.0.22/fontbox-2.0.22.jar
      [get] To: <https://ci-builds.apache.org/job/POI/job/POI-DSL-Windows-1.14/ws/lib\ooxml-provided\fontbox-2.0.22.jar>
      [get] Getting: https://repo1.maven.org/maven2/de/rototor/pdfbox/graphics2d/0.30/graphics2d-0.30.jar
      [get] To: <https://ci-builds.apache.org/job/POI/job/POI-DSL-Windows-1.14/ws/lib\ooxml-provided\graphics2d-0.30.jar>

init:
    [mkdir] Created dir: <https://ci-builds.apache.org/job/POI/job/POI-DSL-Windows-1.14/ws/build>
    [mkdir] Created dir: <https://ci-builds.apache.org/job/POI/job/POI-DSL-Windows-1.14/ws/build\classes>
    [mkdir] Created dir: <https://ci-builds.apache.org/job/POI/job/POI-DSL-Windows-1.14/ws/build\test-classes>
    [mkdir] Created dir: <https://ci-builds.apache.org/job/POI/job/POI-DSL-Windows-1.14/ws/build\test-results>
    [mkdir] Created dir: <https://ci-builds.apache.org/job/POI/job/POI-DSL-Windows-1.14/ws/build\scratchpad-classes>
    [mkdir] Created dir: <https://ci-builds.apache.org/job/POI/job/POI-DSL-Windows-1.14/ws/build\scratchpad-test-classes>
    [mkdir] Created dir: <https://ci-builds.apache.org/job/POI/job/POI-DSL-Windows-1.14/ws/build\scratchpad-test-results>
    [mkdir] Created dir: <https://ci-builds.apache.org/job/POI/job/POI-DSL-Windows-1.14/ws/build\geometry-java>
    [mkdir] Created dir: <https://ci-builds.apache.org/job/POI/job/POI-DSL-Windows-1.14/ws/build\ooxml-classes>
    [mkdir] Created dir: <https://ci-builds.apache.org/job/POI/job/POI-DSL-Windows-1.14/ws/build\ooxml-test-classes>
    [mkdir] Created dir: <https://ci-builds.apache.org/job/POI/job/POI-DSL-Windows-1.14/ws/build\ooxml-test-results>
    [mkdir] Created dir: <https://ci-builds.apache.org/job/POI/job/POI-DSL-Windows-1.14/ws/build\excelant-classes>
    [mkdir] Created dir: <https://ci-builds.apache.org/job/POI/job/POI-DSL-Windows-1.14/ws/build\excelant-test-classes>
    [mkdir] Created dir: <https://ci-builds.apache.org/job/POI/job/POI-DSL-Windows-1.14/ws/build\excelant-test-results>
    [mkdir] Created dir: <https://ci-builds.apache.org/job/POI/job/POI-DSL-Windows-1.14/ws/build\examples-classes>
    [mkdir] Created dir: <https://ci-builds.apache.org/job/POI/job/POI-DSL-Windows-1.14/ws/build\integration-test-classes>
    [mkdir] Created dir: <https://ci-builds.apache.org/job/POI/job/POI-DSL-Windows-1.14/ws/build\integration-test-results>
    [mkdir] Created dir: <https://ci-builds.apache.org/job/POI/job/POI-DSL-Windows-1.14/ws/build\dist>
    [mkdir] Created dir: <https://ci-builds.apache.org/job/POI/job/POI-DSL-Windows-1.14/ws/build\site>
     [echo] Using Ant: Apache Ant(TM) version 1.10.5 compiled on July 10 2018 from F:\\jenkins\\tools\\ant\\latest1.10, Ant detected Java 14 (may be different than actual Java sometimes...)
     [echo] Using Java: 14-ea/14-ea+6-171/14-ea+6-171/OpenJDK 64-Bit Server VM from Oracle Corporation on Windows Server 2016: 10.0
     [echo] Building Apache POI version 5.0.0-SNAPSHOT and RC: RC1

-version-java-check:

compile-version:
     [copy] Copying 1 file to <https://ci-builds.apache.org/job/POI/job/POI-DSL-Windows-1.14/ws/build\classes\org\apache\poi>
    [javac] Compiling 1 source file to <https://ci-builds.apache.org/job/POI/job/POI-DSL-Windows-1.14/ws/build\classes>
    [javac] warning: [options] bootstrap class path not set in conjunction with -source 8
    [javac] 1 warning
   [delete] Deleting: <https://ci-builds.apache.org/job/POI/job/POI-DSL-Windows-1.14/ws/build\classes\org\apache\poi\Version.java>

compile-main:
    [javac] Compiling 1177 source files to <https://ci-builds.apache.org/job/POI/job/POI-DSL-Windows-1.14/ws/build\classes>
    [javac] Ignoring source, target and bootclasspath as release has been set
    [javac] Note: Some input files use or override a deprecated API.
    [javac] Note: Recompile with -Xlint:deprecation for details.
    [javac] Note: Some input files use unchecked or unsafe operations.
    [javac] Note: Recompile with -Xlint:unchecked for details.
    [javac] Creating empty <https://ci-builds.apache.org/job/POI/job/POI-DSL-Windows-1.14/ws/build\classes\org\apache\poi\ddf\package-info.class>
    [javac] Creating empty <https://ci-builds.apache.org/job/POI/job/POI-DSL-Windows-1.14/ws/build\classes\org\apache\poi\hssf\package-info.class>
    [javac] Creating empty <https://ci-builds.apache.org/job/POI/job/POI-DSL-Windows-1.14/ws/build\classes\org\apache\poi\poifs\dev\package-info.class>
    [javac] Creating empty <https://ci-builds.apache.org/job/POI/job/POI-DSL-Windows-1.14/ws/build\classes\org\apache\poi\util\package-info.class>
    [javac] Creating empty <https://ci-builds.apache.org/job/POI/job/POI-DSL-Windows-1.14/ws/build\classes\org\apache\poi\poifs\common\package-info.class>
    [javac] Creating empty <https://ci-builds.apache.org/job/POI/job/POI-DSL-Windows-1.14/ws/build\classes\org\apache\poi\hssf\record\package-info.class>
    [javac] Creating empty <https://ci-builds.apache.org/job/POI/job/POI-DSL-Windows-1.14/ws/build\classes\org\apache\poi\poifs\package-info.class>
    [javac] Creating empty <https://ci-builds.apache.org/job/POI/job/POI-DSL-Windows-1.14/ws/build\classes\org\apache\poi\poifs\crypt\package-info.class>
    [javac] Creating empty <https://ci-builds.apache.org/job/POI/job/POI-DSL-Windows-1.14/ws/build\classes\org\apache\poi\hpsf\wellknown\package-info.class>
    [javac] Creating empty <https://ci-builds.apache.org/job/POI/job/POI-DSL-Windows-1.14/ws/build\classes\org\apache\poi\hssf\dev\package-info.class>
    [javac] Creating empty <https://ci-builds.apache.org/job/POI/job/POI-DSL-Windows-1.14/ws/build\classes\org\apache\poi\ss\formula\package-info.class>
    [javac] Creating empty <https://ci-builds.apache.org/job/POI/job/POI-DSL-Windows-1.14/ws/build\classes\org\apache\poi\hpsf\package-info.class>
    [javac] Creating empty <https://ci-builds.apache.org/job/POI/job/POI-DSL-Windows-1.14/ws/build\classes\org\apache\poi\poifs\property\package-info.class>
    [javac] Creating empty <https://ci-builds.apache.org/job/POI/job/POI-DSL-Windows-1.14/ws/build\classes\org\apache\poi\poifs\filesystem\package-info.class>
    [javac] Creating empty <https://ci-builds.apache.org/job/POI/job/POI-DSL-Windows-1.14/ws/build\classes\org\apache\poi\ss\formula\ptg\package-info.class>
    [javac] Creating empty <https://ci-builds.apache.org/job/POI/job/POI-DSL-Windows-1.14/ws/build\classes\org\apache\poi\poifs\storage\package-info.class>
    [javac] Creating empty <https://ci-builds.apache.org/job/POI/job/POI-DSL-Windows-1.14/ws/build\classes\org\apache\poi\hssf\eventusermodel\package-info.class>
    [javac] Creating empty <https://ci-builds.apache.org/job/POI/job/POI-DSL-Windows-1.14/ws/build\classes\org\apache\poi\hssf\record\aggregates\package-info.class>
    [javac] Creating empty <https://ci-builds.apache.org/job/POI/job/POI-DSL-Windows-1.14/ws/build\classes\org\apache\poi\ss\format\package-info.class>
    [javac] Creating empty <https://ci-builds.apache.org/job/POI/job/POI-DSL-Windows-1.14/ws/build\classes\org\apache\poi\hssf\model\package-info.class>
    [javac] Creating empty <https://ci-builds.apache.org/job/POI/job/POI-DSL-Windows-1.14/ws/build\classes\org\apache\poi\hssf\usermodel\package-info.class>
    [javac] Creating empty <https://ci-builds.apache.org/job/POI/job/POI-DSL-Windows-1.14/ws/build\classes\org\apache\poi\hssf\util\package-info.class>
    [javac] Creating empty <https://ci-builds.apache.org/job/POI/job/POI-DSL-Windows-1.14/ws/build\classes\org\apache\poi\poifs\eventfilesystem\package-info.class>
    [javac] Compiling 1 source file to <https://ci-builds.apache.org/job/POI/job/POI-DSL-Windows-1.14/ws/src\multimodule\poi\java9>
    [mkdir] Created dir: <https://ci-builds.apache.org/job/POI/job/POI-DSL-Windows-1.14/ws/build\dist\maven\poi>
      [jar] Building jar: <https://ci-builds.apache.org/job/POI/job/POI-DSL-Windows-1.14/ws/build\dist\maven\poi\poi-5.0.0-SNAPSHOT.jar>
    [javac] Compiling 523 source files to <https://ci-builds.apache.org/job/POI/job/POI-DSL-Windows-1.14/ws/build\test-classes>
    [javac] Ignoring source, target and bootclasspath as release has been set
    [javac] Note: Some input files use or override a deprecated API.
    [javac] Note: Recompile with -Xlint:deprecation for details.
    [javac] Note: <https://ci-builds.apache.org/job/POI/job/POI-DSL-Windows-1.14/ws/src\testcases\org\apache\poi\sl\usermodel\BaseTestSlideShow.java> uses unchecked or unsafe operations.
    [javac] Note: Recompile with -Xlint:unchecked for details.
    [javac] Compiling 1 source file to <https://ci-builds.apache.org/job/POI/job/POI-DSL-Windows-1.14/ws/src\multimodule\poi\test9>
      [jar] Building jar: <https://ci-builds.apache.org/job/POI/job/POI-DSL-Windows-1.14/ws/build\dist\maven\poi-tests\poi-5.0.0-SNAPSHOT-tests.jar>
      [jar] Building jar: <https://ci-builds.apache.org/job/POI/job/POI-DSL-Windows-1.14/ws/build\dist\maven\poi\poi-5.0.0-SNAPSHOT-sources.jar>

compile-scratchpad:
    [javac] Compiling 515 source files to <https://ci-builds.apache.org/job/POI/job/POI-DSL-Windows-1.14/ws/build\scratchpad-classes>
    [javac] Ignoring source, target and bootclasspath as release has been set
    [javac] Note: Some input files use or override a deprecated API.
    [javac] Note: Recompile with -Xlint:deprecation for details.
    [javac] Note: Some input files use unchecked or unsafe operations.
    [javac] Note: Recompile with -Xlint:unchecked for details.
    [mkdir] Created dir: <https://ci-builds.apache.org/job/POI/job/POI-DSL-Windows-1.14/ws/build\dist\maven\poi-scratchpad>
      [jar] Building jar: <https://ci-builds.apache.org/job/POI/job/POI-DSL-Windows-1.14/ws/build\dist\maven\poi-scratchpad\poi-scratchpad-5.0.0-SNAPSHOT.jar>
    [javac] Compiling 197 source files to <https://ci-builds.apache.org/job/POI/job/POI-DSL-Windows-1.14/ws/build\scratchpad-test-classes>
    [javac] Ignoring source, target and bootclasspath as release has been set
    [javac] Note: Some input files use or override a deprecated API.
    [javac] Note: Recompile with -Xlint:deprecation for details.
    [javac] Compiling 1 source file to <https://ci-builds.apache.org/job/POI/job/POI-DSL-Windows-1.14/ws/src\multimodule\scratchpad\test9>
    [javac] <https://ci-builds.apache.org/job/POI/job/POI-DSL-Windows-1.14/ws/src\multimodule\scratchpad\test9\module-info.java>:19: warning: requires transitive directive for an automatic module
    [javac]     requires transitive org.apache.poi.poi;
    [javac]                                       ^
    [javac] 1 warning
      [jar] Building jar: <https://ci-builds.apache.org/job/POI/job/POI-DSL-Windows-1.14/ws/build\dist\maven\poi-scratchpad-tests\poi-scratchpad-5.0.0-SNAPSHOT-tests.jar>
      [jar] Building jar: <https://ci-builds.apache.org/job/POI/job/POI-DSL-Windows-1.14/ws/build\dist\maven\poi-scratchpad\poi-scratchpad-5.0.0-SNAPSHOT-sources.jar>

check-compiled-ooxml-xsds:

compile-ooxml-xsds:
    [mkdir] Created dir: <https://ci-builds.apache.org/job/POI/job/POI-DSL-Windows-1.14/ws/build\xmlbean-xsds>
     [copy] Copying 8 files to <https://ci-builds.apache.org/job/POI/job/POI-DSL-Windows-1.14/ws/build\xmlbean-xsds>
     [copy] Copying 28 resources to <https://ci-builds.apache.org/job/POI/job/POI-DSL-Windows-1.14/ws/build\xmlbean-xsds>
    [mkdir] Created dir: <https://ci-builds.apache.org/job/POI/job/POI-DSL-Windows-1.14/ws/build\xmlbean-sources>
    [mkdir] Created dir: <https://ci-builds.apache.org/job/POI/job/POI-DSL-Windows-1.14/ws/build\xmlbean-classes>
  [xmlbean] SchemaCompiler  Metadata LOAD:org/apache/xmlbeans/metadata GEN:org/apache/poi/schemas/ooxml
  [xmlbean] Time to build schema type system: 2.728 seconds
  [xmlbean] Time to generate code: 19.403 seconds
    [javac] Compiling 5064 source files to <https://ci-builds.apache.org/job/POI/job/POI-DSL-Windows-1.14/ws/build\xmlbean-classes>
    [javac] Ignoring source, target and bootclasspath as release has been set
    [javac] Compiling 1 source file to <https://ci-builds.apache.org/job/POI/job/POI-DSL-Windows-1.14/ws/src\multimodule\ooxml-full\java9>
    [javac] <https://ci-builds.apache.org/job/POI/job/POI-DSL-Windows-1.14/ws/src\multimodule\ooxml-full\java9\module-info.java>:22: warning: requires transitive directive for an automatic module
    [javac]     requires transitive org.apache.xmlbeans;
    [javac]                                   ^
    [javac] 1 warning
    [mkdir] Created dir: <https://ci-builds.apache.org/job/POI/job/POI-DSL-Windows-1.14/ws/build\dist\maven\poi-ooxml-full>
      [jar] Building jar: <https://ci-builds.apache.org/job/POI/job/POI-DSL-Windows-1.14/ws/build\dist\maven\poi-ooxml-full\poi-ooxml-full-5.0.0-SNAPSHOT.jar>
      [jar] Building jar: <https://ci-builds.apache.org/job/POI/job/POI-DSL-Windows-1.14/ws/build\dist\maven\poi-ooxml-full\poi-ooxml-full-5.0.0-SNAPSHOT-sources.jar>

compile-ooxml:
    [javac] Compiling 619 source files to <https://ci-builds.apache.org/job/POI/job/POI-DSL-Windows-1.14/ws/build\ooxml-classes>
    [javac] Ignoring source, target and bootclasspath as release has been set
    [javac] Note: Some input files use or override a deprecated API.
    [javac] Note: Recompile with -Xlint:deprecation for details.
    [javac] Note: <https://ci-builds.apache.org/job/POI/job/POI-DSL-Windows-1.14/ws/src\ooxml\java\org\apache\poi\xslf\draw\SVGImageRenderer.java> uses unchecked or unsafe operations.
    [javac] Note: Recompile with -Xlint:unchecked for details.
    [javac] Creating empty <https://ci-builds.apache.org/job/POI/job/POI-DSL-Windows-1.14/ws/build\ooxml-classes\org\apache\poi\xwpf\package-info.class>
    [javac] Creating empty <https://ci-builds.apache.org/job/POI/job/POI-DSL-Windows-1.14/ws/build\ooxml-classes\org\apache\poi\xssf\binary\package-info.class>
    [mkdir] Created dir: <https://ci-builds.apache.org/job/POI/job/POI-DSL-Windows-1.14/ws/build\dist\maven\poi-ooxml>
      [jar] Building jar: <https://ci-builds.apache.org/job/POI/job/POI-DSL-Windows-1.14/ws/build\dist\maven\poi-ooxml\poi-ooxml-5.0.0-SNAPSHOT.jar>
    [javac] Compiling 269 source files to <https://ci-builds.apache.org/job/POI/job/POI-DSL-Windows-1.14/ws/build\ooxml-test-classes>
    [javac] Ignoring source, target and bootclasspath as release has been set
    [javac] Note: Some input files use or override a deprecated API.
    [javac] Note: Recompile with -Xlint:deprecation for details.
    [javac] Compiling 1 source file to <https://ci-builds.apache.org/job/POI/job/POI-DSL-Windows-1.14/ws/src\multimodule\ooxml\test9>
    [javac] <https://ci-builds.apache.org/job/POI/job/POI-DSL-Windows-1.14/ws/src\multimodule\ooxml\test9\module-info.java>:19: warning: requires transitive directive for an automatic module
    [javac]     requires transitive org.apache.poi.poi;
    [javac]                                       ^
    [javac] <https://ci-builds.apache.org/job/POI/job/POI-DSL-Windows-1.14/ws/src\multimodule\ooxml\test9\module-info.java>:20: warning: requires transitive directive for an automatic module
    [javac]     requires transitive org.apache.xmlbeans;
    [javac]                                   ^
    [javac] <https://ci-builds.apache.org/job/POI/job/POI-DSL-Windows-1.14/ws/src\multimodule\ooxml\test9\module-info.java>:21: warning: requires transitive directive for an automatic module
    [javac]     requires transitive org.apache.poi.ooxml.schemas;
    [javac]                                             ^
    [javac] 3 warnings
      [jar] Building jar: <https://ci-builds.apache.org/job/POI/job/POI-DSL-Windows-1.14/ws/build\dist\maven\poi-ooxml-tests\poi-ooxml-5.0.0-SNAPSHOT-tests.jar>
      [jar] Building jar: <https://ci-builds.apache.org/job/POI/job/POI-DSL-Windows-1.14/ws/build\dist\maven\poi-ooxml\poi-ooxml-5.0.0-SNAPSHOT-sources.jar>
      [jar] Building jar: <https://ci-builds.apache.org/job/POI/job/POI-DSL-Windows-1.14/ws/lib\ooxml-tests\ooxml-lite-agent.jar>

compile-examples:
    [javac] Compiling 136 source files to <https://ci-builds.apache.org/job/POI/job/POI-DSL-Windows-1.14/ws/build\examples-classes>
    [javac] Ignoring source, target and bootclasspath as release has been set
    [javac] Creating empty <https://ci-builds.apache.org/job/POI/job/POI-DSL-Windows-1.14/ws/build\examples-classes\org\apache\poi\examples\ss\html\package-info.class>
    [mkdir] Created dir: <https://ci-builds.apache.org/job/POI/job/POI-DSL-Windows-1.14/ws/build\dist\maven\poi-examples>
      [jar] Building jar: <https://ci-builds.apache.org/job/POI/job/POI-DSL-Windows-1.14/ws/build\dist\maven\poi-examples\poi-examples-5.0.0-SNAPSHOT.jar>
      [jar] Building jar: <https://ci-builds.apache.org/job/POI/job/POI-DSL-Windows-1.14/ws/build\dist\maven\poi-examples\poi-examples-5.0.0-SNAPSHOT-sources.jar>

compile-excelant:
    [javac] Compiling 14 source files to <https://ci-builds.apache.org/job/POI/job/POI-DSL-Windows-1.14/ws/build\excelant-classes>
    [javac] Ignoring source, target and bootclasspath as release has been set
    [mkdir] Created dir: <https://ci-builds.apache.org/job/POI/job/POI-DSL-Windows-1.14/ws/build\dist\maven\poi-excelant>
      [jar] Building jar: <https://ci-builds.apache.org/job/POI/job/POI-DSL-Windows-1.14/ws/build\dist\maven\poi-excelant\poi-excelant-5.0.0-SNAPSHOT.jar>
    [javac] Compiling 12 source files to <https://ci-builds.apache.org/job/POI/job/POI-DSL-Windows-1.14/ws/build\excelant-test-classes>
    [javac] Ignoring source, target and bootclasspath as release has been set
    [javac] Compiling 1 source file to <https://ci-builds.apache.org/job/POI/job/POI-DSL-Windows-1.14/ws/src\multimodule\excelant\test9>
      [jar] Building jar: <https://ci-builds.apache.org/job/POI/job/POI-DSL-Windows-1.14/ws/build\dist\maven\poi-excelant-tests\poi-excelant-5.0.0-SNAPSHOT-tests.jar>
      [jar] Building jar: <https://ci-builds.apache.org/job/POI/job/POI-DSL-Windows-1.14/ws/build\dist\maven\poi-excelant\poi-excelant-5.0.0-SNAPSHOT-sources.jar>

compile:

jacocotask:
     [echo] Coverage reporting: true

-test-main-check:

test-main:
    [mkdir] Created dir: <https://ci-builds.apache.org/job/POI/job/POI-DSL-Windows-1.14/ws/build\poi-ant-contrib>
    [javac] Compiling 1 source file to <https://ci-builds.apache.org/job/POI/job/POI-DSL-Windows-1.14/ws/build\poi-ant-contrib>

BUILD FAILED
<https://ci-builds.apache.org/job/POI/job/POI-DSL-Windows-1.14/ws/build.xml>:1545: The following error occurred while executing this line:
<https://ci-builds.apache.org/job/POI/job/POI-DSL-Windows-1.14/ws/build.xml>:1249: testclasses doesn't support the nested "fork" element.

Total time: 6 minutes 58 seconds
Build step 'Invoke Ant' marked build as failure
[SpotBugs] Skipping execution of recorder since overall result is 'FAILURE'
Archiving artifacts
[Fast Archiver] Compressed 3.09 MB of artifacts by 98.2% relative to #20
Skipping publisher since build result is FAILURE
Recording test results
ERROR: Step ‘Publish JUnit test result report’ failed: No test report files were found. Configuration error?

---------------------------------------------------------------------
To unsubscribe, e-mail: [hidden email]
For additional commands, e-mail: [hidden email]

Reply | Threaded
Open this post in threaded view
|

Build failed in Jenkins: POI » POI-DSL-Windows-1.14 #22

Apache Jenkins Server
See <https://ci-builds.apache.org/job/POI/job/POI-DSL-Windows-1.14/22/display/redirect?page=changes>

Changes:

[Andreas Beeker] gather necessary .xsb for ooxml-lite jar via intercepting the calls to SchemaTypeSystemImpl.XsbReader


------------------------------------------
[...truncated 89.86 KB...]
      [get] Destination already exists (skipping): <https://ci-builds.apache.org/job/POI/job/POI-DSL-Windows-1.14/ws/lib\main\commons-codec-1.15.jar>
      [get] Getting: https://repo1.maven.org/maven2/org/junit/jupiter/junit-jupiter-api/5.7.0/junit-jupiter-api-5.7.0.jar
      [get] To: <https://ci-builds.apache.org/job/POI/job/POI-DSL-Windows-1.14/ws/lib\main-tests\junit-jupiter-api-5.7.0.jar>
      [get] Getting: https://repo1.maven.org/maven2/org/junit/jupiter/junit-jupiter-engine/5.7.0/junit-jupiter-engine-5.7.0.jar
      [get] To: <https://ci-builds.apache.org/job/POI/job/POI-DSL-Windows-1.14/ws/lib\main-tests\junit-jupiter-engine-5.7.0.jar>
      [get] Getting: https://repo1.maven.org/maven2/org/junit/jupiter/junit-jupiter-params/5.7.0/junit-jupiter-params-5.7.0.jar
      [get] To: <https://ci-builds.apache.org/job/POI/job/POI-DSL-Windows-1.14/ws/lib\main-tests\junit-jupiter-params-5.7.0.jar>
      [get] Getting: https://repo1.maven.org/maven2/org/junit/platform/junit-platform-launcher/1.7.0/junit-platform-launcher-1.7.0.jar
      [get] To: <https://ci-builds.apache.org/job/POI/job/POI-DSL-Windows-1.14/ws/lib\main-tests\junit-platform-launcher-1.7.0.jar>
      [get] Getting: https://repo1.maven.org/maven2/org/junit/platform/junit-platform-engine/1.7.0/junit-platform-engine-1.7.0.jar
      [get] To: <https://ci-builds.apache.org/job/POI/job/POI-DSL-Windows-1.14/ws/lib\main-tests\junit-platform-engine-1.7.0.jar>
      [get] Getting: https://repo1.maven.org/maven2/org/junit/platform/junit-platform-commons/1.7.0/junit-platform-commons-1.7.0.jar
      [get] To: <https://ci-builds.apache.org/job/POI/job/POI-DSL-Windows-1.14/ws/lib\main-tests\junit-platform-commons-1.7.0.jar>
      [get] Getting: https://repo1.maven.org/maven2/org/opentest4j/opentest4j/1.2.0/opentest4j-1.2.0.jar
      [get] To: <https://ci-builds.apache.org/job/POI/job/POI-DSL-Windows-1.14/ws/lib\main-tests\opentest4j-1.2.0.jar>
      [get] Getting: https://repo1.maven.org/maven2/org/apiguardian/apiguardian-api/1.1.0/apiguardian-api-1.1.0.jar
      [get] To: <https://ci-builds.apache.org/job/POI/job/POI-DSL-Windows-1.14/ws/lib\main-tests\apiguardian-api-1.1.0.jar>
      [get] Destination already exists (skipping): <https://ci-builds.apache.org/job/POI/job/POI-DSL-Windows-1.14/ws/lib\main-tests\jmh-core-1.26.jar>
      [get] Destination already exists (skipping): <https://ci-builds.apache.org/job/POI/job/POI-DSL-Windows-1.14/ws/lib\main-tests\jmh-generator-annprocess-1.26.jar>
      [get] Destination already exists (skipping): <https://ci-builds.apache.org/job/POI/job/POI-DSL-Windows-1.14/ws/lib\main-tests\hamcrest-2.2.jar>
      [get] Destination already exists (skipping): <https://ci-builds.apache.org/job/POI/job/POI-DSL-Windows-1.14/ws/lib\main-tests\xmlunit-core-2.8.0.jar>
      [get] Destination already exists (skipping): <https://ci-builds.apache.org/job/POI/job/POI-DSL-Windows-1.14/ws/lib\main-tests\mockito-core-3.6.0.jar>
      [get] Destination already exists (skipping): <https://ci-builds.apache.org/job/POI/job/POI-DSL-Windows-1.14/ws/lib\main-tests\byte-buddy-1.10.18.jar>
      [get] Destination already exists (skipping): <https://ci-builds.apache.org/job/POI/job/POI-DSL-Windows-1.14/ws/lib\main-tests\byte-buddy-agent-1.10.18.jar>
      [get] Destination already exists (skipping): <https://ci-builds.apache.org/job/POI/job/POI-DSL-Windows-1.14/ws/lib\main-tests\objenesis-3.1.jar>
      [get] Destination already exists (skipping): <https://ci-builds.apache.org/job/POI/job/POI-DSL-Windows-1.14/ws/lib\excelant\ant-1.10.9.jar>
      [get] Destination already exists (skipping): <https://ci-builds.apache.org/job/POI/job/POI-DSL-Windows-1.14/ws/lib\excelant\ant-launcher-1.10.9.jar>
      [get] Destination already exists (skipping): <https://ci-builds.apache.org/job/POI/job/POI-DSL-Windows-1.14/ws/lib\main\slf4j-api-1.7.30.jar>
      [get] Destination already exists (skipping): <https://ci-builds.apache.org/job/POI/job/POI-DSL-Windows-1.14/ws/lib\main-tests\slf4j-api-1.7.30.jar>
      [get] Destination already exists (skipping): <https://ci-builds.apache.org/job/POI/job/POI-DSL-Windows-1.14/ws/lib\util\asm-9.0.jar>
      [get] Destination already exists (skipping): <https://ci-builds.apache.org/job/POI/job/POI-DSL-Windows-1.14/ws/lib\util\asm-commons-9.0.jar>
      [get] Destination already exists (skipping): <https://ci-builds.apache.org/job/POI/job/POI-DSL-Windows-1.14/ws/lib\util\asm-tree-9.0.jar>
      [get] Destination already exists (skipping): <https://ci-builds.apache.org/job/POI/job/POI-DSL-Windows-1.14/ws/lib\util\jacoco-0.8.6.zip>
      [get] Destination already exists (skipping): <https://ci-builds.apache.org/job/POI/job/POI-DSL-Windows-1.14/ws/lib\main\commons-collections4-4.4.jar>
      [get] Destination already exists (skipping): <https://ci-builds.apache.org/job/POI/job/POI-DSL-Windows-1.14/ws/lib\main\commons-math3-3.6.1.jar>
      [get] Destination already exists (skipping): <https://ci-builds.apache.org/job/POI/job/POI-DSL-Windows-1.14/ws/lib\main\SparseBitSet-1.2.jar>
    [unzip] Expanding: <https://ci-builds.apache.org/job/POI/job/POI-DSL-Windows-1.14/ws/lib\util\jacoco-0.8.6.zip> into <https://ci-builds.apache.org/job/POI/job/POI-DSL-Windows-1.14/ws/lib\util>
      [get] Destination already exists (skipping): <https://ci-builds.apache.org/job/POI/job/POI-DSL-Windows-1.14/ws/lib\util\apache-rat-0.13.jar>
      [get] Destination already exists (skipping): <https://ci-builds.apache.org/job/POI/job/POI-DSL-Windows-1.14/ws/lib\util\forbiddenapis-3.1.jar>
      [get] Destination already exists (skipping): <https://ci-builds.apache.org/job/POI/job/POI-DSL-Windows-1.14/ws/lib\ooxml-provided\bcprov-jdk15on-1.67.jar>
      [get] Destination already exists (skipping): <https://ci-builds.apache.org/job/POI/job/POI-DSL-Windows-1.14/ws/lib\ooxml-provided\bcpkix-jdk15on-1.67.jar>
      [get] Destination already exists (skipping): <https://ci-builds.apache.org/job/POI/job/POI-DSL-Windows-1.14/ws/lib\ooxml-provided\xmlsec-2.2.0.jar>

check-ooxml-jars:

fetch-ooxml-jars:
      [get] Destination already exists (skipping): <https://ci-builds.apache.org/job/POI/job/POI-DSL-Windows-1.14/ws/lib\ooxml\curvesapi-1.06.jar>
      [get] Getting: https://repo1.maven.org/maven2/org/apache/xmlbeans/xmlbeans/4.0.0/xmlbeans-4.0.0.jar
      [get] To: <https://ci-builds.apache.org/job/POI/job/POI-DSL-Windows-1.14/ws/lib\ooxml\xmlbeans-4.0.0.jar>
      [get] Destination already exists (skipping): <https://ci-builds.apache.org/job/POI/job/POI-DSL-Windows-1.14/ws/lib\ooxml\commons-compress-1.20.jar>
      [get] Destination already exists (skipping): <https://ci-builds.apache.org/job/POI/job/POI-DSL-Windows-1.14/ws/lib\ooxml-tests\reflections-0.9.12.jar>
      [get] Destination already exists (skipping): <https://ci-builds.apache.org/job/POI/job/POI-DSL-Windows-1.14/ws/lib\ooxml-tests\guava-30.0-jre.jar>
      [get] Destination already exists (skipping): <https://ci-builds.apache.org/job/POI/job/POI-DSL-Windows-1.14/ws/lib\ooxml-tests\javassist-3.27.0-GA.jar>
      [get] Destination already exists (skipping): <https://ci-builds.apache.org/job/POI/job/POI-DSL-Windows-1.14/ws/lib\ooxml-provided\batik-all-1.13.jar>
      [get] Destination already exists (skipping): <https://ci-builds.apache.org/job/POI/job/POI-DSL-Windows-1.14/ws/lib\ooxml-provided\xml-apis-ext-1.3.04.jar>
      [get] Destination already exists (skipping): <https://ci-builds.apache.org/job/POI/job/POI-DSL-Windows-1.14/ws/lib\ooxml-provided\xmlgraphics-commons-2.4.jar>
      [get] Getting: https://repo1.maven.org/maven2/org/apache/pdfbox/pdfbox/2.0.22/pdfbox-2.0.22.jar
      [get] To: <https://ci-builds.apache.org/job/POI/job/POI-DSL-Windows-1.14/ws/lib\ooxml-provided\pdfbox-2.0.22.jar>
      [get] Getting: https://repo1.maven.org/maven2/org/apache/pdfbox/fontbox/2.0.22/fontbox-2.0.22.jar
      [get] To: <https://ci-builds.apache.org/job/POI/job/POI-DSL-Windows-1.14/ws/lib\ooxml-provided\fontbox-2.0.22.jar>
      [get] Getting: https://repo1.maven.org/maven2/de/rototor/pdfbox/graphics2d/0.30/graphics2d-0.30.jar
      [get] To: <https://ci-builds.apache.org/job/POI/job/POI-DSL-Windows-1.14/ws/lib\ooxml-provided\graphics2d-0.30.jar>

init:
    [mkdir] Created dir: <https://ci-builds.apache.org/job/POI/job/POI-DSL-Windows-1.14/ws/build>
    [mkdir] Created dir: <https://ci-builds.apache.org/job/POI/job/POI-DSL-Windows-1.14/ws/build\classes>
    [mkdir] Created dir: <https://ci-builds.apache.org/job/POI/job/POI-DSL-Windows-1.14/ws/build\test-classes>
    [mkdir] Created dir: <https://ci-builds.apache.org/job/POI/job/POI-DSL-Windows-1.14/ws/build\test-results>
    [mkdir] Created dir: <https://ci-builds.apache.org/job/POI/job/POI-DSL-Windows-1.14/ws/build\scratchpad-classes>
    [mkdir] Created dir: <https://ci-builds.apache.org/job/POI/job/POI-DSL-Windows-1.14/ws/build\scratchpad-test-classes>
    [mkdir] Created dir: <https://ci-builds.apache.org/job/POI/job/POI-DSL-Windows-1.14/ws/build\scratchpad-test-results>
    [mkdir] Created dir: <https://ci-builds.apache.org/job/POI/job/POI-DSL-Windows-1.14/ws/build\geometry-java>
    [mkdir] Created dir: <https://ci-builds.apache.org/job/POI/job/POI-DSL-Windows-1.14/ws/build\ooxml-classes>
    [mkdir] Created dir: <https://ci-builds.apache.org/job/POI/job/POI-DSL-Windows-1.14/ws/build\ooxml-test-classes>
    [mkdir] Created dir: <https://ci-builds.apache.org/job/POI/job/POI-DSL-Windows-1.14/ws/build\ooxml-test-results>
    [mkdir] Created dir: <https://ci-builds.apache.org/job/POI/job/POI-DSL-Windows-1.14/ws/build\excelant-classes>
    [mkdir] Created dir: <https://ci-builds.apache.org/job/POI/job/POI-DSL-Windows-1.14/ws/build\excelant-test-classes>
    [mkdir] Created dir: <https://ci-builds.apache.org/job/POI/job/POI-DSL-Windows-1.14/ws/build\excelant-test-results>
    [mkdir] Created dir: <https://ci-builds.apache.org/job/POI/job/POI-DSL-Windows-1.14/ws/build\examples-classes>
    [mkdir] Created dir: <https://ci-builds.apache.org/job/POI/job/POI-DSL-Windows-1.14/ws/build\integration-test-classes>
    [mkdir] Created dir: <https://ci-builds.apache.org/job/POI/job/POI-DSL-Windows-1.14/ws/build\integration-test-results>
    [mkdir] Created dir: <https://ci-builds.apache.org/job/POI/job/POI-DSL-Windows-1.14/ws/build\dist>
    [mkdir] Created dir: <https://ci-builds.apache.org/job/POI/job/POI-DSL-Windows-1.14/ws/build\site>
     [echo] Using Ant: Apache Ant(TM) version 1.10.5 compiled on July 10 2018 from F:\\jenkins\\tools\\ant\\latest1.10, Ant detected Java 14 (may be different than actual Java sometimes...)
     [echo] Using Java: 14-ea/14-ea+6-171/14-ea+6-171/OpenJDK 64-Bit Server VM from Oracle Corporation on Windows Server 2016: 10.0
     [echo] Building Apache POI version 5.0.0-SNAPSHOT and RC: RC1

-version-java-check:

compile-version:
     [copy] Copying 1 file to <https://ci-builds.apache.org/job/POI/job/POI-DSL-Windows-1.14/ws/build\classes\org\apache\poi>
    [javac] Compiling 1 source file to <https://ci-builds.apache.org/job/POI/job/POI-DSL-Windows-1.14/ws/build\classes>
    [javac] warning: [options] bootstrap class path not set in conjunction with -source 8
    [javac] 1 warning
   [delete] Deleting: <https://ci-builds.apache.org/job/POI/job/POI-DSL-Windows-1.14/ws/build\classes\org\apache\poi\Version.java>

compile-main:
    [javac] Compiling 1177 source files to <https://ci-builds.apache.org/job/POI/job/POI-DSL-Windows-1.14/ws/build\classes>
    [javac] Ignoring source, target and bootclasspath as release has been set
    [javac] Note: Some input files use or override a deprecated API.
    [javac] Note: Recompile with -Xlint:deprecation for details.
    [javac] Note: Some input files use unchecked or unsafe operations.
    [javac] Note: Recompile with -Xlint:unchecked for details.
    [javac] Creating empty <https://ci-builds.apache.org/job/POI/job/POI-DSL-Windows-1.14/ws/build\classes\org\apache\poi\ddf\package-info.class>
    [javac] Creating empty <https://ci-builds.apache.org/job/POI/job/POI-DSL-Windows-1.14/ws/build\classes\org\apache\poi\hssf\package-info.class>
    [javac] Creating empty <https://ci-builds.apache.org/job/POI/job/POI-DSL-Windows-1.14/ws/build\classes\org\apache\poi\poifs\dev\package-info.class>
    [javac] Creating empty <https://ci-builds.apache.org/job/POI/job/POI-DSL-Windows-1.14/ws/build\classes\org\apache\poi\util\package-info.class>
    [javac] Creating empty <https://ci-builds.apache.org/job/POI/job/POI-DSL-Windows-1.14/ws/build\classes\org\apache\poi\poifs\common\package-info.class>
    [javac] Creating empty <https://ci-builds.apache.org/job/POI/job/POI-DSL-Windows-1.14/ws/build\classes\org\apache\poi\hssf\record\package-info.class>
    [javac] Creating empty <https://ci-builds.apache.org/job/POI/job/POI-DSL-Windows-1.14/ws/build\classes\org\apache\poi\poifs\package-info.class>
    [javac] Creating empty <https://ci-builds.apache.org/job/POI/job/POI-DSL-Windows-1.14/ws/build\classes\org\apache\poi\poifs\crypt\package-info.class>
    [javac] Creating empty <https://ci-builds.apache.org/job/POI/job/POI-DSL-Windows-1.14/ws/build\classes\org\apache\poi\hpsf\wellknown\package-info.class>
    [javac] Creating empty <https://ci-builds.apache.org/job/POI/job/POI-DSL-Windows-1.14/ws/build\classes\org\apache\poi\hssf\dev\package-info.class>
    [javac] Creating empty <https://ci-builds.apache.org/job/POI/job/POI-DSL-Windows-1.14/ws/build\classes\org\apache\poi\ss\formula\package-info.class>
    [javac] Creating empty <https://ci-builds.apache.org/job/POI/job/POI-DSL-Windows-1.14/ws/build\classes\org\apache\poi\hpsf\package-info.class>
    [javac] Creating empty <https://ci-builds.apache.org/job/POI/job/POI-DSL-Windows-1.14/ws/build\classes\org\apache\poi\poifs\property\package-info.class>
    [javac] Creating empty <https://ci-builds.apache.org/job/POI/job/POI-DSL-Windows-1.14/ws/build\classes\org\apache\poi\poifs\filesystem\package-info.class>
    [javac] Creating empty <https://ci-builds.apache.org/job/POI/job/POI-DSL-Windows-1.14/ws/build\classes\org\apache\poi\ss\formula\ptg\package-info.class>
    [javac] Creating empty <https://ci-builds.apache.org/job/POI/job/POI-DSL-Windows-1.14/ws/build\classes\org\apache\poi\poifs\storage\package-info.class>
    [javac] Creating empty <https://ci-builds.apache.org/job/POI/job/POI-DSL-Windows-1.14/ws/build\classes\org\apache\poi\hssf\eventusermodel\package-info.class>
    [javac] Creating empty <https://ci-builds.apache.org/job/POI/job/POI-DSL-Windows-1.14/ws/build\classes\org\apache\poi\hssf\record\aggregates\package-info.class>
    [javac] Creating empty <https://ci-builds.apache.org/job/POI/job/POI-DSL-Windows-1.14/ws/build\classes\org\apache\poi\ss\format\package-info.class>
    [javac] Creating empty <https://ci-builds.apache.org/job/POI/job/POI-DSL-Windows-1.14/ws/build\classes\org\apache\poi\hssf\model\package-info.class>
    [javac] Creating empty <https://ci-builds.apache.org/job/POI/job/POI-DSL-Windows-1.14/ws/build\classes\org\apache\poi\hssf\usermodel\package-info.class>
    [javac] Creating empty <https://ci-builds.apache.org/job/POI/job/POI-DSL-Windows-1.14/ws/build\classes\org\apache\poi\hssf\util\package-info.class>
    [javac] Creating empty <https://ci-builds.apache.org/job/POI/job/POI-DSL-Windows-1.14/ws/build\classes\org\apache\poi\poifs\eventfilesystem\package-info.class>
    [mkdir] Created dir: <https://ci-builds.apache.org/job/POI/job/POI-DSL-Windows-1.14/ws/build\dist\maven\poi>
      [jar] Building jar: <https://ci-builds.apache.org/job/POI/job/POI-DSL-Windows-1.14/ws/build\dist\maven\poi\poi-5.0.0-SNAPSHOT.jar>
    [javac] Compiling 523 source files to <https://ci-builds.apache.org/job/POI/job/POI-DSL-Windows-1.14/ws/build\test-classes>
    [javac] Ignoring source, target and bootclasspath as release has been set
    [javac] Note: Some input files use or override a deprecated API.
    [javac] Note: Recompile with -Xlint:deprecation for details.
    [javac] Note: <https://ci-builds.apache.org/job/POI/job/POI-DSL-Windows-1.14/ws/src\testcases\org\apache\poi\sl\usermodel\BaseTestSlideShow.java> uses unchecked or unsafe operations.
    [javac] Note: Recompile with -Xlint:unchecked for details.
    [javac] Compiling 1 source file to <https://ci-builds.apache.org/job/POI/job/POI-DSL-Windows-1.14/ws/src\multimodule\poi\test9>
      [jar] Building jar: <https://ci-builds.apache.org/job/POI/job/POI-DSL-Windows-1.14/ws/build\dist\maven\poi-tests\poi-5.0.0-SNAPSHOT-tests.jar>
      [jar] Building jar: <https://ci-builds.apache.org/job/POI/job/POI-DSL-Windows-1.14/ws/build\dist\maven\poi\poi-5.0.0-SNAPSHOT-sources.jar>

compile-scratchpad:
    [javac] Compiling 515 source files to <https://ci-builds.apache.org/job/POI/job/POI-DSL-Windows-1.14/ws/build\scratchpad-classes>
    [javac] Ignoring source, target and bootclasspath as release has been set
    [javac] Note: Some input files use or override a deprecated API.
    [javac] Note: Recompile with -Xlint:deprecation for details.
    [javac] Note: Some input files use unchecked or unsafe operations.
    [javac] Note: Recompile with -Xlint:unchecked for details.
    [mkdir] Created dir: <https://ci-builds.apache.org/job/POI/job/POI-DSL-Windows-1.14/ws/build\dist\maven\poi-scratchpad>
      [jar] Building jar: <https://ci-builds.apache.org/job/POI/job/POI-DSL-Windows-1.14/ws/build\dist\maven\poi-scratchpad\poi-scratchpad-5.0.0-SNAPSHOT.jar>
    [javac] Compiling 197 source files to <https://ci-builds.apache.org/job/POI/job/POI-DSL-Windows-1.14/ws/build\scratchpad-test-classes>
    [javac] Ignoring source, target and bootclasspath as release has been set
    [javac] Note: Some input files use or override a deprecated API.
    [javac] Note: Recompile with -Xlint:deprecation for details.
    [javac] Compiling 1 source file to <https://ci-builds.apache.org/job/POI/job/POI-DSL-Windows-1.14/ws/src\multimodule\scratchpad\test9>
    [javac] <https://ci-builds.apache.org/job/POI/job/POI-DSL-Windows-1.14/ws/src\multimodule\scratchpad\test9\module-info.java>:19: warning: requires transitive directive for an automatic module
    [javac]     requires transitive org.apache.poi.poi;
    [javac]                                       ^
    [javac] 1 warning
      [jar] Building jar: <https://ci-builds.apache.org/job/POI/job/POI-DSL-Windows-1.14/ws/build\dist\maven\poi-scratchpad-tests\poi-scratchpad-5.0.0-SNAPSHOT-tests.jar>
      [jar] Building jar: <https://ci-builds.apache.org/job/POI/job/POI-DSL-Windows-1.14/ws/build\dist\maven\poi-scratchpad\poi-scratchpad-5.0.0-SNAPSHOT-sources.jar>

check-compiled-ooxml-xsds:

compile-ooxml-xsds:
    [mkdir] Created dir: <https://ci-builds.apache.org/job/POI/job/POI-DSL-Windows-1.14/ws/build\xmlbean-xsds>
     [copy] Copying 8 files to <https://ci-builds.apache.org/job/POI/job/POI-DSL-Windows-1.14/ws/build\xmlbean-xsds>
     [copy] Copying 28 resources to <https://ci-builds.apache.org/job/POI/job/POI-DSL-Windows-1.14/ws/build\xmlbean-xsds>
    [mkdir] Created dir: <https://ci-builds.apache.org/job/POI/job/POI-DSL-Windows-1.14/ws/build\xmlbean-sources>
    [mkdir] Created dir: <https://ci-builds.apache.org/job/POI/job/POI-DSL-Windows-1.14/ws/build\xmlbean-classes>
  [xmlbean] SchemaCompiler  Metadata LOAD:org/apache/xmlbeans/metadata GEN:org/apache/poi/schemas/ooxml
  [xmlbean] Time to build schema type system: 2.847 seconds
  [xmlbean] Time to generate code: 35.903 seconds
    [javac] Compiling 5064 source files to <https://ci-builds.apache.org/job/POI/job/POI-DSL-Windows-1.14/ws/build\xmlbean-classes>
    [javac] Ignoring source, target and bootclasspath as release has been set
    [mkdir] Created dir: <https://ci-builds.apache.org/job/POI/job/POI-DSL-Windows-1.14/ws/build\dist\maven\poi-ooxml-full>
      [jar] Building jar: <https://ci-builds.apache.org/job/POI/job/POI-DSL-Windows-1.14/ws/build\dist\maven\poi-ooxml-full\poi-ooxml-full-5.0.0-SNAPSHOT.jar>
      [jar] Building jar: <https://ci-builds.apache.org/job/POI/job/POI-DSL-Windows-1.14/ws/build\dist\maven\poi-ooxml-full\poi-ooxml-full-5.0.0-SNAPSHOT-sources.jar>

compile-ooxml:
    [javac] Compiling 619 source files to <https://ci-builds.apache.org/job/POI/job/POI-DSL-Windows-1.14/ws/build\ooxml-classes>
    [javac] Ignoring source, target and bootclasspath as release has been set
    [javac] Note: Some input files use or override a deprecated API.
    [javac] Note: Recompile with -Xlint:deprecation for details.
    [javac] Note: <https://ci-builds.apache.org/job/POI/job/POI-DSL-Windows-1.14/ws/src\ooxml\java\org\apache\poi\xslf\draw\SVGImageRenderer.java> uses unchecked or unsafe operations.
    [javac] Note: Recompile with -Xlint:unchecked for details.
    [javac] Creating empty <https://ci-builds.apache.org/job/POI/job/POI-DSL-Windows-1.14/ws/build\ooxml-classes\org\apache\poi\xwpf\package-info.class>
    [javac] Creating empty <https://ci-builds.apache.org/job/POI/job/POI-DSL-Windows-1.14/ws/build\ooxml-classes\org\apache\poi\xssf\binary\package-info.class>
    [mkdir] Created dir: <https://ci-builds.apache.org/job/POI/job/POI-DSL-Windows-1.14/ws/build\dist\maven\poi-ooxml>
      [jar] Building jar: <https://ci-builds.apache.org/job/POI/job/POI-DSL-Windows-1.14/ws/build\dist\maven\poi-ooxml\poi-ooxml-5.0.0-SNAPSHOT.jar>
    [javac] Compiling 269 source files to <https://ci-builds.apache.org/job/POI/job/POI-DSL-Windows-1.14/ws/build\ooxml-test-classes>
    [javac] Ignoring source, target and bootclasspath as release has been set
    [javac] Note: Some input files use or override a deprecated API.
    [javac] Note: Recompile with -Xlint:deprecation for details.
    [javac] Compiling 1 source file to <https://ci-builds.apache.org/job/POI/job/POI-DSL-Windows-1.14/ws/src\multimodule\ooxml\test9>
    [javac] <https://ci-builds.apache.org/job/POI/job/POI-DSL-Windows-1.14/ws/src\multimodule\ooxml\test9\module-info.java>:19: warning: requires transitive directive for an automatic module
    [javac]     requires transitive org.apache.poi.poi;
    [javac]                                       ^
    [javac] <https://ci-builds.apache.org/job/POI/job/POI-DSL-Windows-1.14/ws/src\multimodule\ooxml\test9\module-info.java>:20: warning: requires transitive directive for an automatic module
    [javac]     requires transitive org.apache.xmlbeans;
    [javac]                                   ^
    [javac] <https://ci-builds.apache.org/job/POI/job/POI-DSL-Windows-1.14/ws/src\multimodule\ooxml\test9\module-info.java>:21: warning: requires transitive directive for an automatic module
    [javac]     requires transitive org.apache.poi.ooxml.schemas;
    [javac]                                             ^
    [javac] 3 warnings
      [jar] Building jar: <https://ci-builds.apache.org/job/POI/job/POI-DSL-Windows-1.14/ws/build\dist\maven\poi-ooxml-tests\poi-ooxml-5.0.0-SNAPSHOT-tests.jar>
      [jar] Building jar: <https://ci-builds.apache.org/job/POI/job/POI-DSL-Windows-1.14/ws/build\dist\maven\poi-ooxml\poi-ooxml-5.0.0-SNAPSHOT-sources.jar>
    [javac] Compiling 1 source file to <https://ci-builds.apache.org/job/POI/job/POI-DSL-Windows-1.14/ws/src\multimodule\ooxml-lite-agent\java9>
      [jar] Building jar: <https://ci-builds.apache.org/job/POI/job/POI-DSL-Windows-1.14/ws/lib\ooxml-tests\ooxml-lite-agent.jar>

compile-examples:
    [javac] Compiling 136 source files to <https://ci-builds.apache.org/job/POI/job/POI-DSL-Windows-1.14/ws/build\examples-classes>
    [javac] Ignoring source, target and bootclasspath as release has been set
    [javac] Creating empty <https://ci-builds.apache.org/job/POI/job/POI-DSL-Windows-1.14/ws/build\examples-classes\org\apache\poi\examples\ss\html\package-info.class>
    [mkdir] Created dir: <https://ci-builds.apache.org/job/POI/job/POI-DSL-Windows-1.14/ws/build\dist\maven\poi-examples>
      [jar] Building jar: <https://ci-builds.apache.org/job/POI/job/POI-DSL-Windows-1.14/ws/build\dist\maven\poi-examples\poi-examples-5.0.0-SNAPSHOT.jar>
      [jar] Building jar: <https://ci-builds.apache.org/job/POI/job/POI-DSL-Windows-1.14/ws/build\dist\maven\poi-examples\poi-examples-5.0.0-SNAPSHOT-sources.jar>

compile-excelant:
    [javac] Compiling 14 source files to <https://ci-builds.apache.org/job/POI/job/POI-DSL-Windows-1.14/ws/build\excelant-classes>
    [javac] Ignoring source, target and bootclasspath as release has been set
    [mkdir] Created dir: <https://ci-builds.apache.org/job/POI/job/POI-DSL-Windows-1.14/ws/build\dist\maven\poi-excelant>
      [jar] Building jar: <https://ci-builds.apache.org/job/POI/job/POI-DSL-Windows-1.14/ws/build\dist\maven\poi-excelant\poi-excelant-5.0.0-SNAPSHOT.jar>
    [javac] Compiling 12 source files to <https://ci-builds.apache.org/job/POI/job/POI-DSL-Windows-1.14/ws/build\excelant-test-classes>
    [javac] Ignoring source, target and bootclasspath as release has been set
    [javac] Compiling 1 source file to <https://ci-builds.apache.org/job/POI/job/POI-DSL-Windows-1.14/ws/src\multimodule\excelant\test9>
      [jar] Building jar: <https://ci-builds.apache.org/job/POI/job/POI-DSL-Windows-1.14/ws/build\dist\maven\poi-excelant-tests\poi-excelant-5.0.0-SNAPSHOT-tests.jar>
      [jar] Building jar: <https://ci-builds.apache.org/job/POI/job/POI-DSL-Windows-1.14/ws/build\dist\maven\poi-excelant\poi-excelant-5.0.0-SNAPSHOT-sources.jar>

compile:

jacocotask:
     [echo] Coverage reporting: true

-test-main-check:

test-main:
    [mkdir] Created dir: <https://ci-builds.apache.org/job/POI/job/POI-DSL-Windows-1.14/ws/build\poi-ant-contrib>
    [javac] Compiling 1 source file to <https://ci-builds.apache.org/job/POI/job/POI-DSL-Windows-1.14/ws/build\poi-ant-contrib>

BUILD FAILED
<https://ci-builds.apache.org/job/POI/job/POI-DSL-Windows-1.14/ws/build.xml>:1547: The following error occurred while executing this line:
<https://ci-builds.apache.org/job/POI/job/POI-DSL-Windows-1.14/ws/build.xml>:1251: testclasses doesn't support the nested "fork" element.

Total time: 7 minutes 6 seconds
Build step 'Invoke Ant' marked build as failure
[SpotBugs] Skipping execution of recorder since overall result is 'FAILURE'
Archiving artifacts
[Fast Archiver] Compressed 3.09 MB of artifacts by 98.2% relative to #20
[WARNINGS] Skipping publisher since build result is FAILURE
Recording test results
ERROR: Step ‘Publish JUnit test result report’ failed: No test report files were found. Configuration error?

---------------------------------------------------------------------
To unsubscribe, e-mail: [hidden email]
For additional commands, e-mail: [hidden email]

Reply | Threaded
Open this post in threaded view
|

Build failed in Jenkins: POI » POI-DSL-Windows-1.14 #23

Apache Jenkins Server
See <https://ci-builds.apache.org/job/POI/job/POI-DSL-Windows-1.14/23/display/redirect?page=changes>

Changes:

[Dominik Stadler] Adjust error-message on old files and simplify code slightly

[Dominik Stadler] Slightly re-arrange code to only perform computations if we do not exit the loop anyway

Also simplify code somewhat

[Dominik Stadler] Bug 65009: Fix incorrect index for 1-based pictures

Adjusted somewhat from Github PR #211

Closes #211

[Dominik Stadler] Add missing jar-file for JavaDoc generation

[Dominik Stadler] Adjust some JavaDoc

[Dominik Stadler] Improve the speed of the styles-optimiser when there are many styles in a Workbook

Profiling showed that the call to isUserDefined() took most of the time,
so we now fetch this only once for each style and remember the result and
use it in the inner loop.

The attached sample-file took aprox. 1m30s on a decent machine, now it is down
to around 2s.

[Andreas Beeker] bump versions

[Andreas Beeker] sonar fixes

[Andreas Beeker] github-207 - replace commons logging with slf4j - use jcl-over-slf4j

[Andreas Beeker] sonarcloud.io phases out support for Java 8


------------------------------------------
[...truncated 885.96 KB...]
  [javadoc]     public static int parsePercent(org.openxmlformats.schemas.wordprocessingml.x2006.main.STDecimalNumberOrPercent pctUnion) {
  [javadoc]                       ^
  [javadoc] <https://ci-builds.apache.org/job/POI/job/POI-DSL-Windows-1.14/ws/src\ooxml\java\org\apache\poi\ooxml\util\POIXMLUnits.java>:103: error: self-closing element not allowed
  [javadoc]      * This type seems to be interpreted as percent value when the trailing percent sign is missing.<br/>
  [javadoc]                                                                                                     ^
  [javadoc] <https://ci-builds.apache.org/job/POI/job/POI-DSL-Windows-1.14/ws/src\ooxml\java\org\apache\poi\ooxml\util\POIXMLUnits.java>:107: error: tag not allowed here: <pre>
  [javadoc]      * <pre>
  [javadoc]        ^
  [javadoc] <https://ci-builds.apache.org/job/POI/job/POI-DSL-Windows-1.14/ws/src\ooxml\java\org\apache\poi\ooxml\util\POIXMLUnits.java>:107: error: element not closed: pre
  [javadoc]      * <pre>
  [javadoc]        ^
  [javadoc] <https://ci-builds.apache.org/job/POI/job/POI-DSL-Windows-1.14/ws/src\ooxml\java\org\apache\poi\ooxml\util\POIXMLUnits.java>:105: error: element not closed: pre
  [javadoc]      * <pre>
  [javadoc]        ^
  [javadoc] <https://ci-builds.apache.org/job/POI/job/POI-DSL-Windows-1.14/ws/src\ooxml\java\org\apache\poi\ooxml\util\POIXMLUnits.java>:111: warning: no @param for pctUnion
  [javadoc]     public static int parsePercent(org.openxmlformats.schemas.wordprocessingml.x2006.main.STTextScale pctUnion) {
  [javadoc]                       ^
  [javadoc] <https://ci-builds.apache.org/job/POI/job/POI-DSL-Windows-1.14/ws/src\ooxml\java\org\apache\poi\ooxml\util\POIXMLUnits.java>:151: warning: no @param for coordUnion
  [javadoc]     public static long parseLength(org.openxmlformats.schemas.drawingml.x2006.main.STCoordinate32 coordUnion) {
  [javadoc]                        ^
  [javadoc] <https://ci-builds.apache.org/job/POI/job/POI-DSL-Windows-1.14/ws/src\ooxml\java\org\apache\poi\ooxml\util\POIXMLUnits.java>:161: warning: no @param for coordUnion
  [javadoc]     public static long parseLength(org.openxmlformats.schemas.drawingml.x2006.main.STCoordinate coordUnion) {
  [javadoc]                        ^
  [javadoc] <https://ci-builds.apache.org/job/POI/job/POI-DSL-Windows-1.14/ws/src\ooxml\java\org\apache\poi\ooxml\util\POIXMLUnits.java>:171: warning: no @param for coordUnion
  [javadoc]     public static long parseLength(org.openxmlformats.schemas.drawingml.x2006.main.STTextPoint coordUnion) {
  [javadoc]                        ^
  [javadoc] <https://ci-builds.apache.org/job/POI/job/POI-DSL-Windows-1.14/ws/src\ooxml\java\org\apache\poi\ooxml\util\POIXMLUnits.java>:180: warning: no @param for coordUnion
  [javadoc]     public static long parseLength(org.openxmlformats.schemas.officeDocument.x2006.sharedTypes.STTwipsMeasure coordUnion) {
  [javadoc]                        ^
  [javadoc] <https://ci-builds.apache.org/job/POI/job/POI-DSL-Windows-1.14/ws/src\ooxml\java\org\apache\poi\ooxml\util\POIXMLUnits.java>:189: warning: no @param for coordUnion
  [javadoc]     public static long parseLength(org.openxmlformats.schemas.wordprocessingml.x2006.main.STSignedTwipsMeasure coordUnion) {
  [javadoc]                        ^
  [javadoc] <https://ci-builds.apache.org/job/POI/job/POI-DSL-Windows-1.14/ws/src\ooxml\java\org\apache\poi\ooxml\util\POIXMLUnits.java>:198: warning: no @param for coordUnion
  [javadoc]     public static long parseLength(org.openxmlformats.schemas.wordprocessingml.x2006.main.STHpsMeasure coordUnion) {
  [javadoc]                        ^
  [javadoc] <https://ci-builds.apache.org/job/POI/job/POI-DSL-Windows-1.14/ws/src\ooxml\java\org\apache\poi\ooxml\util\POIXMLUnits.java>:208: warning: no @param for coordUnion
  [javadoc]     public static long parseLength(org.openxmlformats.schemas.wordprocessingml.x2006.main.STSignedHpsMeasure coordUnion) {
  [javadoc]                        ^
  [javadoc] <https://ci-builds.apache.org/job/POI/job/POI-DSL-Windows-1.14/ws/src\ooxml\java\org\apache\poi\ooxml\util\POIXMLUnits.java>:218: warning: no @param for coordUnion
  [javadoc]     public static long parseLength(org.openxmlformats.schemas.wordprocessingml.x2006.main.STMeasurementOrPercent coordUnion) {
  [javadoc]                        ^
  [javadoc] <https://ci-builds.apache.org/job/POI/job/POI-DSL-Windows-1.14/ws/src\ooxml\java\org\apache\poi\ooxml\util\SAXHelper.java>:38: warning: no @return
  [javadoc]     public static XMLReader newXMLReader() throws SAXException, ParserConfigurationException {
  [javadoc]                             ^
  [javadoc] <https://ci-builds.apache.org/job/POI/job/POI-DSL-Windows-1.14/ws/src\ooxml\java\org\apache\poi\ooxml\util\SAXHelper.java>:38: warning: no @throws for org.xml.sax.SAXException
  [javadoc]     public static XMLReader newXMLReader() throws SAXException, ParserConfigurationException {
  [javadoc]                             ^
  [javadoc] <https://ci-builds.apache.org/job/POI/job/POI-DSL-Windows-1.14/ws/src\ooxml\java\org\apache\poi\ooxml\util\SAXHelper.java>:38: warning: no @throws for javax.xml.parsers.ParserConfigurationException
  [javadoc]     public static XMLReader newXMLReader() throws SAXException, ParserConfigurationException {
  [javadoc]                             ^
  [javadoc] <https://ci-builds.apache.org/job/POI/job/POI-DSL-Windows-1.14/ws/src\ooxml\java\org\apache\poi\ooxml\util\XPathHelper.java>:76: error: reference not found
  [javadoc]      * The {@link #selectProperty(Class, String)} xquery method has some performance penalties,
  [javadoc]                   ^
  [javadoc] <https://ci-builds.apache.org/job/POI/job/POI-DSL-Windows-1.14/ws/src\ooxml\java\org\apache\poi\openxml4j\opc\RelationshipSource.java>:60: error: exception not thrown: org.apache.poi.openxml4j.exceptions.InvalidFormatException
  [javadoc] * @throws InvalidFormatException
  [javadoc]           ^
  [javadoc] <https://ci-builds.apache.org/job/POI/job/POI-DSL-Windows-1.14/ws/src\ooxml\java\org\apache\poi\openxml4j\opc\OPCPackage.java>:1599: error: unexpected end tag: </p>
  [javadoc]      * </p>
  [javadoc]        ^
  [javadoc] <https://ci-builds.apache.org/job/POI/job/POI-DSL-Windows-1.14/ws/src\ooxml\java\org\apache\poi\openxml4j\opc\PackagePartName.java>:418: error: bad use of '>'
  [javadoc] * returns an empty String. Example : '/document/content.xml' => 'xml'
  [javadoc]                                                               ^
  [javadoc] <https://ci-builds.apache.org/job/POI/job/POI-DSL-Windows-1.14/ws/src\ooxml\java\org\apache\poi\openxml4j\opc\PackagingURIHelper.java>:265: error: bad use of '>'
  [javadoc]      *         '/word/document.xml' => 'media/image1.gif') else
  [javadoc]                                      ^
  [javadoc] <https://ci-builds.apache.org/job/POI/job/POI-DSL-Windows-1.14/ws/src\ooxml\java\org\apache\poi\openxml4j\opc\PackagingURIHelper.java>:393: error: bad use of '>'
  [javadoc]      *         '/word/document.xml' => 'media/image1.gif') else
  [javadoc]                                      ^
  [javadoc] <https://ci-builds.apache.org/job/POI/job/POI-DSL-Windows-1.14/ws/src\ooxml\java\org\apache\poi\openxml4j\opc\PackagingURIHelper.java>:623: error: bad use of '>'
  [javadoc]      * /word/document.xml -> /word/_rels/document.xml.rels)
  [javadoc]                            ^
  [javadoc] <https://ci-builds.apache.org/job/POI/job/POI-DSL-Windows-1.14/ws/src\ooxml\java\org\apache\poi\openxml4j\opc\PackagingURIHelper.java>:732: error: bad use of '>'
  [javadoc]      *   'Apache POI' --> 'Apache%20POI'
  [javadoc]                         ^
  [javadoc] <https://ci-builds.apache.org/job/POI/job/POI-DSL-Windows-1.14/ws/src\ooxml\java\org\apache\poi\openxml4j\opc\PackagingURIHelper.java>:733: error: bad use of '>'
  [javadoc]      *   'Apache\u0410POI' --> 'Apache%04%10POI'
  [javadoc]                              ^
  [javadoc] <https://ci-builds.apache.org/job/POI/job/POI-DSL-Windows-1.14/ws/src\ooxml\java\org\apache\poi\openxml4j\opc\internal\ContentTypeManager.java>:117: error: bad use of '>'
  [javadoc]      * Build association extention-> content type (will be stored in
  [javadoc]                                    ^
  [javadoc] <https://ci-builds.apache.org/job/POI/job/POI-DSL-Windows-1.14/ws/src\ooxml\java\org\apache\poi\openxml4j\opc\internal\unmarshallers\PackagePropertiesUnmarshaller.java>:223: error: malformed HTML
  [javadoc] * the schema: <dcterms:created> and <dcterms:modified> Consumers shall
  [javadoc]               ^
  [javadoc] <https://ci-builds.apache.org/job/POI/job/POI-DSL-Windows-1.14/ws/src\ooxml\java\org\apache\poi\openxml4j\opc\internal\unmarshallers\PackagePropertiesUnmarshaller.java>:223: error: bad use of '>'
  [javadoc] * the schema: <dcterms:created> and <dcterms:modified> Consumers shall
  [javadoc]                               ^
  [javadoc] <https://ci-builds.apache.org/job/POI/job/POI-DSL-Windows-1.14/ws/src\ooxml\java\org\apache\poi\openxml4j\opc\internal\unmarshallers\PackagePropertiesUnmarshaller.java>:223: error: malformed HTML
  [javadoc] * the schema: <dcterms:created> and <dcterms:modified> Consumers shall
  [javadoc]                                     ^
  [javadoc] <https://ci-builds.apache.org/job/POI/job/POI-DSL-Windows-1.14/ws/src\ooxml\java\org\apache\poi\openxml4j\opc\internal\unmarshallers\PackagePropertiesUnmarshaller.java>:223: error: bad use of '>'
  [javadoc] * the schema: <dcterms:created> and <dcterms:modified> Consumers shall
  [javadoc]                                                      ^
  [javadoc] <https://ci-builds.apache.org/job/POI/job/POI-DSL-Windows-1.14/ws/src\ooxml\java\org\apache\poi\openxml4j\opc\internal\unmarshallers\PackagePropertiesUnmarshaller.java>:231: error: malformed HTML
  [javadoc] * the xsi:type attribute, except for a <dcterms:created> or
  [javadoc]                                        ^
  [javadoc] <https://ci-builds.apache.org/job/POI/job/POI-DSL-Windows-1.14/ws/src\ooxml\java\org\apache\poi\openxml4j\opc\internal\unmarshallers\PackagePropertiesUnmarshaller.java>:231: error: bad use of '>'
  [javadoc] * the xsi:type attribute, except for a <dcterms:created> or
  [javadoc]                                                        ^
  [javadoc] <https://ci-builds.apache.org/job/POI/job/POI-DSL-Windows-1.14/ws/src\ooxml\java\org\apache\poi\openxml4j\opc\internal\unmarshallers\PackagePropertiesUnmarshaller.java>:232: error: malformed HTML
  [javadoc] * <dcterms:modified> element where the xsi:type attribute shall be present
  [javadoc]   ^
  [javadoc] <https://ci-builds.apache.org/job/POI/job/POI-DSL-Windows-1.14/ws/src\ooxml\java\org\apache\poi\openxml4j\opc\internal\unmarshallers\PackagePropertiesUnmarshaller.java>:232: error: bad use of '>'
  [javadoc] * <dcterms:modified> element where the xsi:type attribute shall be present
  [javadoc]                    ^
  [javadoc] <https://ci-builds.apache.org/job/POI/job/POI-DSL-Windows-1.14/ws/src\ooxml\java\org\apache\poi\xslf\usermodel\XSLFSheet.java>:348: error: tag not supported in the generated HTML version: tt
  [javadoc]      * @return <tt>true</tt> if this sheet contained the specified element
  [javadoc]                ^
  [javadoc] <https://ci-builds.apache.org/job/POI/job/POI-DSL-Windows-1.14/ws/src\ooxml\java\org\apache\poi\xssf\eventusermodel\XSSFReader.java>:291: error: tag not supported in the generated HTML version: tt
  [javadoc]          * Returns <tt>true</tt> if the iteration has more elements.
  [javadoc]                    ^
  [javadoc] 100 errors
  [javadoc] 100 warnings
      [jar] Building jar: <https://ci-builds.apache.org/job/POI/job/POI-DSL-Windows-1.14/ws/build\dist\maven\poi-ooxml\poi-ooxml-5.0.0-SNAPSHOT-javadoc.jar>

assemble:
      [zip] Building zip: <https://ci-builds.apache.org/job/POI/job/POI-DSL-Windows-1.14/ws/build\dist\poi-bin-5.0.0-SNAPSHOT-20201230.zip>
      [tar] Building tar: <https://ci-builds.apache.org/job/POI/job/POI-DSL-Windows-1.14/ws/build\dist\poi-bin-5.0.0-SNAPSHOT-20201230.tar.gz>
      [zip] Building zip: <https://ci-builds.apache.org/job/POI/job/POI-DSL-Windows-1.14/ws/build\dist\poi-src-5.0.0-SNAPSHOT-20201230.zip>
      [tar] Building tar: <https://ci-builds.apache.org/job/POI/job/POI-DSL-Windows-1.14/ws/build\dist\poi-src-5.0.0-SNAPSHOT-20201230.tar.gz>
     [echo] Creating Maven POMs

maven-poms:
     [copy] Copying 7 files to <https://ci-builds.apache.org/job/POI/job/POI-DSL-Windows-1.14/ws/build\dist\maven>
     [echo] Maven POMs are located in <https://ci-builds.apache.org/job/POI/job/POI-DSL-Windows-1.14/ws/build\dist>
     [echo] Use ant dist-nexus to deploy the artifacts in the remote repository
     [echo] Distribution located in <https://ci-builds.apache.org/job/POI/job/POI-DSL-Windows-1.14/ws/build\dist>
     [echo] Use "ant dist-checksum" to create sha256/sha512 checksums and GPG signatures

findbugs:
    [mkdir] Created dir: <https://ci-builds.apache.org/job/POI/job/POI-DSL-Windows-1.14/ws/build\findbugs\lib\config>
      [get] Getting: https://repo1.maven.org/maven2/com/github/spotbugs/spotbugs/4.2.0/spotbugs-4.2.0.jar
      [get] To: <https://ci-builds.apache.org/job/POI/job/POI-DSL-Windows-1.14/ws/build\findbugs\lib\spotbugs.jar>
      [get] Getting: https://repo1.maven.org/maven2/com/github/spotbugs/spotbugs-ant/4.2.0/spotbugs-ant-4.2.0.jar
      [get] To: <https://ci-builds.apache.org/job/POI/job/POI-DSL-Windows-1.14/ws/build\findbugs\lib\spotbugs-ant.jar>
      [get] Getting: https://repo1.maven.org/maven2/com/github/spotbugs/spotbugs-annotations/4.2.0/spotbugs-annotations-4.2.0.jar
      [get] To: <https://ci-builds.apache.org/job/POI/job/POI-DSL-Windows-1.14/ws/build\findbugs\lib\spotbugs-annotations.jar>
      [get] Getting: https://repo1.maven.org/maven2/org/dom4j/dom4j/2.1.3/dom4j-2.1.3.jar
      [get] To: <https://ci-builds.apache.org/job/POI/job/POI-DSL-Windows-1.14/ws/build\findbugs\lib\dom4j-2.1.3.jar>
      [get] Getting: https://repo1.maven.org/maven2/jaxen/jaxen/1.2.0/jaxen-1.2.0.jar
      [get] To: <https://ci-builds.apache.org/job/POI/job/POI-DSL-Windows-1.14/ws/build\findbugs\lib\jaxen-1.2.0.jar>
      [get] Getting: https://repo1.maven.org/maven2/org/apache/bcel/bcel/6.5.0/bcel-6.5.0.jar
      [get] To: <https://ci-builds.apache.org/job/POI/job/POI-DSL-Windows-1.14/ws/build\findbugs\lib\bcel-6.5.0.jar>
      [get] Getting: https://repo1.maven.org/maven2/org/slf4j/slf4j-api/1.8.0-beta4/slf4j-api-1.8.0-beta4.jar
      [get] To: <https://ci-builds.apache.org/job/POI/job/POI-DSL-Windows-1.14/ws/build\findbugs\lib\slf4j-api-1.8.0-beta4.jar>
      [get] Getting: https://repo1.maven.org/maven2/org/apache/commons/commons-lang3/3.11/commons-lang3-3.11.jar
      [get] To: <https://ci-builds.apache.org/job/POI/job/POI-DSL-Windows-1.14/ws/build\findbugs\lib\commons-lang3-3.11.jar>
      [get] Getting: https://repo1.maven.org/maven2/org/apache/commons/commons-text/1.9/commons-text-1.9.jar
      [get] To: <https://ci-builds.apache.org/job/POI/job/POI-DSL-Windows-1.14/ws/build\findbugs\lib\commons-text-1.9.jar>
      [get] Getting: https://repo1.maven.org/maven2/net/jcip/jcip-annotations/1.0/jcip-annotations-1.0.jar
      [get] To: <https://ci-builds.apache.org/job/POI/job/POI-DSL-Windows-1.14/ws/build\findbugs\lib\jcip-annotations-1.0.jar>
      [get] Getting: https://repo1.maven.org/maven2/com/google/code/findbugs/jsr305/3.0.2/jsr305-3.0.2.jar
      [get] To: <https://ci-builds.apache.org/job/POI/job/POI-DSL-Windows-1.14/ws/build\findbugs\lib\jsr305-3.0.2.jar>
      [get] Getting: https://repo1.maven.org/maven2/org/ow2/asm/asm/9.0/asm-9.0.jar
      [get] To: <https://ci-builds.apache.org/job/POI/job/POI-DSL-Windows-1.14/ws/build\findbugs\lib\asm-9.0.jar>
      [get] Getting: https://repo1.maven.org/maven2/org/ow2/asm/asm-analysis/9.0/asm-analysis-9.0.jar
      [get] To: <https://ci-builds.apache.org/job/POI/job/POI-DSL-Windows-1.14/ws/build\findbugs\lib\asm-analysis-9.0.jar>
      [get] Getting: https://repo1.maven.org/maven2/org/ow2/asm/asm-commons/9.0/asm-commons-9.0.jar
      [get] To: <https://ci-builds.apache.org/job/POI/job/POI-DSL-Windows-1.14/ws/build\findbugs\lib\asm-commons-9.0.jar>
      [get] Getting: https://repo1.maven.org/maven2/org/ow2/asm/asm-tree/9.0/asm-tree-9.0.jar
      [get] To: <https://ci-builds.apache.org/job/POI/job/POI-DSL-Windows-1.14/ws/build\findbugs\lib\asm-tree-9.0.jar>
      [get] Getting: https://repo1.maven.org/maven2/org/ow2/asm/asm-util/9.0/asm-util-9.0.jar
      [get] To: <https://ci-builds.apache.org/job/POI/job/POI-DSL-Windows-1.14/ws/build\findbugs\lib\asm-util-9.0.jar>
      [get] Getting: https://repo1.maven.org/maven2/org/apache/logging/log4j/log4j-api/2.14.0/log4j-api-2.14.0.jar
      [get] To: <https://ci-builds.apache.org/job/POI/job/POI-DSL-Windows-1.14/ws/build\findbugs\lib\log4j-api-2.14.0.jar>
      [get] Getting: https://repo1.maven.org/maven2/org/apache/logging/log4j/log4j-core/2.14.0/log4j-core-2.14.0.jar
      [get] To: <https://ci-builds.apache.org/job/POI/job/POI-DSL-Windows-1.14/ws/build\findbugs\lib\log4j-core-2.14.0.jar>
      [get] Getting: https://repo1.maven.org/maven2/org/apache/logging/log4j/log4j-slf4j18-impl/2.14.0/log4j-slf4j18-impl-2.14.0.jar
      [get] To: <https://ci-builds.apache.org/job/POI/job/POI-DSL-Windows-1.14/ws/build\findbugs\lib\log4j-slf4j18-impl-2.14.0.jar>
      [get] Getting: https://repo1.maven.org/maven2/net/sf/saxon/Saxon-HE/9.9.1-8/Saxon-HE-9.9.1-8.jar
      [get] To: <https://ci-builds.apache.org/job/POI/job/POI-DSL-Windows-1.14/ws/build\findbugs\lib\Saxon-HE-9.9.1-8.jar>
      [get] Getting: https://repo1.maven.org/maven2/com/ibm/icu/icu4j/68.2/icu4j-68.2.jar
      [get] To: <https://ci-builds.apache.org/job/POI/job/POI-DSL-Windows-1.14/ws/build\findbugs\lib\icu4j-63.1.jar>
 [spotbugs] Executing SpotBugs FindBugsTask from ant task
 [spotbugs] Running SpotBugs...
 [spotbugs] Java Result: 1
 [spotbugs] Output saved to build/findbugs.xml
     [xslt] Transforming into <https://ci-builds.apache.org/job/POI/job/POI-DSL-Windows-1.14/ws/build>
     [xslt] Processing <https://ci-builds.apache.org/job/POI/job/POI-DSL-Windows-1.14/ws/build\findbugs.xml> to <https://ci-builds.apache.org/job/POI/job/POI-DSL-Windows-1.14/ws/build\findbugs.html>
     [xslt] Loading stylesheet jar:<https://ci-builds.apache.org/job/POI/job/POI-DSL-Windows-1.14/ws/build/findbugs/lib/spotbugs.jar!/fancy.xsl>

release-notes:
     [copy] Copying 1 file to <https://ci-builds.apache.org/job/POI/job/POI-DSL-Windows-1.14/ws/build\dist>

rat-check:
    [mkdir] Created dir: <https://ci-builds.apache.org/job/POI/job/POI-DSL-Windows-1.14/ws/build\rat>
     [echo]
     [echo] *****************************************************
     [echo] Summary
     [echo] -------
     [echo] Generated at: 2020-12-30T10:57:48-08:00
     [echo]
     [echo] Notes: 0
     [echo] Binaries: 117
     [echo] Archives: 0
     [echo] Standards: 3762
     [echo]
     [echo] Apache Licensed: 3760
     [echo] Generated Documents: 0
     [echo]
     [echo] JavaDocs are generated, thus a license header is optional.
     [echo] Generated files do not require license headers.
     [echo]
     [echo] 2 Unknown Licenses
     [echo]
     [echo] *****************************************************
     [echo]
     [echo] Files with unapproved licenses:
     [echo]
     [echo]   f:/jenkins/jenkins-slave/712657a4/workspace/POI/POI-DSL-Windows-1.14/src/multimodule/excelant/test9/module-info.class.r1883461
     [echo]   f:/jenkins/jenkins-slave/712657a4/workspace/POI/POI-DSL-Windows-1.14/src/multimodule/excelant/test9/module-info.class.r1884951
     [echo]
     [echo] *****************************************************
     [echo]
     [echo] *****************************************************
     [echo]   Files with Apache License headers will be marked AL
     [echo]   Binary files (which do not require any license headers) will be marked B
     [echo]   Compressed archives will be marked A
     [echo]   Notices, licenses etc. will be marked N
     [echo]  !????? f:/jenkins/jenkins-slave/712657a4/workspace/POI/POI-DSL-Windows-1.14/src/multimodule/excelant/test9/module-info.class.r1883461
     [echo]  !????? f:/jenkins/jenkins-slave/712657a4/workspace/POI/POI-DSL-Windows-1.14/src/multimodule/excelant/test9/module-info.class.r1884951
     [echo]  
     [echo] *****************************************************
     [echo]
     [echo]  Printing headers for text files without a valid license header...
     [echo]  
     [echo] =====================================================
     [echo] == File: f:/jenkins/jenkins-slave/712657a4/workspace/POI/POI-DSL-Windows-1.14/src/multimodule/excelant/test9/module-info.class.r1883461
     [echo] =====================================================
     [echo] Êþº¾???5????
     [echo] ???Module????????
     [echo] ???????????????module-info???org.apache.poi.excelant?? java.base???ant???org.apache.poi.ooxml???org.apache.poi.scratchpad???org/apache/poi/ss/excelant???org/apache/poi/ss/excelant/util€??????????????????:??????????€?????????????????????????????? ????????????????
     [echo]
     [echo] =====================================================
     [echo] == File: f:/jenkins/jenkins-slave/712657a4/workspace/POI/POI-DSL-Windows-1.14/src/multimodule/excelant/test9/module-info.class.r1884951
     [echo] =====================================================
     [echo] Êþº¾???5????????module-info???Module??????org.apache.poi.excelant????? java.base?? ???ant??????org.apache.poi.ooxml??
     [echo] ???org.apache.poi.scratchpad??????org.junit.jupiter.api???5.7.0??????org.junit.jupiter.params??????org/apache/poi/ss/excelant??????org/apache/poi/ss/excelant/util€??????????????????F??????????€??????????
     [echo] ????????????????????????????????????????????????

BUILD FAILED
<https://ci-builds.apache.org/job/POI/job/POI-DSL-Windows-1.14/ws/build.xml>:2375: condition satisfied

Total time: 44 minutes 16 seconds
Build step 'Invoke Ant' marked build as failure
[SpotBugs] Skipping execution of recorder since overall result is 'FAILURE'
Archiving artifacts
[Fast Archiver] Compressed 350.15 MB of artifacts by 15.8% relative to #20
Skipping publisher since build result is FAILURE
Recording test results

---------------------------------------------------------------------
To unsubscribe, e-mail: [hidden email]
For additional commands, e-mail: [hidden email]

Reply | Threaded
Open this post in threaded view
|

Build failed in Jenkins: POI » POI-DSL-Windows-1.14 #24

Apache Jenkins Server
See <https://ci-builds.apache.org/job/POI/job/POI-DSL-Windows-1.14/24/display/redirect>

Changes:


------------------------------------------
[...truncated 851.62 KB...]
  [javadoc]     public static int parsePercent(org.openxmlformats.schemas.wordprocessingml.x2006.main.STDecimalNumberOrPercent pctUnion) {
  [javadoc]                       ^
  [javadoc] <https://ci-builds.apache.org/job/POI/job/POI-DSL-Windows-1.14/ws/src\ooxml\java\org\apache\poi\ooxml\util\POIXMLUnits.java>:103: error: self-closing element not allowed
  [javadoc]      * This type seems to be interpreted as percent value when the trailing percent sign is missing.<br/>
  [javadoc]                                                                                                     ^
  [javadoc] <https://ci-builds.apache.org/job/POI/job/POI-DSL-Windows-1.14/ws/src\ooxml\java\org\apache\poi\ooxml\util\POIXMLUnits.java>:107: error: tag not allowed here: <pre>
  [javadoc]      * <pre>
  [javadoc]        ^
  [javadoc] <https://ci-builds.apache.org/job/POI/job/POI-DSL-Windows-1.14/ws/src\ooxml\java\org\apache\poi\ooxml\util\POIXMLUnits.java>:107: error: element not closed: pre
  [javadoc]      * <pre>
  [javadoc]        ^
  [javadoc] <https://ci-builds.apache.org/job/POI/job/POI-DSL-Windows-1.14/ws/src\ooxml\java\org\apache\poi\ooxml\util\POIXMLUnits.java>:105: error: element not closed: pre
  [javadoc]      * <pre>
  [javadoc]        ^
  [javadoc] <https://ci-builds.apache.org/job/POI/job/POI-DSL-Windows-1.14/ws/src\ooxml\java\org\apache\poi\ooxml\util\POIXMLUnits.java>:111: warning: no @param for pctUnion
  [javadoc]     public static int parsePercent(org.openxmlformats.schemas.wordprocessingml.x2006.main.STTextScale pctUnion) {
  [javadoc]                       ^
  [javadoc] <https://ci-builds.apache.org/job/POI/job/POI-DSL-Windows-1.14/ws/src\ooxml\java\org\apache\poi\ooxml\util\POIXMLUnits.java>:151: warning: no @param for coordUnion
  [javadoc]     public static long parseLength(org.openxmlformats.schemas.drawingml.x2006.main.STCoordinate32 coordUnion) {
  [javadoc]                        ^
  [javadoc] <https://ci-builds.apache.org/job/POI/job/POI-DSL-Windows-1.14/ws/src\ooxml\java\org\apache\poi\ooxml\util\POIXMLUnits.java>:161: warning: no @param for coordUnion
  [javadoc]     public static long parseLength(org.openxmlformats.schemas.drawingml.x2006.main.STCoordinate coordUnion) {
  [javadoc]                        ^
  [javadoc] <https://ci-builds.apache.org/job/POI/job/POI-DSL-Windows-1.14/ws/src\ooxml\java\org\apache\poi\ooxml\util\POIXMLUnits.java>:171: warning: no @param for coordUnion
  [javadoc]     public static long parseLength(org.openxmlformats.schemas.drawingml.x2006.main.STTextPoint coordUnion) {
  [javadoc]                        ^
  [javadoc] <https://ci-builds.apache.org/job/POI/job/POI-DSL-Windows-1.14/ws/src\ooxml\java\org\apache\poi\ooxml\util\POIXMLUnits.java>:180: warning: no @param for coordUnion
  [javadoc]     public static long parseLength(org.openxmlformats.schemas.officeDocument.x2006.sharedTypes.STTwipsMeasure coordUnion) {
  [javadoc]                        ^
  [javadoc] <https://ci-builds.apache.org/job/POI/job/POI-DSL-Windows-1.14/ws/src\ooxml\java\org\apache\poi\ooxml\util\POIXMLUnits.java>:189: warning: no @param for coordUnion
  [javadoc]     public static long parseLength(org.openxmlformats.schemas.wordprocessingml.x2006.main.STSignedTwipsMeasure coordUnion) {
  [javadoc]                        ^
  [javadoc] <https://ci-builds.apache.org/job/POI/job/POI-DSL-Windows-1.14/ws/src\ooxml\java\org\apache\poi\ooxml\util\POIXMLUnits.java>:198: warning: no @param for coordUnion
  [javadoc]     public static long parseLength(org.openxmlformats.schemas.wordprocessingml.x2006.main.STHpsMeasure coordUnion) {
  [javadoc]                        ^
  [javadoc] <https://ci-builds.apache.org/job/POI/job/POI-DSL-Windows-1.14/ws/src\ooxml\java\org\apache\poi\ooxml\util\POIXMLUnits.java>:208: warning: no @param for coordUnion
  [javadoc]     public static long parseLength(org.openxmlformats.schemas.wordprocessingml.x2006.main.STSignedHpsMeasure coordUnion) {
  [javadoc]                        ^
  [javadoc] <https://ci-builds.apache.org/job/POI/job/POI-DSL-Windows-1.14/ws/src\ooxml\java\org\apache\poi\ooxml\util\POIXMLUnits.java>:218: warning: no @param for coordUnion
  [javadoc]     public static long parseLength(org.openxmlformats.schemas.wordprocessingml.x2006.main.STMeasurementOrPercent coordUnion) {
  [javadoc]                        ^
  [javadoc] <https://ci-builds.apache.org/job/POI/job/POI-DSL-Windows-1.14/ws/src\ooxml\java\org\apache\poi\ooxml\util\SAXHelper.java>:38: warning: no @return
  [javadoc]     public static XMLReader newXMLReader() throws SAXException, ParserConfigurationException {
  [javadoc]                             ^
  [javadoc] <https://ci-builds.apache.org/job/POI/job/POI-DSL-Windows-1.14/ws/src\ooxml\java\org\apache\poi\ooxml\util\SAXHelper.java>:38: warning: no @throws for org.xml.sax.SAXException
  [javadoc]     public static XMLReader newXMLReader() throws SAXException, ParserConfigurationException {
  [javadoc]                             ^
  [javadoc] <https://ci-builds.apache.org/job/POI/job/POI-DSL-Windows-1.14/ws/src\ooxml\java\org\apache\poi\ooxml\util\SAXHelper.java>:38: warning: no @throws for javax.xml.parsers.ParserConfigurationException
  [javadoc]     public static XMLReader newXMLReader() throws SAXException, ParserConfigurationException {
  [javadoc]                             ^
  [javadoc] <https://ci-builds.apache.org/job/POI/job/POI-DSL-Windows-1.14/ws/src\ooxml\java\org\apache\poi\ooxml\util\XPathHelper.java>:76: error: reference not found
  [javadoc]      * The {@link #selectProperty(Class, String)} xquery method has some performance penalties,
  [javadoc]                   ^
  [javadoc] <https://ci-builds.apache.org/job/POI/job/POI-DSL-Windows-1.14/ws/src\ooxml\java\org\apache\poi\openxml4j\opc\RelationshipSource.java>:60: error: exception not thrown: org.apache.poi.openxml4j.exceptions.InvalidFormatException
  [javadoc] * @throws InvalidFormatException
  [javadoc]           ^
  [javadoc] <https://ci-builds.apache.org/job/POI/job/POI-DSL-Windows-1.14/ws/src\ooxml\java\org\apache\poi\openxml4j\opc\OPCPackage.java>:1599: error: unexpected end tag: </p>
  [javadoc]      * </p>
  [javadoc]        ^
  [javadoc] <https://ci-builds.apache.org/job/POI/job/POI-DSL-Windows-1.14/ws/src\ooxml\java\org\apache\poi\openxml4j\opc\PackagePartName.java>:418: error: bad use of '>'
  [javadoc] * returns an empty String. Example : '/document/content.xml' => 'xml'
  [javadoc]                                                               ^
  [javadoc] <https://ci-builds.apache.org/job/POI/job/POI-DSL-Windows-1.14/ws/src\ooxml\java\org\apache\poi\openxml4j\opc\PackagingURIHelper.java>:265: error: bad use of '>'
  [javadoc]      *         '/word/document.xml' => 'media/image1.gif') else
  [javadoc]                                      ^
  [javadoc] <https://ci-builds.apache.org/job/POI/job/POI-DSL-Windows-1.14/ws/src\ooxml\java\org\apache\poi\openxml4j\opc\PackagingURIHelper.java>:393: error: bad use of '>'
  [javadoc]      *         '/word/document.xml' => 'media/image1.gif') else
  [javadoc]                                      ^
  [javadoc] <https://ci-builds.apache.org/job/POI/job/POI-DSL-Windows-1.14/ws/src\ooxml\java\org\apache\poi\openxml4j\opc\PackagingURIHelper.java>:623: error: bad use of '>'
  [javadoc]      * /word/document.xml -> /word/_rels/document.xml.rels)
  [javadoc]                            ^
  [javadoc] <https://ci-builds.apache.org/job/POI/job/POI-DSL-Windows-1.14/ws/src\ooxml\java\org\apache\poi\openxml4j\opc\PackagingURIHelper.java>:732: error: bad use of '>'
  [javadoc]      *   'Apache POI' --> 'Apache%20POI'
  [javadoc]                         ^
  [javadoc] <https://ci-builds.apache.org/job/POI/job/POI-DSL-Windows-1.14/ws/src\ooxml\java\org\apache\poi\openxml4j\opc\PackagingURIHelper.java>:733: error: bad use of '>'
  [javadoc]      *   'Apache\u0410POI' --> 'Apache%04%10POI'
  [javadoc]                              ^
  [javadoc] <https://ci-builds.apache.org/job/POI/job/POI-DSL-Windows-1.14/ws/src\ooxml\java\org\apache\poi\openxml4j\opc\internal\ContentTypeManager.java>:117: error: bad use of '>'
  [javadoc]      * Build association extention-> content type (will be stored in
  [javadoc]                                    ^
  [javadoc] <https://ci-builds.apache.org/job/POI/job/POI-DSL-Windows-1.14/ws/src\ooxml\java\org\apache\poi\openxml4j\opc\internal\unmarshallers\PackagePropertiesUnmarshaller.java>:223: error: malformed HTML
  [javadoc] * the schema: <dcterms:created> and <dcterms:modified> Consumers shall
  [javadoc]               ^
  [javadoc] <https://ci-builds.apache.org/job/POI/job/POI-DSL-Windows-1.14/ws/src\ooxml\java\org\apache\poi\openxml4j\opc\internal\unmarshallers\PackagePropertiesUnmarshaller.java>:223: error: bad use of '>'
  [javadoc] * the schema: <dcterms:created> and <dcterms:modified> Consumers shall
  [javadoc]                               ^
  [javadoc] <https://ci-builds.apache.org/job/POI/job/POI-DSL-Windows-1.14/ws/src\ooxml\java\org\apache\poi\openxml4j\opc\internal\unmarshallers\PackagePropertiesUnmarshaller.java>:223: error: malformed HTML
  [javadoc] * the schema: <dcterms:created> and <dcterms:modified> Consumers shall
  [javadoc]                                     ^
  [javadoc] <https://ci-builds.apache.org/job/POI/job/POI-DSL-Windows-1.14/ws/src\ooxml\java\org\apache\poi\openxml4j\opc\internal\unmarshallers\PackagePropertiesUnmarshaller.java>:223: error: bad use of '>'
  [javadoc] * the schema: <dcterms:created> and <dcterms:modified> Consumers shall
  [javadoc]                                                      ^
  [javadoc] <https://ci-builds.apache.org/job/POI/job/POI-DSL-Windows-1.14/ws/src\ooxml\java\org\apache\poi\openxml4j\opc\internal\unmarshallers\PackagePropertiesUnmarshaller.java>:231: error: malformed HTML
  [javadoc] * the xsi:type attribute, except for a <dcterms:created> or
  [javadoc]                                        ^
  [javadoc] <https://ci-builds.apache.org/job/POI/job/POI-DSL-Windows-1.14/ws/src\ooxml\java\org\apache\poi\openxml4j\opc\internal\unmarshallers\PackagePropertiesUnmarshaller.java>:231: error: bad use of '>'
  [javadoc] * the xsi:type attribute, except for a <dcterms:created> or
  [javadoc]                                                        ^
  [javadoc] <https://ci-builds.apache.org/job/POI/job/POI-DSL-Windows-1.14/ws/src\ooxml\java\org\apache\poi\openxml4j\opc\internal\unmarshallers\PackagePropertiesUnmarshaller.java>:232: error: malformed HTML
  [javadoc] * <dcterms:modified> element where the xsi:type attribute shall be present
  [javadoc]   ^
  [javadoc] <https://ci-builds.apache.org/job/POI/job/POI-DSL-Windows-1.14/ws/src\ooxml\java\org\apache\poi\openxml4j\opc\internal\unmarshallers\PackagePropertiesUnmarshaller.java>:232: error: bad use of '>'
  [javadoc] * <dcterms:modified> element where the xsi:type attribute shall be present
  [javadoc]                    ^
  [javadoc] <https://ci-builds.apache.org/job/POI/job/POI-DSL-Windows-1.14/ws/src\ooxml\java\org\apache\poi\xslf\usermodel\XSLFSheet.java>:348: error: tag not supported in the generated HTML version: tt
  [javadoc]      * @return <tt>true</tt> if this sheet contained the specified element
  [javadoc]                ^
  [javadoc] <https://ci-builds.apache.org/job/POI/job/POI-DSL-Windows-1.14/ws/src\ooxml\java\org\apache\poi\xssf\eventusermodel\XSSFReader.java>:291: error: tag not supported in the generated HTML version: tt
  [javadoc]          * Returns <tt>true</tt> if the iteration has more elements.
  [javadoc]                    ^
  [javadoc] 100 errors
  [javadoc] 100 warnings
      [jar] Building jar: <https://ci-builds.apache.org/job/POI/job/POI-DSL-Windows-1.14/ws/build\dist\maven\poi-ooxml\poi-ooxml-5.0.0-SNAPSHOT-javadoc.jar>

assemble:
      [zip] Building zip: <https://ci-builds.apache.org/job/POI/job/POI-DSL-Windows-1.14/ws/build\dist\poi-bin-5.0.0-SNAPSHOT-20201230.zip>
      [tar] Building tar: <https://ci-builds.apache.org/job/POI/job/POI-DSL-Windows-1.14/ws/build\dist\poi-bin-5.0.0-SNAPSHOT-20201230.tar.gz>
      [zip] Building zip: <https://ci-builds.apache.org/job/POI/job/POI-DSL-Windows-1.14/ws/build\dist\poi-src-5.0.0-SNAPSHOT-20201230.zip>
      [tar] Building tar: <https://ci-builds.apache.org/job/POI/job/POI-DSL-Windows-1.14/ws/build\dist\poi-src-5.0.0-SNAPSHOT-20201230.tar.gz>
     [echo] Creating Maven POMs

maven-poms:
     [copy] Copying 7 files to <https://ci-builds.apache.org/job/POI/job/POI-DSL-Windows-1.14/ws/build\dist\maven>
     [echo] Maven POMs are located in <https://ci-builds.apache.org/job/POI/job/POI-DSL-Windows-1.14/ws/build\dist>
     [echo] Use ant dist-nexus to deploy the artifacts in the remote repository
     [echo] Distribution located in <https://ci-builds.apache.org/job/POI/job/POI-DSL-Windows-1.14/ws/build\dist>
     [echo] Use "ant dist-checksum" to create sha256/sha512 checksums and GPG signatures

findbugs:
    [mkdir] Created dir: <https://ci-builds.apache.org/job/POI/job/POI-DSL-Windows-1.14/ws/build\findbugs\lib\config>
      [get] Getting: https://repo1.maven.org/maven2/com/github/spotbugs/spotbugs/4.2.0/spotbugs-4.2.0.jar
      [get] To: <https://ci-builds.apache.org/job/POI/job/POI-DSL-Windows-1.14/ws/build\findbugs\lib\spotbugs.jar>
      [get] Getting: https://repo1.maven.org/maven2/com/github/spotbugs/spotbugs-ant/4.2.0/spotbugs-ant-4.2.0.jar
      [get] To: <https://ci-builds.apache.org/job/POI/job/POI-DSL-Windows-1.14/ws/build\findbugs\lib\spotbugs-ant.jar>
      [get] Getting: https://repo1.maven.org/maven2/com/github/spotbugs/spotbugs-annotations/4.2.0/spotbugs-annotations-4.2.0.jar
      [get] To: <https://ci-builds.apache.org/job/POI/job/POI-DSL-Windows-1.14/ws/build\findbugs\lib\spotbugs-annotations.jar>
      [get] Getting: https://repo1.maven.org/maven2/org/dom4j/dom4j/2.1.3/dom4j-2.1.3.jar
      [get] To: <https://ci-builds.apache.org/job/POI/job/POI-DSL-Windows-1.14/ws/build\findbugs\lib\dom4j-2.1.3.jar>
      [get] Getting: https://repo1.maven.org/maven2/jaxen/jaxen/1.2.0/jaxen-1.2.0.jar
      [get] To: <https://ci-builds.apache.org/job/POI/job/POI-DSL-Windows-1.14/ws/build\findbugs\lib\jaxen-1.2.0.jar>
      [get] Getting: https://repo1.maven.org/maven2/org/apache/bcel/bcel/6.5.0/bcel-6.5.0.jar
      [get] To: <https://ci-builds.apache.org/job/POI/job/POI-DSL-Windows-1.14/ws/build\findbugs\lib\bcel-6.5.0.jar>
      [get] Getting: https://repo1.maven.org/maven2/org/slf4j/slf4j-api/1.8.0-beta4/slf4j-api-1.8.0-beta4.jar
      [get] To: <https://ci-builds.apache.org/job/POI/job/POI-DSL-Windows-1.14/ws/build\findbugs\lib\slf4j-api-1.8.0-beta4.jar>
      [get] Getting: https://repo1.maven.org/maven2/org/apache/commons/commons-lang3/3.11/commons-lang3-3.11.jar
      [get] To: <https://ci-builds.apache.org/job/POI/job/POI-DSL-Windows-1.14/ws/build\findbugs\lib\commons-lang3-3.11.jar>
      [get] Getting: https://repo1.maven.org/maven2/org/apache/commons/commons-text/1.9/commons-text-1.9.jar
      [get] To: <https://ci-builds.apache.org/job/POI/job/POI-DSL-Windows-1.14/ws/build\findbugs\lib\commons-text-1.9.jar>
      [get] Getting: https://repo1.maven.org/maven2/net/jcip/jcip-annotations/1.0/jcip-annotations-1.0.jar
      [get] To: <https://ci-builds.apache.org/job/POI/job/POI-DSL-Windows-1.14/ws/build\findbugs\lib\jcip-annotations-1.0.jar>
      [get] Getting: https://repo1.maven.org/maven2/com/google/code/findbugs/jsr305/3.0.2/jsr305-3.0.2.jar
      [get] To: <https://ci-builds.apache.org/job/POI/job/POI-DSL-Windows-1.14/ws/build\findbugs\lib\jsr305-3.0.2.jar>
      [get] Getting: https://repo1.maven.org/maven2/org/ow2/asm/asm/9.0/asm-9.0.jar
      [get] To: <https://ci-builds.apache.org/job/POI/job/POI-DSL-Windows-1.14/ws/build\findbugs\lib\asm-9.0.jar>
      [get] Getting: https://repo1.maven.org/maven2/org/ow2/asm/asm-analysis/9.0/asm-analysis-9.0.jar
      [get] To: <https://ci-builds.apache.org/job/POI/job/POI-DSL-Windows-1.14/ws/build\findbugs\lib\asm-analysis-9.0.jar>
      [get] Getting: https://repo1.maven.org/maven2/org/ow2/asm/asm-commons/9.0/asm-commons-9.0.jar
      [get] To: <https://ci-builds.apache.org/job/POI/job/POI-DSL-Windows-1.14/ws/build\findbugs\lib\asm-commons-9.0.jar>
      [get] Getting: https://repo1.maven.org/maven2/org/ow2/asm/asm-tree/9.0/asm-tree-9.0.jar
      [get] To: <https://ci-builds.apache.org/job/POI/job/POI-DSL-Windows-1.14/ws/build\findbugs\lib\asm-tree-9.0.jar>
      [get] Getting: https://repo1.maven.org/maven2/org/ow2/asm/asm-util/9.0/asm-util-9.0.jar
      [get] To: <https://ci-builds.apache.org/job/POI/job/POI-DSL-Windows-1.14/ws/build\findbugs\lib\asm-util-9.0.jar>
      [get] Getting: https://repo1.maven.org/maven2/org/apache/logging/log4j/log4j-api/2.14.0/log4j-api-2.14.0.jar
      [get] To: <https://ci-builds.apache.org/job/POI/job/POI-DSL-Windows-1.14/ws/build\findbugs\lib\log4j-api-2.14.0.jar>
      [get] Getting: https://repo1.maven.org/maven2/org/apache/logging/log4j/log4j-core/2.14.0/log4j-core-2.14.0.jar
      [get] To: <https://ci-builds.apache.org/job/POI/job/POI-DSL-Windows-1.14/ws/build\findbugs\lib\log4j-core-2.14.0.jar>
      [get] Getting: https://repo1.maven.org/maven2/org/apache/logging/log4j/log4j-slf4j18-impl/2.14.0/log4j-slf4j18-impl-2.14.0.jar
      [get] To: <https://ci-builds.apache.org/job/POI/job/POI-DSL-Windows-1.14/ws/build\findbugs\lib\log4j-slf4j18-impl-2.14.0.jar>
      [get] Getting: https://repo1.maven.org/maven2/net/sf/saxon/Saxon-HE/9.9.1-8/Saxon-HE-9.9.1-8.jar
      [get] To: <https://ci-builds.apache.org/job/POI/job/POI-DSL-Windows-1.14/ws/build\findbugs\lib\Saxon-HE-9.9.1-8.jar>
      [get] Getting: https://repo1.maven.org/maven2/com/ibm/icu/icu4j/68.2/icu4j-68.2.jar
      [get] To: <https://ci-builds.apache.org/job/POI/job/POI-DSL-Windows-1.14/ws/build\findbugs\lib\icu4j-63.1.jar>
 [spotbugs] Executing SpotBugs FindBugsTask from ant task
 [spotbugs] Running SpotBugs...
 [spotbugs] Java Result: 1
 [spotbugs] Output saved to build/findbugs.xml
     [xslt] Transforming into <https://ci-builds.apache.org/job/POI/job/POI-DSL-Windows-1.14/ws/build>
     [xslt] Processing <https://ci-builds.apache.org/job/POI/job/POI-DSL-Windows-1.14/ws/build\findbugs.xml> to <https://ci-builds.apache.org/job/POI/job/POI-DSL-Windows-1.14/ws/build\findbugs.html>
     [xslt] Loading stylesheet jar:<https://ci-builds.apache.org/job/POI/job/POI-DSL-Windows-1.14/ws/build/findbugs/lib/spotbugs.jar!/fancy.xsl>

release-notes:
     [copy] Copying 1 file to <https://ci-builds.apache.org/job/POI/job/POI-DSL-Windows-1.14/ws/build\dist>

rat-check:
    [mkdir] Created dir: <https://ci-builds.apache.org/job/POI/job/POI-DSL-Windows-1.14/ws/build\rat>
     [echo]
     [echo] *****************************************************
     [echo] Summary
     [echo] -------
     [echo] Generated at: 2020-12-30T11:51:41-08:00
     [echo]
     [echo] Notes: 0
     [echo] Binaries: 117
     [echo] Archives: 0
     [echo] Standards: 3762
     [echo]
     [echo] Apache Licensed: 3760
     [echo] Generated Documents: 0
     [echo]
     [echo] JavaDocs are generated, thus a license header is optional.
     [echo] Generated files do not require license headers.
     [echo]
     [echo] 2 Unknown Licenses
     [echo]
     [echo] *****************************************************
     [echo]
     [echo] Files with unapproved licenses:
     [echo]
     [echo]   f:/jenkins/jenkins-slave/712657a4/workspace/POI/POI-DSL-Windows-1.14/src/multimodule/excelant/test9/module-info.class.r1884399
     [echo]   f:/jenkins/jenkins-slave/712657a4/workspace/POI/POI-DSL-Windows-1.14/src/multimodule/excelant/test9/module-info.class.r1884953
     [echo]
     [echo] *****************************************************
     [echo]
     [echo] *****************************************************
     [echo]   Files with Apache License headers will be marked AL
     [echo]   Binary files (which do not require any license headers) will be marked B
     [echo]   Compressed archives will be marked A
     [echo]   Notices, licenses etc. will be marked N
     [echo]  !????? f:/jenkins/jenkins-slave/712657a4/workspace/POI/POI-DSL-Windows-1.14/src/multimodule/excelant/test9/module-info.class.r1884399
     [echo]  !????? f:/jenkins/jenkins-slave/712657a4/workspace/POI/POI-DSL-Windows-1.14/src/multimodule/excelant/test9/module-info.class.r1884953
     [echo]  
     [echo] *****************************************************
     [echo]
     [echo]  Printing headers for text files without a valid license header...
     [echo]  
     [echo] =====================================================
     [echo] == File: f:/jenkins/jenkins-slave/712657a4/workspace/POI/POI-DSL-Windows-1.14/src/multimodule/excelant/test9/module-info.class.r1884399
     [echo] =====================================================
     [echo] Êþº¾???5????
     [echo] ???Module????????
     [echo] ???????????????module-info???org.apache.poi.excelant?? java.base???ant???org.apache.poi.ooxml???org.apache.poi.scratchpad???org/apache/poi/ss/excelant???org/apache/poi/ss/excelant/util€??????????????????:??????????€?????????????????????????????? ????????????????
     [echo]
     [echo] =====================================================
     [echo] == File: f:/jenkins/jenkins-slave/712657a4/workspace/POI/POI-DSL-Windows-1.14/src/multimodule/excelant/test9/module-info.class.r1884953
     [echo] =====================================================
     [echo] Êþº¾???5????????module-info???Module??????org.apache.poi.excelant????? java.base?? ???ant??????org.apache.poi.ooxml??
     [echo] ???org.apache.poi.scratchpad??????org.junit.jupiter.api???5.7.0??????org.junit.jupiter.params??????org/apache/poi/ss/excelant??????org/apache/poi/ss/excelant/util€??????????????????F??????????€??????????
     [echo] ????????????????????????????????????????????????

BUILD FAILED
<https://ci-builds.apache.org/job/POI/job/POI-DSL-Windows-1.14/ws/build.xml>:2375: condition satisfied

Total time: 43 minutes 33 seconds
Build step 'Invoke Ant' marked build as failure
[SpotBugs] Skipping execution of recorder since overall result is 'FAILURE'
Archiving artifacts
[Fast Archiver] Compressed 349.99 MB of artifacts by 15.8% relative to #20
Skipping publisher since build result is FAILURE
Recording test results

---------------------------------------------------------------------
To unsubscribe, e-mail: [hidden email]
For additional commands, e-mail: [hidden email]

Reply | Threaded
Open this post in threaded view
|

Jenkins build is back to normal : POI » POI-DSL-Windows-1.14 #25

Apache Jenkins Server
See <https://ci-builds.apache.org/job/POI/job/POI-DSL-Windows-1.14/25/display/redirect>


---------------------------------------------------------------------
To unsubscribe, e-mail: [hidden email]
For additional commands, e-mail: [hidden email]