Build failed in Jenkins: POI » POI-DSL-Windows-1.14 #14

classic Classic list List threaded Threaded
2 messages Options
Reply | Threaded
Open this post in threaded view
|

Build failed in Jenkins: POI » POI-DSL-Windows-1.14 #14

Apache Jenkins Server
See <https://ci-builds.apache.org/job/POI/job/POI-DSL-Windows-1.14/14/display/redirect>

Changes:


------------------------------------------
[...truncated 382.12 KB...]
AU        src\documentation\resources\images\built-with-forrest-button.png
AU        src\documentation\resources\images\logoRandyStanard08.png
AU        src\documentation\resources\images\timesheet.jpg
AU        src\documentation\resources\images\poi-logo.png
AU        src\documentation\resources\images\unknown.jpg
AU        src\documentation\resources\images\logoKarmokar1s.png
AU        src\documentation\resources\images\POIFSRootPropertyPreWrite.gif
AU        src\documentation\resources\images\logoWendyWise.png
AU        src\documentation\resources\images\POIFSPropertyTablePreWrite.gif
AU        src\documentation\resources\images\logoKarmokar5s.png
AU        src\documentation\resources\images\ss-features.png
AU        src\documentation\resources\images\businessplan.jpg
AU        src\documentation\resources\images\logoJanssen1.png
AU        src\documentation\resources\images\logoJanssen2.png
AU        src\documentation\resources\images\calendar.jpg
AU        src\documentation\resources\images\loancalc.jpg
AU        src\documentation\resources\images\usermodel.gif
AU        src\documentation\resources\images\logoLoicLefevre.png
AU        src\documentation\resources\images\simple-xls-with-function.jpg
AU        src\documentation\resources\images\logoRaPiGmbH1.png
AU        src\documentation\resources\images\PropertySet.jpg
AU        src\documentation\resources\images\logoRaPiGmbH2.png
AU        src\documentation\resources\images\vba-example.jpg
AU        src\documentation\resources\images\logoKarmokar2s.png
AU        src\documentation\resources\images\logoRaPiGmbH5.png
AU        src\documentation\resources\images\logoRaPiGmbH6.png
AU        src\documentation\resources\images\logoKarmokar6s.png
AU        src\documentation\resources\images\logoRaPiGmbH7.png
AU        src\documentation\resources\images\logoRaPiGmbH8.png
AU        src\documentation\resources\images\logoRaPiGmbH9.png
AU        src\documentation\resources\images\logoDanielFernandez.png
AU        src\documentation\resources\images\logoAndrewClements2.png
AU        src\documentation\resources\images\hslf_shapes.gif
AU        src\documentation\resources\images\logoWendyWise2.png
AU        src\documentation\resources\images\POIFSLifeCycle.gif
AU        src\documentation\resources\images\logoAdria1.png
AU        src\documentation\resources\images\logoAdria2.png
AU        src\documentation\resources\images\logoAdria3.png
AU        src\documentation\resources\images\remove.jpg
AU        src\documentation\resources\images\logoKarmokar3s.png
AU        src\documentation\resources\images\logoGlenStampoutlzis.png
AU        src\documentation\resources\images\logoKarmokar1.png
AU        src\documentation\resources\images\POIFSInitialization.gif
AU        src\documentation\resources\images\logoKarmokar2.png
AU        src\documentation\resources\images\logoRaPiGmbH10.png
AU        src\documentation\resources\images\logoKarmokar3.png
AU        src\documentation\resources\images\logoRaPiGmbH11.png
AU        src\documentation\resources\images\logoMichaelMosmann.png
AU        src\documentation\resources\images\logoKarmokar4.png
AU        src\documentation\resources\images\logoRaPiGmbH12.png
AU        src\documentation\resources\images\logoKarmokar5.png
AU        src\documentation\resources\images\logoKarmokar6.png
AU        src\documentation\resources\images\ApacheConEu08.jpg
AU        src\documentation\resources\images\BlockClassDiagram.gif
AU        src\documentation\resources\images\calculatePayment.jpg
AU        src\documentation\resources\images\PropertyTableClassDiagram.gif
AU        src\documentation\resources\images\logoRussellBeattie1.png
AU        src\documentation\resources\images\logoRussellBeattie2.png
AU        src\documentation\resources\images\logoRussellBeattie3.png
A         src\documentation\sitemap.xmap
AU        src\documentation\skinconf.xml
A         src\documentation\cli.xconf
AU        src\documentation\RELEASE-NOTES.txt
AU        src\documentation\README.txt
A         src\documentation\classes
A         src\documentation\classes\CatalogManager.properties
At revision 1883212

At revision 1883212

org.tmatesoft.svn.core.SVNException: svn: E130003: Parser configuration problem: namespace reporting is not enabled
        at org.tmatesoft.svn.core.internal.wc.SVNErrorManager.error(SVNErrorManager.java:70)
        at org.tmatesoft.svn.core.internal.wc.SVNErrorManager.error(SVNErrorManager.java:57)
        at org.tmatesoft.svn.core.internal.io.dav.http.HTTPConnection.request(HTTPConnection.java:760)
        at org.tmatesoft.svn.core.internal.io.dav.http.HTTPConnection.request(HTTPConnection.java:352)
        at org.tmatesoft.svn.core.internal.io.dav.http.HTTPConnection.request(HTTPConnection.java:340)
        at org.tmatesoft.svn.core.internal.io.dav.DAVConnection.performHttpRequest(DAVConnection.java:910)
        at org.tmatesoft.svn.core.internal.io.dav.DAVConnection.doReport(DAVConnection.java:363)
        at org.tmatesoft.svn.core.internal.io.dav.DAVConnection.doReport(DAVConnection.java:353)
        at org.tmatesoft.svn.core.internal.io.dav.DAVRepository.logImpl(DAVRepository.java:1015)
        at org.tmatesoft.svn.core.io.SVNRepository.log(SVNRepository.java:1041)
        at org.tmatesoft.svn.core.internal.wc2.remote.SvnRemoteLog.run(SvnRemoteLog.java:181)
        at org.tmatesoft.svn.core.internal.wc2.remote.SvnRemoteLog.run(SvnRemoteLog.java:35)
        at org.tmatesoft.svn.core.internal.wc2.SvnOperationRunner.run(SvnOperationRunner.java:21)
        at org.tmatesoft.svn.core.wc2.SvnOperationFactory.run(SvnOperationFactory.java:1239)
        at org.tmatesoft.svn.core.wc2.SvnOperation.run(SvnOperation.java:294)
        at org.tmatesoft.svn.core.wc.SVNLogClient.doLog(SVNLogClient.java:968)
        at org.tmatesoft.svn.core.wc.SVNLogClient.doLog(SVNLogClient.java:873)
        at hudson.scm.SubversionChangeLogBuilder.buildModule(SubversionChangeLogBuilder.java:188)
Caused: java.io.IOException: revision check failed on https://svn.apache.org/repos/asf/poi/trunk
        at hudson.scm.SubversionChangeLogBuilder.buildModule(SubversionChangeLogBuilder.java:202)
        at hudson.scm.SubversionChangeLogBuilder.run(SubversionChangeLogBuilder.java:122)
        at hudson.scm.SubversionSCM.calcChangeLog(SubversionSCM.java:755)
        at hudson.scm.SubversionSCM.checkout(SubversionSCM.java:888)
        at hudson.scm.SCM.checkout(SCM.java:505)
        at hudson.model.AbstractProject.checkout(AbstractProject.java:1206)
        at hudson.model.AbstractBuild$AbstractBuildExecution.defaultCheckout(AbstractBuild.java:574)
        at jenkins.scm.SCMCheckoutStrategy.checkout(SCMCheckoutStrategy.java:86)
        at hudson.model.AbstractBuild$AbstractBuildExecution.run(AbstractBuild.java:499)
        at hudson.model.Run.execute(Run.java:1880)
        at hudson.model.FreeStyleBuild.run(FreeStyleBuild.java:43)
        at hudson.model.ResourceController.execute(ResourceController.java:97)
        at hudson.model.Executor.run(Executor.java:428)
Retrying after 10 seconds
Updating https://svn.apache.org/repos/asf/poi/trunk at revision '2020-11-08T13:58:31.009 -0800'

<-- Got one external: forrest.properties, svn url: https://svn.apache.org/repos/asf/poi/site/forrest.properties -->
Fetching 'https://svn.apache.org/repos/asf/poi/site/forrest.properties' at -1 into 'F:\jenkins\jenkins-slave\712657a4\workspace\POI\POI-DSL-Windows-1.14\forrest.properties'
At revision 1883212


<-- Got one external: documentation, svn url: https://svn.apache.org/repos/asf/poi/site/src/documentation -->
Fetching 'https://svn.apache.org/repos/asf/poi/site/src/documentation' at -1 into 'F:\jenkins\jenkins-slave\712657a4\workspace\POI\POI-DSL-Windows-1.14\src\documentation'
At revision 1883212

At revision 1883212

org.tmatesoft.svn.core.SVNException: svn: E130003: Parser configuration problem: namespace reporting is not enabled
        at org.tmatesoft.svn.core.internal.wc.SVNErrorManager.error(SVNErrorManager.java:70)
        at org.tmatesoft.svn.core.internal.wc.SVNErrorManager.error(SVNErrorManager.java:57)
        at org.tmatesoft.svn.core.internal.io.dav.http.HTTPConnection.request(HTTPConnection.java:760)
        at org.tmatesoft.svn.core.internal.io.dav.http.HTTPConnection.request(HTTPConnection.java:352)
        at org.tmatesoft.svn.core.internal.io.dav.http.HTTPConnection.request(HTTPConnection.java:340)
        at org.tmatesoft.svn.core.internal.io.dav.DAVConnection.performHttpRequest(DAVConnection.java:910)
        at org.tmatesoft.svn.core.internal.io.dav.DAVConnection.doReport(DAVConnection.java:363)
        at org.tmatesoft.svn.core.internal.io.dav.DAVConnection.doReport(DAVConnection.java:353)
        at org.tmatesoft.svn.core.internal.io.dav.DAVRepository.logImpl(DAVRepository.java:1015)
        at org.tmatesoft.svn.core.io.SVNRepository.log(SVNRepository.java:1041)
        at org.tmatesoft.svn.core.internal.wc2.remote.SvnRemoteLog.run(SvnRemoteLog.java:181)
        at org.tmatesoft.svn.core.internal.wc2.remote.SvnRemoteLog.run(SvnRemoteLog.java:35)
        at org.tmatesoft.svn.core.internal.wc2.SvnOperationRunner.run(SvnOperationRunner.java:21)
        at org.tmatesoft.svn.core.wc2.SvnOperationFactory.run(SvnOperationFactory.java:1239)
        at org.tmatesoft.svn.core.wc2.SvnOperation.run(SvnOperation.java:294)
        at org.tmatesoft.svn.core.wc.SVNLogClient.doLog(SVNLogClient.java:968)
        at org.tmatesoft.svn.core.wc.SVNLogClient.doLog(SVNLogClient.java:873)
        at hudson.scm.SubversionChangeLogBuilder.buildModule(SubversionChangeLogBuilder.java:188)
Caused: java.io.IOException: revision check failed on https://svn.apache.org/repos/asf/poi/trunk
        at hudson.scm.SubversionChangeLogBuilder.buildModule(SubversionChangeLogBuilder.java:202)
        at hudson.scm.SubversionChangeLogBuilder.run(SubversionChangeLogBuilder.java:122)
        at hudson.scm.SubversionSCM.calcChangeLog(SubversionSCM.java:755)
        at hudson.scm.SubversionSCM.checkout(SubversionSCM.java:888)
        at hudson.scm.SCM.checkout(SCM.java:505)
        at hudson.model.AbstractProject.checkout(AbstractProject.java:1206)
        at hudson.model.AbstractBuild$AbstractBuildExecution.defaultCheckout(AbstractBuild.java:574)
        at jenkins.scm.SCMCheckoutStrategy.checkout(SCMCheckoutStrategy.java:86)
        at hudson.model.AbstractBuild$AbstractBuildExecution.run(AbstractBuild.java:499)
        at hudson.model.Run.execute(Run.java:1880)
        at hudson.model.FreeStyleBuild.run(FreeStyleBuild.java:43)
        at hudson.model.ResourceController.execute(ResourceController.java:97)
        at hudson.model.Executor.run(Executor.java:428)
Retrying after 10 seconds
Updating https://svn.apache.org/repos/asf/poi/trunk at revision '2020-11-08T13:58:31.009 -0800'

<-- Got one external: forrest.properties, svn url: https://svn.apache.org/repos/asf/poi/site/forrest.properties -->
Fetching 'https://svn.apache.org/repos/asf/poi/site/forrest.properties' at -1 into 'F:\jenkins\jenkins-slave\712657a4\workspace\POI\POI-DSL-Windows-1.14\forrest.properties'
At revision 1883212


<-- Got one external: documentation, svn url: https://svn.apache.org/repos/asf/poi/site/src/documentation -->
Fetching 'https://svn.apache.org/repos/asf/poi/site/src/documentation' at -1 into 'F:\jenkins\jenkins-slave\712657a4\workspace\POI\POI-DSL-Windows-1.14\src\documentation'
At revision 1883212

At revision 1883212

org.tmatesoft.svn.core.SVNException: svn: E130003: Parser configuration problem: namespace reporting is not enabled
        at org.tmatesoft.svn.core.internal.wc.SVNErrorManager.error(SVNErrorManager.java:70)
        at org.tmatesoft.svn.core.internal.wc.SVNErrorManager.error(SVNErrorManager.java:57)
        at org.tmatesoft.svn.core.internal.io.dav.http.HTTPConnection.request(HTTPConnection.java:760)
        at org.tmatesoft.svn.core.internal.io.dav.http.HTTPConnection.request(HTTPConnection.java:352)
        at org.tmatesoft.svn.core.internal.io.dav.http.HTTPConnection.request(HTTPConnection.java:340)
        at org.tmatesoft.svn.core.internal.io.dav.DAVConnection.performHttpRequest(DAVConnection.java:910)
        at org.tmatesoft.svn.core.internal.io.dav.DAVConnection.doReport(DAVConnection.java:363)
        at org.tmatesoft.svn.core.internal.io.dav.DAVConnection.doReport(DAVConnection.java:353)
        at org.tmatesoft.svn.core.internal.io.dav.DAVRepository.logImpl(DAVRepository.java:1015)
        at org.tmatesoft.svn.core.io.SVNRepository.log(SVNRepository.java:1041)
        at org.tmatesoft.svn.core.internal.wc2.remote.SvnRemoteLog.run(SvnRemoteLog.java:181)
        at org.tmatesoft.svn.core.internal.wc2.remote.SvnRemoteLog.run(SvnRemoteLog.java:35)
        at org.tmatesoft.svn.core.internal.wc2.SvnOperationRunner.run(SvnOperationRunner.java:21)
        at org.tmatesoft.svn.core.wc2.SvnOperationFactory.run(SvnOperationFactory.java:1239)
        at org.tmatesoft.svn.core.wc2.SvnOperation.run(SvnOperation.java:294)
        at org.tmatesoft.svn.core.wc.SVNLogClient.doLog(SVNLogClient.java:968)
        at org.tmatesoft.svn.core.wc.SVNLogClient.doLog(SVNLogClient.java:873)
        at hudson.scm.SubversionChangeLogBuilder.buildModule(SubversionChangeLogBuilder.java:188)
Caused: java.io.IOException: revision check failed on https://svn.apache.org/repos/asf/poi/trunk
        at hudson.scm.SubversionChangeLogBuilder.buildModule(SubversionChangeLogBuilder.java:202)
        at hudson.scm.SubversionChangeLogBuilder.run(SubversionChangeLogBuilder.java:122)
        at hudson.scm.SubversionSCM.calcChangeLog(SubversionSCM.java:755)
        at hudson.scm.SubversionSCM.checkout(SubversionSCM.java:888)
        at hudson.scm.SCM.checkout(SCM.java:505)
        at hudson.model.AbstractProject.checkout(AbstractProject.java:1206)
        at hudson.model.AbstractBuild$AbstractBuildExecution.defaultCheckout(AbstractBuild.java:574)
        at jenkins.scm.SCMCheckoutStrategy.checkout(SCMCheckoutStrategy.java:86)
        at hudson.model.AbstractBuild$AbstractBuildExecution.run(AbstractBuild.java:499)
        at hudson.model.Run.execute(Run.java:1880)
        at hudson.model.FreeStyleBuild.run(FreeStyleBuild.java:43)
        at hudson.model.ResourceController.execute(ResourceController.java:97)
        at hudson.model.Executor.run(Executor.java:428)
Retrying after 10 seconds
Updating https://svn.apache.org/repos/asf/poi/trunk at revision '2020-11-08T13:58:31.009 -0800'

<-- Got one external: forrest.properties, svn url: https://svn.apache.org/repos/asf/poi/site/forrest.properties -->
Fetching 'https://svn.apache.org/repos/asf/poi/site/forrest.properties' at -1 into 'F:\jenkins\jenkins-slave\712657a4\workspace\POI\POI-DSL-Windows-1.14\forrest.properties'
At revision 1883212


<-- Got one external: documentation, svn url: https://svn.apache.org/repos/asf/poi/site/src/documentation -->
Fetching 'https://svn.apache.org/repos/asf/poi/site/src/documentation' at -1 into 'F:\jenkins\jenkins-slave\712657a4\workspace\POI\POI-DSL-Windows-1.14\src\documentation'
At revision 1883212

At revision 1883212

org.tmatesoft.svn.core.SVNException: svn: E130003: Parser configuration problem: namespace reporting is not enabled
        at org.tmatesoft.svn.core.internal.wc.SVNErrorManager.error(SVNErrorManager.java:70)
        at org.tmatesoft.svn.core.internal.wc.SVNErrorManager.error(SVNErrorManager.java:57)
        at org.tmatesoft.svn.core.internal.io.dav.http.HTTPConnection.request(HTTPConnection.java:760)
        at org.tmatesoft.svn.core.internal.io.dav.http.HTTPConnection.request(HTTPConnection.java:352)
        at org.tmatesoft.svn.core.internal.io.dav.http.HTTPConnection.request(HTTPConnection.java:340)
        at org.tmatesoft.svn.core.internal.io.dav.DAVConnection.performHttpRequest(DAVConnection.java:910)
        at org.tmatesoft.svn.core.internal.io.dav.DAVConnection.doReport(DAVConnection.java:363)
        at org.tmatesoft.svn.core.internal.io.dav.DAVConnection.doReport(DAVConnection.java:353)
        at org.tmatesoft.svn.core.internal.io.dav.DAVRepository.logImpl(DAVRepository.java:1015)
        at org.tmatesoft.svn.core.io.SVNRepository.log(SVNRepository.java:1041)
        at org.tmatesoft.svn.core.internal.wc2.remote.SvnRemoteLog.run(SvnRemoteLog.java:181)
        at org.tmatesoft.svn.core.internal.wc2.remote.SvnRemoteLog.run(SvnRemoteLog.java:35)
        at org.tmatesoft.svn.core.internal.wc2.SvnOperationRunner.run(SvnOperationRunner.java:21)
        at org.tmatesoft.svn.core.wc2.SvnOperationFactory.run(SvnOperationFactory.java:1239)
        at org.tmatesoft.svn.core.wc2.SvnOperation.run(SvnOperation.java:294)
        at org.tmatesoft.svn.core.wc.SVNLogClient.doLog(SVNLogClient.java:968)
        at org.tmatesoft.svn.core.wc.SVNLogClient.doLog(SVNLogClient.java:873)
        at hudson.scm.SubversionChangeLogBuilder.buildModule(SubversionChangeLogBuilder.java:188)
Caused: java.io.IOException: revision check failed on https://svn.apache.org/repos/asf/poi/trunk
        at hudson.scm.SubversionChangeLogBuilder.buildModule(SubversionChangeLogBuilder.java:202)
        at hudson.scm.SubversionChangeLogBuilder.run(SubversionChangeLogBuilder.java:122)
        at hudson.scm.SubversionSCM.calcChangeLog(SubversionSCM.java:755)
        at hudson.scm.SubversionSCM.checkout(SubversionSCM.java:888)
        at hudson.scm.SCM.checkout(SCM.java:505)
        at hudson.model.AbstractProject.checkout(AbstractProject.java:1206)
        at hudson.model.AbstractBuild$AbstractBuildExecution.defaultCheckout(AbstractBuild.java:574)
        at jenkins.scm.SCMCheckoutStrategy.checkout(SCMCheckoutStrategy.java:86)
        at hudson.model.AbstractBuild$AbstractBuildExecution.run(AbstractBuild.java:499)
        at hudson.model.Run.execute(Run.java:1880)
        at hudson.model.FreeStyleBuild.run(FreeStyleBuild.java:43)
        at hudson.model.ResourceController.execute(ResourceController.java:97)
        at hudson.model.Executor.run(Executor.java:428)
[SpotBugs] Skipping execution of recorder since overall result is 'FAILURE'
Archiving artifacts
Skipping publisher since build result is FAILURE
Recording test results
ERROR: Step ‘Publish JUnit test result report’ failed: No test report files were found. Configuration error?

---------------------------------------------------------------------
To unsubscribe, e-mail: [hidden email]
For additional commands, e-mail: [hidden email]

Reply | Threaded
Open this post in threaded view
|

Jenkins build is back to normal : POI » POI-DSL-Windows-1.14 #15

Apache Jenkins Server
See <https://ci-builds.apache.org/job/POI/job/POI-DSL-Windows-1.14/15/display/redirect>


---------------------------------------------------------------------
To unsubscribe, e-mail: [hidden email]
For additional commands, e-mail: [hidden email]