Build failed in Jenkins: POI » POI-DSL-SonarQube-Gradle #265

classic Classic list List threaded Threaded
14 messages Options
Reply | Threaded
Open this post in threaded view
|

Build failed in Jenkins: POI » POI-DSL-SonarQube-Gradle #265

Apache Jenkins Server
See <https://ci-builds.apache.org/job/POI/job/POI-DSL-SonarQube-Gradle/265/display/redirect?page=changes>

Changes:

[Marius Volkhart] Revert erroneously modified logging statement


------------------------------------------
Started by an SCM change
Running as SYSTEM
[EnvInject] - Loading node environment variables.
[EnvInject] - Preparing an environment for the build.
[EnvInject] - Keeping Jenkins system variables.
[EnvInject] - Keeping Jenkins build variables.
[EnvInject] - Injecting as environment variables the properties content
LANG=en_US.UTF-8
FORREST_HOME=/home/jenkins/tools/forrest/latest

[EnvInject] - Variables injected successfully.
[EnvInject] - Injecting contributions.
Building remotely on H33 (ubuntu) in workspace <https://ci-builds.apache.org/job/POI/job/POI-DSL-SonarQube-Gradle/ws/>
[WS-CLEANUP] Deleting project workspace...
[WS-CLEANUP] Done
Updating https://svn.apache.org/repos/asf/poi/trunk at revision '2021-03-16T11:39:12.960 +0000'
U         src/java/org/apache/poi/POIDocument.java
U         src/java/org/apache/poi/poifs/filesystem/POIFSStream.java
U         src/java/org/apache/poi/poifs/filesystem/POIFSMiniStore.java
U         src/java/org/apache/poi/hssf/dev/BiffViewer.java
U         src/java/org/apache/poi/hssf/model/InternalSheet.java
U         src/java/org/apache/poi/hssf/model/InternalWorkbook.java
U         src/java/org/apache/poi/ss/formula/atp/AnalysisToolPak.java
AU        src/java/org/apache/poi/ss/formula/functions/Single.java
U         src/java/org/apache/poi/ss/formula/functions/TextFunction.java
U         src/scratchpad/src/org/apache/poi/hslf/usermodel/HSLFSlideShow.java
U         src/multimodule/ooxml-lite/java9/module-info.class
U         src/testcases/org/apache/poi/hssf/dev/TestEFBiffViewer.java
U         src/testcases/org/apache/poi/hssf/dev/TestFormulaViewer.java
U         src/testcases/org/apache/poi/hssf/dev/TestReSave.java
U         src/testcases/org/apache/poi/hssf/dev/TestRecordLister.java
U         build.gradle
U         sonar/pom.xml
U         sonar/ooxml/pom.xml
U         test-data/spreadsheet/FormulaEvalTestData.xls
U         .classpath
U         build.xml
U         maven/poi-ooxml-full.pom
U         maven/poi-ooxml-lite.pom
U         maven/poi-ooxml.pom

<-- Got one external: forrest.properties, svn url: https://svn.apache.org/repos/asf/poi/site/forrest.properties -->
Fetching 'https://svn.apache.org/repos/asf/poi/site/forrest.properties' at -1 into '<https://ci-builds.apache.org/job/POI/job/POI-DSL-SonarQube-Gradle/ws/forrest.properties'>
At revision 1887717


<-- Got one external: documentation, svn url: https://svn.apache.org/repos/asf/poi/site/src/documentation -->
Fetching 'https://svn.apache.org/repos/asf/poi/site/src/documentation' at -1 into '<https://ci-builds.apache.org/job/POI/job/POI-DSL-SonarQube-Gradle/ws/src/documentation'>
At revision 1887717

At revision 1887717

No changes for https://svn.apache.org/repos/asf/poi/site/forrest.properties since the previous build
No changes for https://svn.apache.org/repos/asf/poi/site/src/documentation since the previous build
Injecting SonarQube environment variables using the configuration: sonarcloud.io
[POI-DSL-SonarQube-Gradle] $ /bin/sh -xe /tmp/jenkins3360337417572658732.sh
+ svn status
?       build.javacheck.xml
    X   forrest.properties
X       src/documentation

Performing status on external item at 'src/documentation':
+ echo Java-Home: /home/jenkins/tools/java/latest11
Java-Home: /home/jenkins/tools/java/latest11
+ ls -al /home/jenkins/tools/java/latest11/
total 40
drwxr-xr-x  8 root root 4096 Dec  7 22:54 .
drwxr-xr-x 43 root root 4096 Feb 16 14:45 ..
drwxr-xr-x  2 root root 4096 Dec  7 22:54 bin
drwxr-xr-x  4 root root 4096 Dec  7 22:54 conf
drwxr-xr-x  3 root root 4096 Dec  7 22:54 include
drwxr-xr-x  2 root root 4096 Dec  7 22:54 jmods
drwxr-xr-x 73 root root 4096 Dec  7 22:54 legal
drwxr-xr-x  6 root root 4096 Dec  7 22:54 lib
-r--r--r--  1 root root  160 Sep 15 15:56 README.html
-rw-r--r--  1 root root 1278 Sep 15 15:56 release
+ ls -al /home/jenkins/tools/java/latest11/bin
total 640
drwxr-xr-x 2 root root   4096 Dec  7 22:54 .
drwxr-xr-x 8 root root   4096 Dec  7 22:54 ..
-rwxr-xr-x 1 root root  12984 Sep 15 15:56 jaotc
-rwxr-xr-x 1 root root  12864 Sep 15 15:56 jar
-rwxr-xr-x 1 root root  12864 Sep 15 15:56 jarsigner
-rwxr-xr-x 1 root root  12848 Sep 15 15:56 java
-rwxr-xr-x 1 root root  12896 Sep 15 15:56 javac
-rwxr-xr-x 1 root root  12896 Sep 15 15:56 javadoc
-rwxr-xr-x 1 root root  12864 Sep 15 15:56 javap
-rwxr-xr-x 1 root root  12864 Sep 15 15:56 jcmd
-rwxr-xr-x 1 root root  12912 Sep 15 15:56 jconsole
-rwxr-xr-x 1 root root  12864 Sep 15 15:56 jdb
-rwxr-xr-x 1 root root  12864 Sep 15 15:56 jdeprscan
-rwxr-xr-x 1 root root  12864 Sep 15 15:56 jdeps
-rwxr-xr-x 1 root root  12864 Sep 15 15:56 jfr
-rwxr-xr-x 1 root root  12864 Sep 15 15:56 jhsdb
-rwxr-xr-x 1 root root  12864 Sep 15 15:56 jimage
-rwxr-xr-x 1 root root  12896 Sep 15 15:56 jinfo
-rwxr-xr-x 1 root root  12896 Sep 15 15:56 jjs
-rwxr-xr-x 1 root root  12896 Sep 15 15:56 jlink
-rwxr-xr-x 1 root root  12896 Sep 15 15:56 jmap
-rwxr-xr-x 1 root root  12864 Sep 15 15:56 jmod
-rwxr-xr-x 1 root root  12864 Sep 15 15:56 jps
-rwxr-xr-x 1 root root  12904 Sep 15 15:56 jrunscript
-rwxr-xr-x 1 root root  12864 Sep 15 15:56 jshell
-rwxr-xr-x 1 root root  12896 Sep 15 15:56 jstack
-rwxr-xr-x 1 root root  12864 Sep 15 15:56 jstat
-rwxr-xr-x 1 root root  12864 Sep 15 15:56 jstatd
-rwxr-xr-x 1 root root  12864 Sep 15 15:56 keytool
-rwxr-xr-x 1 root root  12864 Sep 15 15:56 pack200
-rwxr-xr-x 1 root root  12864 Sep 15 15:56 rmic
-rwxr-xr-x 1 root root  12864 Sep 15 15:56 rmid
-rwxr-xr-x 1 root root  12872 Sep 15 15:56 rmiregistry
-rwxr-xr-x 1 root root  12864 Sep 15 15:56 serialver
-rwxr-xr-x 1 root root 121568 Sep 15 15:56 unpack200
+ /home/jenkins/tools/java/latest11/bin/java -version
java version "11.0.9" 2020-10-20 LTS
Java(TM) SE Runtime Environment 18.9 (build 11.0.9+7-LTS)
Java HotSpot(TM) 64-Bit Server VM 18.9 (build 11.0.9+7-LTS, mixed mode)
+ echo which java
which java
+ which java
/home/jenkins/tools/java/latest11/bin/java
+ java -version
java version "11.0.9" 2020-10-20 LTS
Java(TM) SE Runtime Environment 18.9 (build 11.0.9+7-LTS)
Java HotSpot(TM) 64-Bit Server VM 18.9 (build 11.0.9+7-LTS, mixed mode)
+ echo which javac
which javac
+ which javac
/home/jenkins/tools/java/latest11/bin/javac
+ javac -version
javac 11.0.9
+ echo Ant-Home:
Ant-Home:
+ ls -al
total 476
drwxr-xr-x 14 jenkins jenkins   4096 Feb 24 21:54 .
drwxr-xr-x  7 jenkins jenkins   4096 Mar 15 20:32 ..
-rw-r--r--  1 jenkins jenkins  14570 Mar 16 11:39 build.gradle
-rw-r--r--  1 jenkins jenkins    172 Mar 14 01:54 build.javacheck.xml
-rw-r--r--  1 jenkins jenkins 165104 Mar 16 11:39 build.xml
-rw-r--r--  1 jenkins jenkins   3264 Mar 16 11:39 .classpath
-rw-r--r--  1 jenkins jenkins   6325 Feb 15 15:25 doap_POI.rdf
-rw-r--r--  1 jenkins jenkins   2934 Feb 15 15:25 file-leak-detector.exclude
-rw-r--r--  1 jenkins jenkins   6229 Feb 15 15:25 forrest.properties
-rw-r--r--  1 jenkins jenkins     53 Feb 15 15:25 .gitattributes
drwxr-xr-x  3 jenkins jenkins   4096 Feb 15 15:24 .github
-rw-r--r--  1 jenkins jenkins    475 Feb 24 21:54 .gitignore
drwxr-xr-x  3 jenkins jenkins   4096 Feb 15 15:25 gradle
drwxr-xr-x  4 jenkins jenkins   4096 Feb 15 15:25 .gradle
-rwxr-xr-x  1 jenkins jenkins   5770 Feb 15 15:25 gradlew
-rw-r--r--  1 jenkins jenkins   3058 Feb 15 15:25 gradlew.bat
drwxr-xr-x  2 jenkins jenkins   4096 Feb 15 15:25 jenkins
-rw-r--r--  1 jenkins jenkins 167281 Mar 14 01:54 KEYS
drwxr-xr-x  2 jenkins jenkins   4096 Feb 15 15:25 legal
drwxr-xr-x  2 jenkins jenkins   4096 Mar 16 11:39 maven
drwxr-xr-x  3 jenkins jenkins   4096 Feb 24 21:54 osgi
-rw-r--r--  1 jenkins jenkins   4813 Feb 15 15:25 patch.xml
-rw-r--r--  1 jenkins jenkins    426 Feb 15 15:25 .project
-rw-r--r--  1 jenkins jenkins   4278 Feb 15 15:25 README.rst
drwxr-xr-x  2 jenkins jenkins   4096 Feb 15 15:25 .settings
-rw-r--r--  1 jenkins jenkins    556 Feb 15 15:25 settings.gradle
drwxr-xr-x  9 jenkins jenkins   4096 Mar 16 11:39 sonar
drwxr-xr-x 16 jenkins jenkins   4096 Feb 15 15:25 src
drwxr-xr-x  4 jenkins jenkins   4096 Mar 16 11:39 .svn
drwxr-xr-x 15 jenkins jenkins   4096 Feb 15 15:25 test-data
-rw-r--r--  1 jenkins jenkins    419 Feb 15 15:25 .travis.yml
+ echo which ant
which ant
+ which ant
/usr/bin/ant
+ ant -version
Apache Ant(TM) version 1.10.5 compiled on March 28 2019
+ echo <project default="test"><target name="test"><echo>Java ${ant.java.version}/${java.version}</echo><exec executable="javac"><arg value="-version"/></exec></target></project>
+ ant -f build.javacheck.xml -v
Apache Ant(TM) version 1.10.5 compiled on March 28 2019
Buildfile: <https://ci-builds.apache.org/job/POI/job/POI-DSL-SonarQube-Gradle/ws/build.javacheck.xml>
Detected Java version: 11 in: /usr/local/asfpackages/java/oraclejdk-11.0.9
Detected OS: Linux
parsing buildfile <https://ci-builds.apache.org/job/POI/job/POI-DSL-SonarQube-Gradle/ws/build.javacheck.xml> with URI = <https://ci-builds.apache.org/job/POI/job/POI-DSL-SonarQube-Gradle/ws/build.javacheck.xml>
Project base dir set to: <https://ci-builds.apache.org/job/POI/job/POI-DSL-SonarQube-Gradle/ws/>
Build sequence for target(s) `test' is [test]
Complete build sequence is [test, ]

test:
parsing buildfile jar:file:/usr/share/ant/lib/ant.jar!/org/apache/tools/ant/antlib.xml with URI = jar:file:/usr/share/ant/lib/ant.jar!/org/apache/tools/ant/antlib.xml from a zip file
     [echo] Java 11/11.0.9
     [exec] Current OS is Linux
     [exec] Executing 'javac' with arguments:
     [exec] '-version'
     [exec]
     [exec] The ' characters around the executable and arguments are
     [exec] not part of the command.
     [exec] javac 11.0.9

BUILD SUCCESSFUL
Total time: 1 second
+ exit 0
[Gradle] - Launching build.
[POI-DSL-SonarQube-Gradle] $ gradle -PenableSonar -Dsonar.login=**** -Dsonar.organization=apache -Dsonar.projectKey=poi-parent -Dsonar.host.url=https://sonarcloud.io check jacocoTestReport sonarqube
WARNING: An illegal reflective access operation has occurred
WARNING: Illegal reflective access by org.codehaus.groovy.reflection.CachedClass (file:/usr/lib/gradle/4.10.3/lib/groovy-all-2.4.15.jar) to method java.lang.Object.finalize()
WARNING: Please consider reporting this to the maintainers of org.codehaus.groovy.reflection.CachedClass
WARNING: Use --illegal-access=warn to enable warnings of further illegal reflective access operations
WARNING: All illegal access operations will be denied in a future release

> Configure project :
Enabling Sonar support

FAILURE: Build failed with an exception.

* Where:
Build file '<https://ci-builds.apache.org/job/POI/job/POI-DSL-SonarQube-Gradle/ws/build.gradle'> line: 45

* What went wrong:
A problem occurred evaluating root project 'poi'.
> Could not get unknown property 'Bundling' for {} of type org.gradle.api.internal.attributes.DefaultMutableAttributeContainer.

* Try:
Run with --stacktrace option to get the stack trace. Run with --info or --debug option to get more log output. Run with --scan to get full insights.

* Get more help at https://help.gradle.org

BUILD FAILED in 7s
Build step 'Invoke Gradle script' changed build result to FAILURE
Build step 'Invoke Gradle script' marked build as failure
WARN: Unable to locate 'report-task.txt' in the workspace. Did the SonarScanner succeed?

---------------------------------------------------------------------
To unsubscribe, e-mail: [hidden email]
For additional commands, e-mail: [hidden email]

Reply | Threaded
Open this post in threaded view
|

Build failed in Jenkins: POI » POI-DSL-SonarQube-Gradle #266

Apache Jenkins Server
See <https://ci-builds.apache.org/job/POI/job/POI-DSL-SonarQube-Gradle/266/display/redirect?page=changes>

Changes:

[Andreas Beeker] #65192 - Allow change of EncryptionMode


------------------------------------------
Started by an SCM change
Running as SYSTEM
[EnvInject] - Loading node environment variables.
[EnvInject] - Preparing an environment for the build.
[EnvInject] - Keeping Jenkins system variables.
[EnvInject] - Keeping Jenkins build variables.
[EnvInject] - Injecting as environment variables the properties content
LANG=en_US.UTF-8
FORREST_HOME=/home/jenkins/tools/forrest/latest

[EnvInject] - Variables injected successfully.
[EnvInject] - Injecting contributions.
Building remotely on H41 (ubuntu) in workspace <https://ci-builds.apache.org/job/POI/job/POI-DSL-SonarQube-Gradle/ws/>
[WS-CLEANUP] Deleting project workspace...
[WS-CLEANUP] Done
Updating https://svn.apache.org/repos/asf/poi/trunk at revision '2021-03-17T22:54:11.731 +0000'
U         src/java/org/apache/poi/POIDocument.java
U         src/java/org/apache/poi/hssf/usermodel/HSSFWorkbook.java
U         src/java/org/apache/poi/poifs/filesystem/POIFSStream.java
U         src/ooxml/testcases/org/apache/poi/poifs/crypt/tests/TestHxxFEncryption.java
U         build.gradle

<-- Got one external: forrest.properties, svn url: https://svn.apache.org/repos/asf/poi/site/forrest.properties -->
Fetching 'https://svn.apache.org/repos/asf/poi/site/forrest.properties' at -1 into '<https://ci-builds.apache.org/job/POI/job/POI-DSL-SonarQube-Gradle/ws/forrest.properties'>
At revision 1887764


<-- Got one external: documentation, svn url: https://svn.apache.org/repos/asf/poi/site/src/documentation -->
Fetching 'https://svn.apache.org/repos/asf/poi/site/src/documentation' at -1 into '<https://ci-builds.apache.org/job/POI/job/POI-DSL-SonarQube-Gradle/ws/src/documentation'>
U         src/documentation/content/xdocs/changes.xml
At revision 1887764

At revision 1887764

No changes for https://svn.apache.org/repos/asf/poi/site/forrest.properties since the previous build
Injecting SonarQube environment variables using the configuration: sonarcloud.io
[POI-DSL-SonarQube-Gradle] $ /bin/sh -xe /tmp/jenkins3797910358745672829.sh
+ svn status
?       build.javacheck.xml
    X   forrest.properties
X       src/documentation

Performing status on external item at 'src/documentation':
+ echo Java-Home: /home/jenkins/tools/java/latest11
Java-Home: /home/jenkins/tools/java/latest11
+ ls -al /home/jenkins/tools/java/latest11/
total 40
drwxr-xr-x  8 root root 4096 Dec  7 23:00 .
drwxr-xr-x 43 root root 4096 Feb 16 14:44 ..
drwxr-xr-x  2 root root 4096 Dec  7 23:00 bin
drwxr-xr-x  4 root root 4096 Dec  7 23:00 conf
drwxr-xr-x  3 root root 4096 Dec  7 23:00 include
drwxr-xr-x  2 root root 4096 Dec  7 23:00 jmods
drwxr-xr-x 73 root root 4096 Dec  7 23:00 legal
drwxr-xr-x  6 root root 4096 Dec  7 23:00 lib
-r--r--r--  1 root root  160 Sep 15  2020 README.html
-rw-r--r--  1 root root 1278 Sep 15  2020 release
+ ls -al /home/jenkins/tools/java/latest11/bin
total 640
drwxr-xr-x 2 root root   4096 Dec  7 23:00 .
drwxr-xr-x 8 root root   4096 Dec  7 23:00 ..
-rwxr-xr-x 1 root root  12984 Sep 15  2020 jaotc
-rwxr-xr-x 1 root root  12864 Sep 15  2020 jar
-rwxr-xr-x 1 root root  12864 Sep 15  2020 jarsigner
-rwxr-xr-x 1 root root  12848 Sep 15  2020 java
-rwxr-xr-x 1 root root  12896 Sep 15  2020 javac
-rwxr-xr-x 1 root root  12896 Sep 15  2020 javadoc
-rwxr-xr-x 1 root root  12864 Sep 15  2020 javap
-rwxr-xr-x 1 root root  12864 Sep 15  2020 jcmd
-rwxr-xr-x 1 root root  12912 Sep 15  2020 jconsole
-rwxr-xr-x 1 root root  12864 Sep 15  2020 jdb
-rwxr-xr-x 1 root root  12864 Sep 15  2020 jdeprscan
-rwxr-xr-x 1 root root  12864 Sep 15  2020 jdeps
-rwxr-xr-x 1 root root  12864 Sep 15  2020 jfr
-rwxr-xr-x 1 root root  12864 Sep 15  2020 jhsdb
-rwxr-xr-x 1 root root  12864 Sep 15  2020 jimage
-rwxr-xr-x 1 root root  12896 Sep 15  2020 jinfo
-rwxr-xr-x 1 root root  12896 Sep 15  2020 jjs
-rwxr-xr-x 1 root root  12896 Sep 15  2020 jlink
-rwxr-xr-x 1 root root  12896 Sep 15  2020 jmap
-rwxr-xr-x 1 root root  12864 Sep 15  2020 jmod
-rwxr-xr-x 1 root root  12864 Sep 15  2020 jps
-rwxr-xr-x 1 root root  12904 Sep 15  2020 jrunscript
-rwxr-xr-x 1 root root  12864 Sep 15  2020 jshell
-rwxr-xr-x 1 root root  12896 Sep 15  2020 jstack
-rwxr-xr-x 1 root root  12864 Sep 15  2020 jstat
-rwxr-xr-x 1 root root  12864 Sep 15  2020 jstatd
-rwxr-xr-x 1 root root  12864 Sep 15  2020 keytool
-rwxr-xr-x 1 root root  12864 Sep 15  2020 pack200
-rwxr-xr-x 1 root root  12864 Sep 15  2020 rmic
-rwxr-xr-x 1 root root  12864 Sep 15  2020 rmid
-rwxr-xr-x 1 root root  12872 Sep 15  2020 rmiregistry
-rwxr-xr-x 1 root root  12864 Sep 15  2020 serialver
-rwxr-xr-x 1 root root 121568 Sep 15  2020 unpack200
+ /home/jenkins/tools/java/latest11/bin/java -version
java version "11.0.9" 2020-10-20 LTS
Java(TM) SE Runtime Environment 18.9 (build 11.0.9+7-LTS)
Java HotSpot(TM) 64-Bit Server VM 18.9 (build 11.0.9+7-LTS, mixed mode)
+ echo which java
which java
+ which java
/home/jenkins/tools/java/latest11/bin/java
+ java -version
java version "11.0.9" 2020-10-20 LTS
Java(TM) SE Runtime Environment 18.9 (build 11.0.9+7-LTS)
Java HotSpot(TM) 64-Bit Server VM 18.9 (build 11.0.9+7-LTS, mixed mode)
+ echo which javac
which javac
+ which javac
/home/jenkins/tools/java/latest11/bin/javac
+ javac -version
javac 11.0.9
+ echo Ant-Home:
Ant-Home:
+ ls -al
total 484
drwxr-xr-x 16 jenkins jenkins   4096 Feb 22 00:24 .
drwxr-xr-x  6 jenkins jenkins   4096 Mar 10 00:32 ..
drwxr-xr-x 31 jenkins jenkins   4096 Feb 21 18:51 build
-rw-r--r--  1 jenkins jenkins  14570 Mar 17 22:54 build.gradle
-rw-r--r--  1 jenkins jenkins    172 Mar 15 00:09 build.javacheck.xml
-rw-r--r--  1 jenkins jenkins 165104 Mar 14 22:54 build.xml
-rw-r--r--  1 jenkins jenkins   3264 Mar 14 22:54 .classpath
-rw-r--r--  1 jenkins jenkins   6325 Feb 21 18:39 doap_POI.rdf
-rw-r--r--  1 jenkins jenkins   2934 Feb 21 18:39 file-leak-detector.exclude
-rw-r--r--  1 jenkins jenkins   6229 Feb 21 18:39 forrest.properties
-rw-r--r--  1 jenkins jenkins     53 Feb 21 18:39 .gitattributes
drwxr-xr-x  3 jenkins jenkins   4096 Feb 21 18:39 .github
-rw-r--r--  1 jenkins jenkins    475 Feb 22 00:24 .gitignore
drwxr-xr-x  3 jenkins jenkins   4096 Feb 21 18:39 gradle
drwxr-xr-x  6 jenkins jenkins   4096 Feb 21 18:40 .gradle
-rwxr-xr-x  1 jenkins jenkins   5770 Feb 21 18:39 gradlew
-rw-r--r--  1 jenkins jenkins   3058 Feb 21 18:39 gradlew.bat
drwxr-xr-x  2 jenkins jenkins   4096 Feb 21 18:39 jenkins
-rw-r--r--  1 jenkins jenkins 167281 Mar 11 21:54 KEYS
drwxr-xr-x  2 jenkins jenkins   4096 Feb 21 18:39 legal
drwxr-xr-x 10 jenkins jenkins   4096 Feb 22 00:25 lib
drwxr-xr-x  2 jenkins jenkins   4096 Mar 14 22:54 maven
drwxr-xr-x  3 jenkins jenkins   4096 Feb 22 00:24 osgi
-rw-r--r--  1 jenkins jenkins   4813 Feb 21 18:39 patch.xml
-rw-r--r--  1 jenkins jenkins    426 Feb 21 18:39 .project
-rw-r--r--  1 jenkins jenkins   4278 Feb 21 18:39 README.rst
drwxr-xr-x  2 jenkins jenkins   4096 Feb 21 18:39 .settings
-rw-r--r--  1 jenkins jenkins    556 Feb 21 18:39 settings.gradle
drwxr-xr-x  9 jenkins jenkins   4096 Mar 14 23:54 sonar
drwxr-xr-x 16 jenkins jenkins   4096 Feb 21 18:39 src
drwxr-xr-x  4 jenkins jenkins   4096 Mar 17 22:54 .svn
drwxr-xr-x 15 jenkins jenkins   4096 Feb 21 18:39 test-data
-rw-r--r--  1 jenkins jenkins    419 Feb 21 18:39 .travis.yml
+ echo which ant
which ant
+ which ant
/usr/bin/ant
+ ant -version
Apache Ant(TM) version 1.10.5 compiled on March 28 2019
+ echo <project default="test"><target name="test"><echo>Java ${ant.java.version}/${java.version}</echo><exec executable="javac"><arg value="-version"/></exec></target></project>
+ ant -f build.javacheck.xml -v
Apache Ant(TM) version 1.10.5 compiled on March 28 2019
Buildfile: <https://ci-builds.apache.org/job/POI/job/POI-DSL-SonarQube-Gradle/ws/build.javacheck.xml>
Detected Java version: 11 in: /usr/local/asfpackages/java/oraclejdk-11.0.9
Detected OS: Linux
parsing buildfile <https://ci-builds.apache.org/job/POI/job/POI-DSL-SonarQube-Gradle/ws/build.javacheck.xml> with URI = <https://ci-builds.apache.org/job/POI/job/POI-DSL-SonarQube-Gradle/ws/build.javacheck.xml>
Project base dir set to: <https://ci-builds.apache.org/job/POI/job/POI-DSL-SonarQube-Gradle/ws/>
Build sequence for target(s) `test' is [test]
Complete build sequence is [test, ]

test:
parsing buildfile jar:file:/usr/share/ant/lib/ant.jar!/org/apache/tools/ant/antlib.xml with URI = jar:file:/usr/share/ant/lib/ant.jar!/org/apache/tools/ant/antlib.xml from a zip file
     [echo] Java 11/11.0.9
     [exec] Current OS is Linux
     [exec] Executing 'javac' with arguments:
     [exec] '-version'
     [exec]
     [exec] The ' characters around the executable and arguments are
     [exec] not part of the command.
     [exec] javac 11.0.9

BUILD SUCCESSFUL
Total time: 0 seconds
+ exit 0
[Gradle] - Launching build.
[POI-DSL-SonarQube-Gradle] $ gradle -PenableSonar -Dsonar.login=**** -Dsonar.organization=apache -Dsonar.projectKey=poi-parent -Dsonar.host.url=https://sonarcloud.io check jacocoTestReport sonarqube
To honour the JVM settings for this build a new JVM will be forked. Please consider using the daemon: https://docs.gradle.org/6.1/userguide/gradle_daemon.html.
Daemon will be stopped at the end of the build stopping after processing

> Configure project :
Enabling Sonar support
Trying to override old definition of datatype junit
writing file <https://ci-builds.apache.org/job/POI/job/POI-DSL-SonarQube-Gradle/ws/build/ooxml/../../lib/ooxml/xmlbeans-5.0.0.jar>

FAILURE: Build failed with an exception.

* Where:
Build file '<https://ci-builds.apache.org/job/POI/job/POI-DSL-SonarQube-Gradle/ws/build.gradle'> line: 279

* What went wrong:
A problem occurred evaluating root project 'poi'.
> https://ci-builds.apache.org/job/POI/job/POI-XMLBeans-DSL-1.8/lastSuccessfulBuild/artifact/build/xmlbeans-5.0.0.jar

* Try:
Run with --stacktrace option to get the stack trace. Run with --info or --debug option to get more log output. Run with --scan to get full insights.

* Get more help at https://help.gradle.org

Deprecated Gradle features were used in this build, making it incompatible with Gradle 7.0.
Use '--warning-mode all' to show the individual deprecation warnings.
See https://docs.gradle.org/6.1/userguide/command_line_interface.html#sec:command_line_warnings

BUILD FAILED in 10s
Build step 'Invoke Gradle script' changed build result to FAILURE
Build step 'Invoke Gradle script' marked build as failure

---------------------------------------------------------------------
To unsubscribe, e-mail: [hidden email]
For additional commands, e-mail: [hidden email]

Reply | Threaded
Open this post in threaded view
|

Build failed in Jenkins: POI » POI-DSL-SonarQube-Gradle #267

Apache Jenkins Server
See <https://ci-builds.apache.org/job/POI/job/POI-DSL-SonarQube-Gradle/267/display/redirect?page=changes>

Changes:

[Dominik Stadler] Allow negative numbers in conditional part of format string

Closes #229

[Dominik Stadler] Enhance javadoc and coverage for IOUtils


------------------------------------------
Started by an SCM change
Running as SYSTEM
[EnvInject] - Loading node environment variables.
[EnvInject] - Preparing an environment for the build.
[EnvInject] - Keeping Jenkins system variables.
[EnvInject] - Keeping Jenkins build variables.
[EnvInject] - Injecting as environment variables the properties content
LANG=en_US.UTF-8
FORREST_HOME=/home/jenkins/tools/forrest/latest

[EnvInject] - Variables injected successfully.
[EnvInject] - Injecting contributions.
Building remotely on H33 (ubuntu) in workspace <https://ci-builds.apache.org/job/POI/job/POI-DSL-SonarQube-Gradle/ws/>
[WS-CLEANUP] Deleting project workspace...
[WS-CLEANUP] Done
Updating https://svn.apache.org/repos/asf/poi/trunk at revision '2021-03-19T09:54:12.887 +0000'
U         src/java/org/apache/poi/ss/format/CellFormatPart.java
U         src/java/org/apache/poi/util/IOUtils.java
U         src/java/org/apache/poi/POIDocument.java
U         src/java/org/apache/poi/hssf/usermodel/HSSFWorkbook.java
U         src/testcases/org/apache/poi/util/TestIOUtils.java
U         src/ooxml/testcases/org/apache/poi/poifs/crypt/tests/TestHxxFEncryption.java
U         test-data/spreadsheet/FormatConditionTests.xlsx

<-- Got one external: forrest.properties, svn url: https://svn.apache.org/repos/asf/poi/site/forrest.properties -->
Fetching 'https://svn.apache.org/repos/asf/poi/site/forrest.properties' at -1 into '<https://ci-builds.apache.org/job/POI/job/POI-DSL-SonarQube-Gradle/ws/forrest.properties'>
At revision 1887802


<-- Got one external: documentation, svn url: https://svn.apache.org/repos/asf/poi/site/src/documentation -->
Fetching 'https://svn.apache.org/repos/asf/poi/site/src/documentation' at -1 into '<https://ci-builds.apache.org/job/POI/job/POI-DSL-SonarQube-Gradle/ws/src/documentation'>
U         src/documentation/content/xdocs/changes.xml
At revision 1887802

At revision 1887802

No changes for https://svn.apache.org/repos/asf/poi/site/forrest.properties since the previous build
No changes for https://svn.apache.org/repos/asf/poi/site/src/documentation since the previous build
Injecting SonarQube environment variables using the configuration: sonarcloud.io
[POI-DSL-SonarQube-Gradle] $ /bin/sh -xe /tmp/jenkins8150354242163268044.sh
+ svn status
?       build.javacheck.xml
    X   forrest.properties
X       src/documentation

Performing status on external item at 'src/documentation':
+ echo Java-Home: /home/jenkins/tools/java/latest11
Java-Home: /home/jenkins/tools/java/latest11
+ ls -al /home/jenkins/tools/java/latest11/
total 40
drwxr-xr-x  8 root root 4096 Dec  7 22:54 .
drwxr-xr-x 43 root root 4096 Feb 16 14:45 ..
drwxr-xr-x  2 root root 4096 Dec  7 22:54 bin
drwxr-xr-x  4 root root 4096 Dec  7 22:54 conf
drwxr-xr-x  3 root root 4096 Dec  7 22:54 include
drwxr-xr-x  2 root root 4096 Dec  7 22:54 jmods
drwxr-xr-x 73 root root 4096 Dec  7 22:54 legal
drwxr-xr-x  6 root root 4096 Dec  7 22:54 lib
-r--r--r--  1 root root  160 Sep 15  2020 README.html
-rw-r--r--  1 root root 1278 Sep 15  2020 release
+ ls -al /home/jenkins/tools/java/latest11/bin
total 640
drwxr-xr-x 2 root root   4096 Dec  7 22:54 .
drwxr-xr-x 8 root root   4096 Dec  7 22:54 ..
-rwxr-xr-x 1 root root  12984 Sep 15  2020 jaotc
-rwxr-xr-x 1 root root  12864 Sep 15  2020 jar
-rwxr-xr-x 1 root root  12864 Sep 15  2020 jarsigner
-rwxr-xr-x 1 root root  12848 Sep 15  2020 java
-rwxr-xr-x 1 root root  12896 Sep 15  2020 javac
-rwxr-xr-x 1 root root  12896 Sep 15  2020 javadoc
-rwxr-xr-x 1 root root  12864 Sep 15  2020 javap
-rwxr-xr-x 1 root root  12864 Sep 15  2020 jcmd
-rwxr-xr-x 1 root root  12912 Sep 15  2020 jconsole
-rwxr-xr-x 1 root root  12864 Sep 15  2020 jdb
-rwxr-xr-x 1 root root  12864 Sep 15  2020 jdeprscan
-rwxr-xr-x 1 root root  12864 Sep 15  2020 jdeps
-rwxr-xr-x 1 root root  12864 Sep 15  2020 jfr
-rwxr-xr-x 1 root root  12864 Sep 15  2020 jhsdb
-rwxr-xr-x 1 root root  12864 Sep 15  2020 jimage
-rwxr-xr-x 1 root root  12896 Sep 15  2020 jinfo
-rwxr-xr-x 1 root root  12896 Sep 15  2020 jjs
-rwxr-xr-x 1 root root  12896 Sep 15  2020 jlink
-rwxr-xr-x 1 root root  12896 Sep 15  2020 jmap
-rwxr-xr-x 1 root root  12864 Sep 15  2020 jmod
-rwxr-xr-x 1 root root  12864 Sep 15  2020 jps
-rwxr-xr-x 1 root root  12904 Sep 15  2020 jrunscript
-rwxr-xr-x 1 root root  12864 Sep 15  2020 jshell
-rwxr-xr-x 1 root root  12896 Sep 15  2020 jstack
-rwxr-xr-x 1 root root  12864 Sep 15  2020 jstat
-rwxr-xr-x 1 root root  12864 Sep 15  2020 jstatd
-rwxr-xr-x 1 root root  12864 Sep 15  2020 keytool
-rwxr-xr-x 1 root root  12864 Sep 15  2020 pack200
-rwxr-xr-x 1 root root  12864 Sep 15  2020 rmic
-rwxr-xr-x 1 root root  12864 Sep 15  2020 rmid
-rwxr-xr-x 1 root root  12872 Sep 15  2020 rmiregistry
-rwxr-xr-x 1 root root  12864 Sep 15  2020 serialver
-rwxr-xr-x 1 root root 121568 Sep 15  2020 unpack200
+ /home/jenkins/tools/java/latest11/bin/java -version
java version "11.0.9" 2020-10-20 LTS
Java(TM) SE Runtime Environment 18.9 (build 11.0.9+7-LTS)
Java HotSpot(TM) 64-Bit Server VM 18.9 (build 11.0.9+7-LTS, mixed mode)
+ echo which java
which java
+ which java
/home/jenkins/tools/java/latest11/bin/java
+ java -version
java version "11.0.9" 2020-10-20 LTS
Java(TM) SE Runtime Environment 18.9 (build 11.0.9+7-LTS)
Java HotSpot(TM) 64-Bit Server VM 18.9 (build 11.0.9+7-LTS, mixed mode)
+ echo which javac
which javac
+ which javac
/home/jenkins/tools/java/latest11/bin/javac
+ javac -version
javac 11.0.9
+ echo Ant-Home:
Ant-Home:
+ ls -al
total 476
drwxr-xr-x 14 jenkins jenkins   4096 Feb 24 21:54 .
drwxr-xr-x  8 jenkins jenkins   4096 Mar 18 01:04 ..
-rw-r--r--  1 jenkins jenkins  14570 Mar 16 11:39 build.gradle
-rw-r--r--  1 jenkins jenkins    172 Mar 16 11:39 build.javacheck.xml
-rw-r--r--  1 jenkins jenkins 165104 Mar 16 11:39 build.xml
-rw-r--r--  1 jenkins jenkins   3264 Mar 16 11:39 .classpath
-rw-r--r--  1 jenkins jenkins   6325 Feb 15 15:25 doap_POI.rdf
-rw-r--r--  1 jenkins jenkins   2934 Feb 15 15:25 file-leak-detector.exclude
-rw-r--r--  1 jenkins jenkins   6229 Feb 15 15:25 forrest.properties
-rw-r--r--  1 jenkins jenkins     53 Feb 15 15:25 .gitattributes
drwxr-xr-x  3 jenkins jenkins   4096 Feb 15 15:24 .github
-rw-r--r--  1 jenkins jenkins    475 Feb 24 21:54 .gitignore
drwxr-xr-x  3 jenkins jenkins   4096 Feb 15 15:25 gradle
drwxr-xr-x  4 jenkins jenkins   4096 Feb 15 15:25 .gradle
-rwxr-xr-x  1 jenkins jenkins   5770 Feb 15 15:25 gradlew
-rw-r--r--  1 jenkins jenkins   3058 Feb 15 15:25 gradlew.bat
drwxr-xr-x  2 jenkins jenkins   4096 Feb 15 15:25 jenkins
-rw-r--r--  1 jenkins jenkins 167281 Mar 14 01:54 KEYS
drwxr-xr-x  2 jenkins jenkins   4096 Feb 15 15:25 legal
drwxr-xr-x  2 jenkins jenkins   4096 Mar 16 11:39 maven
drwxr-xr-x  3 jenkins jenkins   4096 Feb 24 21:54 osgi
-rw-r--r--  1 jenkins jenkins   4813 Feb 15 15:25 patch.xml
-rw-r--r--  1 jenkins jenkins    426 Feb 15 15:25 .project
-rw-r--r--  1 jenkins jenkins   4278 Feb 15 15:25 README.rst
drwxr-xr-x  2 jenkins jenkins   4096 Feb 15 15:25 .settings
-rw-r--r--  1 jenkins jenkins    556 Feb 15 15:25 settings.gradle
drwxr-xr-x  9 jenkins jenkins   4096 Mar 16 11:39 sonar
drwxr-xr-x 16 jenkins jenkins   4096 Feb 15 15:25 src
drwxr-xr-x  4 jenkins jenkins   4096 Mar 19 09:54 .svn
drwxr-xr-x 15 jenkins jenkins   4096 Feb 15 15:25 test-data
-rw-r--r--  1 jenkins jenkins    419 Feb 15 15:25 .travis.yml
+ echo which ant
which ant
+ which ant
/usr/bin/ant
+ ant -version
Apache Ant(TM) version 1.10.5 compiled on March 28 2019
+ echo <project default="test"><target name="test"><echo>Java ${ant.java.version}/${java.version}</echo><exec executable="javac"><arg value="-version"/></exec></target></project>
+ ant -f build.javacheck.xml -v
Apache Ant(TM) version 1.10.5 compiled on March 28 2019
Buildfile: <https://ci-builds.apache.org/job/POI/job/POI-DSL-SonarQube-Gradle/ws/build.javacheck.xml>
Detected Java version: 11 in: /usr/local/asfpackages/java/oraclejdk-11.0.9
Detected OS: Linux
parsing buildfile <https://ci-builds.apache.org/job/POI/job/POI-DSL-SonarQube-Gradle/ws/build.javacheck.xml> with URI = <https://ci-builds.apache.org/job/POI/job/POI-DSL-SonarQube-Gradle/ws/build.javacheck.xml>
Project base dir set to: <https://ci-builds.apache.org/job/POI/job/POI-DSL-SonarQube-Gradle/ws/>
Build sequence for target(s) `test' is [test]
Complete build sequence is [test, ]

test:
parsing buildfile jar:file:/usr/share/ant/lib/ant.jar!/org/apache/tools/ant/antlib.xml with URI = jar:file:/usr/share/ant/lib/ant.jar!/org/apache/tools/ant/antlib.xml from a zip file
     [echo] Java 11/11.0.9
     [exec] Current OS is Linux
     [exec] Executing 'javac' with arguments:
     [exec] '-version'
     [exec]
     [exec] The ' characters around the executable and arguments are
     [exec] not part of the command.
     [exec] javac 11.0.9

BUILD SUCCESSFUL
Total time: 1 second
+ exit 0
[Gradle] - Launching build.
[POI-DSL-SonarQube-Gradle] $ gradle -PenableSonar -Dsonar.login=**** -Dsonar.organization=apache -Dsonar.projectKey=poi-parent -Dsonar.host.url=https://sonarcloud.io check jacocoTestReport sonarqube
WARNING: An illegal reflective access operation has occurred
WARNING: Illegal reflective access by org.codehaus.groovy.reflection.CachedClass (file:/usr/lib/gradle/4.10.3/lib/groovy-all-2.4.15.jar) to method java.lang.Object.finalize()
WARNING: Please consider reporting this to the maintainers of org.codehaus.groovy.reflection.CachedClass
WARNING: Use --illegal-access=warn to enable warnings of further illegal reflective access operations
WARNING: All illegal access operations will be denied in a future release

> Configure project :
Enabling Sonar support

FAILURE: Build failed with an exception.

* Where:
Build file '<https://ci-builds.apache.org/job/POI/job/POI-DSL-SonarQube-Gradle/ws/build.gradle'> line: 45

* What went wrong:
A problem occurred evaluating root project 'poi'.
> Could not get unknown property 'Bundling' for {} of type org.gradle.api.internal.attributes.DefaultMutableAttributeContainer.

* Try:
Run with --stacktrace option to get the stack trace. Run with --info or --debug option to get more log output. Run with --scan to get full insights.

* Get more help at https://help.gradle.org

BUILD FAILED in 6s
Build step 'Invoke Gradle script' changed build result to FAILURE
Build step 'Invoke Gradle script' marked build as failure
WARN: Unable to locate 'report-task.txt' in the workspace. Did the SonarScanner succeed?

---------------------------------------------------------------------
To unsubscribe, e-mail: [hidden email]
For additional commands, e-mail: [hidden email]

Reply | Threaded
Open this post in threaded view
|

Build failed in Jenkins: POI » POI-DSL-SonarQube-Gradle #268

Apache Jenkins Server
See <https://ci-builds.apache.org/job/POI/job/POI-DSL-SonarQube-Gradle/268/display/redirect?page=changes>

Changes:

[PJ Fanning] add disabled test for corrupt file


------------------------------------------
Started by an SCM change
Running as SYSTEM
[EnvInject] - Loading node environment variables.
[EnvInject] - Preparing an environment for the build.
[EnvInject] - Keeping Jenkins system variables.
[EnvInject] - Keeping Jenkins build variables.
[EnvInject] - Injecting as environment variables the properties content
LANG=en_US.UTF-8
FORREST_HOME=/home/jenkins/tools/forrest/latest

[EnvInject] - Variables injected successfully.
[EnvInject] - Injecting contributions.
Building remotely on H41 (ubuntu) in workspace <https://ci-builds.apache.org/job/POI/job/POI-DSL-SonarQube-Gradle/ws/>
[WS-CLEANUP] Deleting project workspace...
[WS-CLEANUP] Done
Updating https://svn.apache.org/repos/asf/poi/trunk at revision '2021-03-19T21:09:14.248 +0000'
U         src/scratchpad/testcases/org/apache/poi/hsmf/TestBasics.java
U         src/java/org/apache/poi/ss/format/CellFormatPart.java
U         src/java/org/apache/poi/util/IOUtils.java
U         src/testcases/org/apache/poi/util/TestIOUtils.java
U         test-data/spreadsheet/FormatConditionTests.xlsx

<-- Got one external: forrest.properties, svn url: https://svn.apache.org/repos/asf/poi/site/forrest.properties -->
Fetching 'https://svn.apache.org/repos/asf/poi/site/forrest.properties' at -1 into '<https://ci-builds.apache.org/job/POI/job/POI-DSL-SonarQube-Gradle/ws/forrest.properties'>
At revision 1887827


<-- Got one external: documentation, svn url: https://svn.apache.org/repos/asf/poi/site/src/documentation -->
Fetching 'https://svn.apache.org/repos/asf/poi/site/src/documentation' at -1 into '<https://ci-builds.apache.org/job/POI/job/POI-DSL-SonarQube-Gradle/ws/src/documentation'>
At revision 1887827

At revision 1887827

No changes for https://svn.apache.org/repos/asf/poi/site/forrest.properties since the previous build
No changes for https://svn.apache.org/repos/asf/poi/site/src/documentation since the previous build
Injecting SonarQube environment variables using the configuration: sonarcloud.io
[POI-DSL-SonarQube-Gradle] $ /bin/sh -xe /tmp/jenkins1078175690333212834.sh
+ svn status
?       build.javacheck.xml
    X   forrest.properties
X       src/documentation

Performing status on external item at 'src/documentation':
+ echo Java-Home: /home/jenkins/tools/java/latest11
Java-Home: /home/jenkins/tools/java/latest11
+ ls -al /home/jenkins/tools/java/latest11/
total 40
drwxr-xr-x  8 root root 4096 Dec  7 23:00 .
drwxr-xr-x 43 root root 4096 Feb 16 14:44 ..
drwxr-xr-x  2 root root 4096 Dec  7 23:00 bin
drwxr-xr-x  4 root root 4096 Dec  7 23:00 conf
drwxr-xr-x  3 root root 4096 Dec  7 23:00 include
drwxr-xr-x  2 root root 4096 Dec  7 23:00 jmods
drwxr-xr-x 73 root root 4096 Dec  7 23:00 legal
drwxr-xr-x  6 root root 4096 Dec  7 23:00 lib
-r--r--r--  1 root root  160 Sep 15  2020 README.html
-rw-r--r--  1 root root 1278 Sep 15  2020 release
+ ls -al /home/jenkins/tools/java/latest11/bin
total 640
drwxr-xr-x 2 root root   4096 Dec  7 23:00 .
drwxr-xr-x 8 root root   4096 Dec  7 23:00 ..
-rwxr-xr-x 1 root root  12984 Sep 15  2020 jaotc
-rwxr-xr-x 1 root root  12864 Sep 15  2020 jar
-rwxr-xr-x 1 root root  12864 Sep 15  2020 jarsigner
-rwxr-xr-x 1 root root  12848 Sep 15  2020 java
-rwxr-xr-x 1 root root  12896 Sep 15  2020 javac
-rwxr-xr-x 1 root root  12896 Sep 15  2020 javadoc
-rwxr-xr-x 1 root root  12864 Sep 15  2020 javap
-rwxr-xr-x 1 root root  12864 Sep 15  2020 jcmd
-rwxr-xr-x 1 root root  12912 Sep 15  2020 jconsole
-rwxr-xr-x 1 root root  12864 Sep 15  2020 jdb
-rwxr-xr-x 1 root root  12864 Sep 15  2020 jdeprscan
-rwxr-xr-x 1 root root  12864 Sep 15  2020 jdeps
-rwxr-xr-x 1 root root  12864 Sep 15  2020 jfr
-rwxr-xr-x 1 root root  12864 Sep 15  2020 jhsdb
-rwxr-xr-x 1 root root  12864 Sep 15  2020 jimage
-rwxr-xr-x 1 root root  12896 Sep 15  2020 jinfo
-rwxr-xr-x 1 root root  12896 Sep 15  2020 jjs
-rwxr-xr-x 1 root root  12896 Sep 15  2020 jlink
-rwxr-xr-x 1 root root  12896 Sep 15  2020 jmap
-rwxr-xr-x 1 root root  12864 Sep 15  2020 jmod
-rwxr-xr-x 1 root root  12864 Sep 15  2020 jps
-rwxr-xr-x 1 root root  12904 Sep 15  2020 jrunscript
-rwxr-xr-x 1 root root  12864 Sep 15  2020 jshell
-rwxr-xr-x 1 root root  12896 Sep 15  2020 jstack
-rwxr-xr-x 1 root root  12864 Sep 15  2020 jstat
-rwxr-xr-x 1 root root  12864 Sep 15  2020 jstatd
-rwxr-xr-x 1 root root  12864 Sep 15  2020 keytool
-rwxr-xr-x 1 root root  12864 Sep 15  2020 pack200
-rwxr-xr-x 1 root root  12864 Sep 15  2020 rmic
-rwxr-xr-x 1 root root  12864 Sep 15  2020 rmid
-rwxr-xr-x 1 root root  12872 Sep 15  2020 rmiregistry
-rwxr-xr-x 1 root root  12864 Sep 15  2020 serialver
-rwxr-xr-x 1 root root 121568 Sep 15  2020 unpack200
+ /home/jenkins/tools/java/latest11/bin/java -version
java version "11.0.9" 2020-10-20 LTS
Java(TM) SE Runtime Environment 18.9 (build 11.0.9+7-LTS)
Java HotSpot(TM) 64-Bit Server VM 18.9 (build 11.0.9+7-LTS, mixed mode)
+ echo which java
which java
+ which java
/home/jenkins/tools/java/latest11/bin/java
+ java -version
java version "11.0.9" 2020-10-20 LTS
Java(TM) SE Runtime Environment 18.9 (build 11.0.9+7-LTS)
Java HotSpot(TM) 64-Bit Server VM 18.9 (build 11.0.9+7-LTS, mixed mode)
+ echo which javac
which javac
+ which javac
/home/jenkins/tools/java/latest11/bin/javac
+ javac -version
javac 11.0.9
+ echo Ant-Home:
Ant-Home:
+ ls -al
total 484
drwxr-xr-x 16 jenkins jenkins   4096 Feb 22 00:24 .
drwxr-xr-x  6 jenkins jenkins   4096 Mar 10 00:32 ..
drwxr-xr-x 31 jenkins jenkins   4096 Feb 21 18:51 build
-rw-r--r--  1 jenkins jenkins  14570 Mar 17 22:54 build.gradle
-rw-r--r--  1 jenkins jenkins    172 Mar 17 22:54 build.javacheck.xml
-rw-r--r--  1 jenkins jenkins 165104 Mar 14 22:54 build.xml
-rw-r--r--  1 jenkins jenkins   3264 Mar 14 22:54 .classpath
-rw-r--r--  1 jenkins jenkins   6325 Feb 21 18:39 doap_POI.rdf
-rw-r--r--  1 jenkins jenkins   2934 Feb 21 18:39 file-leak-detector.exclude
-rw-r--r--  1 jenkins jenkins   6229 Feb 21 18:39 forrest.properties
-rw-r--r--  1 jenkins jenkins     53 Feb 21 18:39 .gitattributes
drwxr-xr-x  3 jenkins jenkins   4096 Feb 21 18:39 .github
-rw-r--r--  1 jenkins jenkins    475 Feb 22 00:24 .gitignore
drwxr-xr-x  3 jenkins jenkins   4096 Feb 21 18:39 gradle
drwxr-xr-x  6 jenkins jenkins   4096 Feb 21 18:40 .gradle
-rwxr-xr-x  1 jenkins jenkins   5770 Feb 21 18:39 gradlew
-rw-r--r--  1 jenkins jenkins   3058 Feb 21 18:39 gradlew.bat
drwxr-xr-x  2 jenkins jenkins   4096 Feb 21 18:39 jenkins
-rw-r--r--  1 jenkins jenkins 167281 Mar 11 21:54 KEYS
drwxr-xr-x  2 jenkins jenkins   4096 Feb 21 18:39 legal
drwxr-xr-x 10 jenkins jenkins   4096 Feb 22 00:25 lib
drwxr-xr-x  2 jenkins jenkins   4096 Mar 14 22:54 maven
drwxr-xr-x  3 jenkins jenkins   4096 Feb 22 00:24 osgi
-rw-r--r--  1 jenkins jenkins   4813 Feb 21 18:39 patch.xml
-rw-r--r--  1 jenkins jenkins    426 Feb 21 18:39 .project
-rw-r--r--  1 jenkins jenkins   4278 Feb 21 18:39 README.rst
drwxr-xr-x  2 jenkins jenkins   4096 Feb 21 18:39 .settings
-rw-r--r--  1 jenkins jenkins    556 Feb 21 18:39 settings.gradle
drwxr-xr-x  9 jenkins jenkins   4096 Mar 14 23:54 sonar
drwxr-xr-x 16 jenkins jenkins   4096 Feb 21 18:39 src
drwxr-xr-x  4 jenkins jenkins   4096 Mar 19 21:09 .svn
drwxr-xr-x 15 jenkins jenkins   4096 Feb 21 18:39 test-data
-rw-r--r--  1 jenkins jenkins    419 Feb 21 18:39 .travis.yml
+ echo which ant
which ant
+ which ant
/usr/bin/ant
+ ant -version
Apache Ant(TM) version 1.10.5 compiled on March 28 2019
+ echo <project default="test"><target name="test"><echo>Java ${ant.java.version}/${java.version}</echo><exec executable="javac"><arg value="-version"/></exec></target></project>
+ ant -f build.javacheck.xml -v
Apache Ant(TM) version 1.10.5 compiled on March 28 2019
Buildfile: <https://ci-builds.apache.org/job/POI/job/POI-DSL-SonarQube-Gradle/ws/build.javacheck.xml>
Detected Java version: 11 in: /usr/local/asfpackages/java/oraclejdk-11.0.9
Detected OS: Linux
parsing buildfile <https://ci-builds.apache.org/job/POI/job/POI-DSL-SonarQube-Gradle/ws/build.javacheck.xml> with URI = <https://ci-builds.apache.org/job/POI/job/POI-DSL-SonarQube-Gradle/ws/build.javacheck.xml>
Project base dir set to: <https://ci-builds.apache.org/job/POI/job/POI-DSL-SonarQube-Gradle/ws/>
Build sequence for target(s) `test' is [test]
Complete build sequence is [test, ]

test:
parsing buildfile jar:file:/usr/share/ant/lib/ant.jar!/org/apache/tools/ant/antlib.xml with URI = jar:file:/usr/share/ant/lib/ant.jar!/org/apache/tools/ant/antlib.xml from a zip file
     [echo] Java 11/11.0.9
     [exec] Current OS is Linux
     [exec] Executing 'javac' with arguments:
     [exec] '-version'
     [exec]
     [exec] The ' characters around the executable and arguments are
     [exec] not part of the command.
     [exec] javac 11.0.9

BUILD SUCCESSFUL
Total time: 0 seconds
+ exit 0
[Gradle] - Launching build.
[POI-DSL-SonarQube-Gradle] $ gradle -PenableSonar -Dsonar.login=**** -Dsonar.organization=apache -Dsonar.projectKey=poi-parent -Dsonar.host.url=https://sonarcloud.io check jacocoTestReport sonarqube
To honour the JVM settings for this build a new JVM will be forked. Please consider using the daemon: https://docs.gradle.org/6.1/userguide/gradle_daemon.html.
Daemon will be stopped at the end of the build stopping after processing

> Configure project :
Enabling Sonar support
Trying to override old definition of datatype junit
writing file <https://ci-builds.apache.org/job/POI/job/POI-DSL-SonarQube-Gradle/ws/build/ooxml/../../lib/ooxml/xmlbeans-5.0.0.jar>

FAILURE: Build failed with an exception.

* Where:
Build file '<https://ci-builds.apache.org/job/POI/job/POI-DSL-SonarQube-Gradle/ws/build.gradle'> line: 279

* What went wrong:
A problem occurred evaluating root project 'poi'.
> https://ci-builds.apache.org/job/POI/job/POI-XMLBeans-DSL-1.8/lastSuccessfulBuild/artifact/build/xmlbeans-5.0.0.jar

* Try:
Run with --stacktrace option to get the stack trace. Run with --info or --debug option to get more log output. Run with --scan to get full insights.

* Get more help at https://help.gradle.org

Deprecated Gradle features were used in this build, making it incompatible with Gradle 7.0.
Use '--warning-mode all' to show the individual deprecation warnings.
See https://docs.gradle.org/6.1/userguide/command_line_interface.html#sec:command_line_warnings

BUILD FAILED in 10s
Build step 'Invoke Gradle script' changed build result to FAILURE
Build step 'Invoke Gradle script' marked build as failure

---------------------------------------------------------------------
To unsubscribe, e-mail: [hidden email]
For additional commands, e-mail: [hidden email]

Reply | Threaded
Open this post in threaded view
|

Build failed in Jenkins: POI » POI-DSL-SonarQube-Gradle #269

Apache Jenkins Server
See <https://ci-builds.apache.org/job/POI/job/POI-DSL-SonarQube-Gradle/269/display/redirect?page=changes>

Changes:

[PJ Fanning] revert accidental change

[PJ Fanning] try to re-enable new getBlockAt code


------------------------------------------
Started by an SCM change
Running as SYSTEM
[EnvInject] - Loading node environment variables.
[EnvInject] - Preparing an environment for the build.
[EnvInject] - Keeping Jenkins system variables.
[EnvInject] - Keeping Jenkins build variables.
[EnvInject] - Injecting as environment variables the properties content
LANG=en_US.UTF-8
FORREST_HOME=/home/jenkins/tools/forrest/latest

[EnvInject] - Variables injected successfully.
[EnvInject] - Injecting contributions.
Building remotely on H28 (ubuntu) in workspace <https://ci-builds.apache.org/job/POI/job/POI-DSL-SonarQube-Gradle/ws/>
[WS-CLEANUP] Deleting project workspace...
[WS-CLEANUP] Done
Updating https://svn.apache.org/repos/asf/poi/trunk at revision '2021-03-19T21:39:14.577 +0000'
U         src/java/org/apache/poi/poifs/filesystem/POIFSMiniStore.java
U         src/java/org/apache/poi/poifs/filesystem/POIFSStream.java
U         src/java/org/apache/poi/ss/format/CellFormatPart.java
U         src/java/org/apache/poi/ss/formula/atp/AnalysisToolPak.java
AU        src/java/org/apache/poi/ss/formula/functions/Single.java
U         src/java/org/apache/poi/ss/formula/functions/TextFunction.java
U         src/java/org/apache/poi/util/IOUtils.java
U         src/java/org/apache/poi/POIDocument.java
U         src/java/org/apache/poi/hssf/usermodel/HSSFWorkbook.java
U         src/java/org/apache/poi/hssf/dev/BiffViewer.java
U         src/java/org/apache/poi/hssf/model/InternalSheet.java
U         src/java/org/apache/poi/hssf/model/InternalWorkbook.java
U         src/scratchpad/testcases/org/apache/poi/hsmf/TestBasics.java
U         src/scratchpad/src/org/apache/poi/hslf/usermodel/HSLFSlideShow.java
U         src/testcases/org/apache/poi/util/TestIOUtils.java
U         src/ooxml/testcases/org/apache/poi/poifs/crypt/tests/TestHxxFEncryption.java
U         src/multimodule/ooxml-lite/java9/module-info.class
U         test-data/spreadsheet/FormatConditionTests.xlsx
U         test-data/spreadsheet/FormulaEvalTestData.xls
U         build.gradle
U         sonar/pom.xml
U         sonar/ooxml/pom.xml
U         .classpath
U         build.xml
U         maven/poi-ooxml-full.pom
U         maven/poi-ooxml-lite.pom
U         maven/poi-ooxml.pom

<-- Got one external: forrest.properties, svn url: https://svn.apache.org/repos/asf/poi/site/forrest.properties -->
Fetching 'https://svn.apache.org/repos/asf/poi/site/forrest.properties' at -1 into '<https://ci-builds.apache.org/job/POI/job/POI-DSL-SonarQube-Gradle/ws/forrest.properties'>
At revision 1887829


<-- Got one external: documentation, svn url: https://svn.apache.org/repos/asf/poi/site/src/documentation -->
Fetching 'https://svn.apache.org/repos/asf/poi/site/src/documentation' at -1 into '<https://ci-builds.apache.org/job/POI/job/POI-DSL-SonarQube-Gradle/ws/src/documentation'>
U         src/documentation/content/xdocs/changes.xml
At revision 1887829

At revision 1887829

No changes for https://svn.apache.org/repos/asf/poi/site/forrest.properties since the previous build
No changes for https://svn.apache.org/repos/asf/poi/site/src/documentation since the previous build
Injecting SonarQube environment variables using the configuration: sonarcloud.io
[POI-DSL-SonarQube-Gradle] $ /bin/sh -xe /tmp/jenkins6063676720174729582.sh
+ svn status
?       build.javacheck.xml
    X   forrest.properties
X       src/documentation

Performing status on external item at 'src/documentation':
+ echo Java-Home: /home/jenkins/tools/java/latest11
Java-Home: /home/jenkins/tools/java/latest11
+ ls -al /home/jenkins/tools/java/latest11/
total 40
drwxr-xr-x  8 root root 4096 Dec  7 23:10 .
drwxr-xr-x 43 root root 4096 Feb 16 14:45 ..
drwxr-xr-x  2 root root 4096 Dec  7 23:10 bin
drwxr-xr-x  4 root root 4096 Dec  7 23:10 conf
drwxr-xr-x  3 root root 4096 Dec  7 23:10 include
drwxr-xr-x  2 root root 4096 Dec  7 23:10 jmods
drwxr-xr-x 73 root root 4096 Dec  7 23:10 legal
drwxr-xr-x  6 root root 4096 Dec  7 23:10 lib
-r--r--r--  1 root root  160 Sep 15  2020 README.html
-rw-r--r--  1 root root 1278 Sep 15  2020 release
+ ls -al /home/jenkins/tools/java/latest11/bin
total 640
drwxr-xr-x 2 root root   4096 Dec  7 23:10 .
drwxr-xr-x 8 root root   4096 Dec  7 23:10 ..
-rwxr-xr-x 1 root root  12984 Sep 15  2020 jaotc
-rwxr-xr-x 1 root root  12864 Sep 15  2020 jar
-rwxr-xr-x 1 root root  12864 Sep 15  2020 jarsigner
-rwxr-xr-x 1 root root  12848 Sep 15  2020 java
-rwxr-xr-x 1 root root  12896 Sep 15  2020 javac
-rwxr-xr-x 1 root root  12896 Sep 15  2020 javadoc
-rwxr-xr-x 1 root root  12864 Sep 15  2020 javap
-rwxr-xr-x 1 root root  12864 Sep 15  2020 jcmd
-rwxr-xr-x 1 root root  12912 Sep 15  2020 jconsole
-rwxr-xr-x 1 root root  12864 Sep 15  2020 jdb
-rwxr-xr-x 1 root root  12864 Sep 15  2020 jdeprscan
-rwxr-xr-x 1 root root  12864 Sep 15  2020 jdeps
-rwxr-xr-x 1 root root  12864 Sep 15  2020 jfr
-rwxr-xr-x 1 root root  12864 Sep 15  2020 jhsdb
-rwxr-xr-x 1 root root  12864 Sep 15  2020 jimage
-rwxr-xr-x 1 root root  12896 Sep 15  2020 jinfo
-rwxr-xr-x 1 root root  12896 Sep 15  2020 jjs
-rwxr-xr-x 1 root root  12896 Sep 15  2020 jlink
-rwxr-xr-x 1 root root  12896 Sep 15  2020 jmap
-rwxr-xr-x 1 root root  12864 Sep 15  2020 jmod
-rwxr-xr-x 1 root root  12864 Sep 15  2020 jps
-rwxr-xr-x 1 root root  12904 Sep 15  2020 jrunscript
-rwxr-xr-x 1 root root  12864 Sep 15  2020 jshell
-rwxr-xr-x 1 root root  12896 Sep 15  2020 jstack
-rwxr-xr-x 1 root root  12864 Sep 15  2020 jstat
-rwxr-xr-x 1 root root  12864 Sep 15  2020 jstatd
-rwxr-xr-x 1 root root  12864 Sep 15  2020 keytool
-rwxr-xr-x 1 root root  12864 Sep 15  2020 pack200
-rwxr-xr-x 1 root root  12864 Sep 15  2020 rmic
-rwxr-xr-x 1 root root  12864 Sep 15  2020 rmid
-rwxr-xr-x 1 root root  12872 Sep 15  2020 rmiregistry
-rwxr-xr-x 1 root root  12864 Sep 15  2020 serialver
-rwxr-xr-x 1 root root 121568 Sep 15  2020 unpack200
+ /home/jenkins/tools/java/latest11/bin/java -version
java version "11.0.9" 2020-10-20 LTS
Java(TM) SE Runtime Environment 18.9 (build 11.0.9+7-LTS)
Java HotSpot(TM) 64-Bit Server VM 18.9 (build 11.0.9+7-LTS, mixed mode)
+ echo which java
which java
+ which java
/home/jenkins/tools/java/latest11/bin/java
+ java -version
java version "11.0.9" 2020-10-20 LTS
Java(TM) SE Runtime Environment 18.9 (build 11.0.9+7-LTS)
Java HotSpot(TM) 64-Bit Server VM 18.9 (build 11.0.9+7-LTS, mixed mode)
+ echo which javac
which javac
+ which javac
/home/jenkins/tools/java/latest11/bin/javac
+ javac -version
javac 11.0.9
+ echo Ant-Home:
Ant-Home:
+ ls -al
total 484
drwxr-xr-x 16 jenkins jenkins   4096 Feb 21 21:11 .
drwxr-xr-x 11 jenkins jenkins   4096 Mar 10 00:28 ..
drwxr-xr-x 31 jenkins jenkins   4096 Feb 21 21:29 build
-rw-r--r--  1 jenkins jenkins  14570 Mar 19 21:39 build.gradle
-rw-r--r--  1 jenkins jenkins    172 Mar 14 18:54 build.javacheck.xml
-rw-r--r--  1 jenkins jenkins 165104 Mar 19 21:39 build.xml
-rw-r--r--  1 jenkins jenkins   3264 Mar 19 21:39 .classpath
-rw-r--r--  1 jenkins jenkins   6325 Feb 21 21:10 doap_POI.rdf
-rw-r--r--  1 jenkins jenkins   2934 Feb 21 21:10 file-leak-detector.exclude
-rw-r--r--  1 jenkins jenkins   6229 Feb 21 21:10 forrest.properties
-rw-r--r--  1 jenkins jenkins     53 Feb 21 21:10 .gitattributes
drwxr-xr-x  3 jenkins jenkins   4096 Feb 21 21:09 .github
-rw-r--r--  1 jenkins jenkins    475 Feb 21 21:09 .gitignore
drwxr-xr-x  3 jenkins jenkins   4096 Feb 21 21:10 gradle
drwxr-xr-x  6 jenkins jenkins   4096 Feb 21 21:10 .gradle
-rwxr-xr-x  1 jenkins jenkins   5770 Feb 21 21:10 gradlew
-rw-r--r--  1 jenkins jenkins   3058 Feb 21 21:10 gradlew.bat
drwxr-xr-x  2 jenkins jenkins   4096 Feb 21 21:10 jenkins
-rw-r--r--  1 jenkins jenkins 167281 Mar 14 18:54 KEYS
drwxr-xr-x  2 jenkins jenkins   4096 Feb 21 21:09 legal
drwxr-xr-x 10 jenkins jenkins   4096 Feb 26 21:25 lib
drwxr-xr-x  2 jenkins jenkins   4096 Mar 19 21:39 maven
drwxr-xr-x  3 jenkins jenkins   4096 Feb 21 21:09 osgi
-rw-r--r--  1 jenkins jenkins   4813 Feb 21 21:10 patch.xml
-rw-r--r--  1 jenkins jenkins    426 Feb 21 21:10 .project
-rw-r--r--  1 jenkins jenkins   4278 Feb 21 21:10 README.rst
drwxr-xr-x  2 jenkins jenkins   4096 Feb 21 21:10 .settings
-rw-r--r--  1 jenkins jenkins    556 Feb 21 21:10 settings.gradle
drwxr-xr-x  9 jenkins jenkins   4096 Mar 19 21:39 sonar
drwxr-xr-x 16 jenkins jenkins   4096 Feb 21 21:10 src
drwxr-xr-x  4 jenkins jenkins   4096 Mar 19 21:39 .svn
drwxr-xr-x 15 jenkins jenkins   4096 Feb 21 21:10 test-data
-rw-r--r--  1 jenkins jenkins    419 Feb 21 21:10 .travis.yml
+ echo which ant
which ant
+ which ant
/usr/bin/ant
+ ant -version
Apache Ant(TM) version 1.10.5 compiled on March 28 2019
+ echo <project default="test"><target name="test"><echo>Java ${ant.java.version}/${java.version}</echo><exec executable="javac"><arg value="-version"/></exec></target></project>
+ ant -f build.javacheck.xml -v
Apache Ant(TM) version 1.10.5 compiled on March 28 2019
Buildfile: <https://ci-builds.apache.org/job/POI/job/POI-DSL-SonarQube-Gradle/ws/build.javacheck.xml>
Detected Java version: 11 in: /usr/local/asfpackages/java/oraclejdk-11.0.9
Detected OS: Linux
parsing buildfile <https://ci-builds.apache.org/job/POI/job/POI-DSL-SonarQube-Gradle/ws/build.javacheck.xml> with URI = <https://ci-builds.apache.org/job/POI/job/POI-DSL-SonarQube-Gradle/ws/build.javacheck.xml>
Project base dir set to: <https://ci-builds.apache.org/job/POI/job/POI-DSL-SonarQube-Gradle/ws/>
Build sequence for target(s) `test' is [test]
Complete build sequence is [test, ]

test:
parsing buildfile jar:file:/usr/share/ant/lib/ant.jar!/org/apache/tools/ant/antlib.xml with URI = jar:file:/usr/share/ant/lib/ant.jar!/org/apache/tools/ant/antlib.xml from a zip file
     [echo] Java 11/11.0.9
     [exec] Current OS is Linux
     [exec] Executing 'javac' with arguments:
     [exec] '-version'
     [exec]
     [exec] The ' characters around the executable and arguments are
     [exec] not part of the command.
     [exec] javac 11.0.9

BUILD SUCCESSFUL
Total time: 1 second
+ exit 0
[Gradle] - Launching build.
[POI-DSL-SonarQube-Gradle] $ gradle -PenableSonar -Dsonar.login=**** -Dsonar.organization=apache -Dsonar.projectKey=poi-parent -Dsonar.host.url=https://sonarcloud.io check jacocoTestReport sonarqube
To honour the JVM settings for this build a new JVM will be forked. Please consider using the daemon: https://docs.gradle.org/6.1/userguide/gradle_daemon.html.
Daemon will be stopped at the end of the build stopping after processing

> Configure project :
Enabling Sonar support
Trying to override old definition of datatype junit
writing file <https://ci-builds.apache.org/job/POI/job/POI-DSL-SonarQube-Gradle/ws/build/ooxml/../../lib/ooxml/xmlbeans-5.0.0.jar>

FAILURE: Build failed with an exception.

* Where:
Build file '<https://ci-builds.apache.org/job/POI/job/POI-DSL-SonarQube-Gradle/ws/build.gradle'> line: 279

* What went wrong:
A problem occurred evaluating root project 'poi'.
> https://ci-builds.apache.org/job/POI/job/POI-XMLBeans-DSL-1.8/lastSuccessfulBuild/artifact/build/xmlbeans-5.0.0.jar

* Try:
Run with --stacktrace option to get the stack trace. Run with --info or --debug option to get more log output. Run with --scan to get full insights.

* Get more help at https://help.gradle.org

Deprecated Gradle features were used in this build, making it incompatible with Gradle 7.0.
Use '--warning-mode all' to show the individual deprecation warnings.
See https://docs.gradle.org/6.1/userguide/command_line_interface.html#sec:command_line_warnings

BUILD FAILED in 17s
Build step 'Invoke Gradle script' changed build result to FAILURE
Build step 'Invoke Gradle script' marked build as failure

---------------------------------------------------------------------
To unsubscribe, e-mail: [hidden email]
For additional commands, e-mail: [hidden email]

Reply | Threaded
Open this post in threaded view
|

Build failed in Jenkins: POI » POI-DSL-SonarQube-Gradle #270

Apache Jenkins Server
See <https://ci-builds.apache.org/job/POI/job/POI-DSL-SonarQube-Gradle/270/display/redirect?page=changes>

Changes:

[PJ Fanning] add jdk 1.16 job for xmlbeans


------------------------------------------
Started by an SCM change
Running as SYSTEM
[EnvInject] - Loading node environment variables.
[EnvInject] - Preparing an environment for the build.
[EnvInject] - Keeping Jenkins system variables.
[EnvInject] - Keeping Jenkins build variables.
[EnvInject] - Injecting as environment variables the properties content
LANG=en_US.UTF-8
FORREST_HOME=/home/jenkins/tools/forrest/latest

[EnvInject] - Variables injected successfully.
[EnvInject] - Injecting contributions.
Building remotely on H41 (ubuntu) in workspace <https://ci-builds.apache.org/job/POI/job/POI-DSL-SonarQube-Gradle/ws/>
[WS-CLEANUP] Deleting project workspace...
[WS-CLEANUP] Done
Updating https://svn.apache.org/repos/asf/poi/trunk at revision '2021-03-20T10:09:16.422 +0000'
U         jenkins/create_jobs.groovy
U         src/java/org/apache/poi/poifs/filesystem/POIFSMiniStore.java

<-- Got one external: forrest.properties, svn url: https://svn.apache.org/repos/asf/poi/site/forrest.properties -->
Fetching 'https://svn.apache.org/repos/asf/poi/site/forrest.properties' at -1 into '<https://ci-builds.apache.org/job/POI/job/POI-DSL-SonarQube-Gradle/ws/forrest.properties'>
At revision 1887845


<-- Got one external: documentation, svn url: https://svn.apache.org/repos/asf/poi/site/src/documentation -->
Fetching 'https://svn.apache.org/repos/asf/poi/site/src/documentation' at -1 into '<https://ci-builds.apache.org/job/POI/job/POI-DSL-SonarQube-Gradle/ws/src/documentation'>
At revision 1887845

At revision 1887845

No changes for https://svn.apache.org/repos/asf/poi/site/forrest.properties since the previous build
No changes for https://svn.apache.org/repos/asf/poi/site/src/documentation since the previous build
Injecting SonarQube environment variables using the configuration: sonarcloud.io
[POI-DSL-SonarQube-Gradle] $ /bin/sh -xe /tmp/jenkins5691048578471791088.sh
+ svn status
?       build.javacheck.xml
    X   forrest.properties
X       src/documentation

Performing status on external item at 'src/documentation':
+ echo Java-Home: /home/jenkins/tools/java/latest11
Java-Home: /home/jenkins/tools/java/latest11
+ ls -al /home/jenkins/tools/java/latest11/
total 40
drwxr-xr-x  8 root root 4096 Dec  7 23:00 .
drwxr-xr-x 43 root root 4096 Feb 16 14:44 ..
drwxr-xr-x  2 root root 4096 Dec  7 23:00 bin
drwxr-xr-x  4 root root 4096 Dec  7 23:00 conf
drwxr-xr-x  3 root root 4096 Dec  7 23:00 include
drwxr-xr-x  2 root root 4096 Dec  7 23:00 jmods
drwxr-xr-x 73 root root 4096 Dec  7 23:00 legal
drwxr-xr-x  6 root root 4096 Dec  7 23:00 lib
-r--r--r--  1 root root  160 Sep 15  2020 README.html
-rw-r--r--  1 root root 1278 Sep 15  2020 release
+ ls -al /home/jenkins/tools/java/latest11/bin
total 640
drwxr-xr-x 2 root root   4096 Dec  7 23:00 .
drwxr-xr-x 8 root root   4096 Dec  7 23:00 ..
-rwxr-xr-x 1 root root  12984 Sep 15  2020 jaotc
-rwxr-xr-x 1 root root  12864 Sep 15  2020 jar
-rwxr-xr-x 1 root root  12864 Sep 15  2020 jarsigner
-rwxr-xr-x 1 root root  12848 Sep 15  2020 java
-rwxr-xr-x 1 root root  12896 Sep 15  2020 javac
-rwxr-xr-x 1 root root  12896 Sep 15  2020 javadoc
-rwxr-xr-x 1 root root  12864 Sep 15  2020 javap
-rwxr-xr-x 1 root root  12864 Sep 15  2020 jcmd
-rwxr-xr-x 1 root root  12912 Sep 15  2020 jconsole
-rwxr-xr-x 1 root root  12864 Sep 15  2020 jdb
-rwxr-xr-x 1 root root  12864 Sep 15  2020 jdeprscan
-rwxr-xr-x 1 root root  12864 Sep 15  2020 jdeps
-rwxr-xr-x 1 root root  12864 Sep 15  2020 jfr
-rwxr-xr-x 1 root root  12864 Sep 15  2020 jhsdb
-rwxr-xr-x 1 root root  12864 Sep 15  2020 jimage
-rwxr-xr-x 1 root root  12896 Sep 15  2020 jinfo
-rwxr-xr-x 1 root root  12896 Sep 15  2020 jjs
-rwxr-xr-x 1 root root  12896 Sep 15  2020 jlink
-rwxr-xr-x 1 root root  12896 Sep 15  2020 jmap
-rwxr-xr-x 1 root root  12864 Sep 15  2020 jmod
-rwxr-xr-x 1 root root  12864 Sep 15  2020 jps
-rwxr-xr-x 1 root root  12904 Sep 15  2020 jrunscript
-rwxr-xr-x 1 root root  12864 Sep 15  2020 jshell
-rwxr-xr-x 1 root root  12896 Sep 15  2020 jstack
-rwxr-xr-x 1 root root  12864 Sep 15  2020 jstat
-rwxr-xr-x 1 root root  12864 Sep 15  2020 jstatd
-rwxr-xr-x 1 root root  12864 Sep 15  2020 keytool
-rwxr-xr-x 1 root root  12864 Sep 15  2020 pack200
-rwxr-xr-x 1 root root  12864 Sep 15  2020 rmic
-rwxr-xr-x 1 root root  12864 Sep 15  2020 rmid
-rwxr-xr-x 1 root root  12872 Sep 15  2020 rmiregistry
-rwxr-xr-x 1 root root  12864 Sep 15  2020 serialver
-rwxr-xr-x 1 root root 121568 Sep 15  2020 unpack200
+ /home/jenkins/tools/java/latest11/bin/java -version
java version "11.0.9" 2020-10-20 LTS
Java(TM) SE Runtime Environment 18.9 (build 11.0.9+7-LTS)
Java HotSpot(TM) 64-Bit Server VM 18.9 (build 11.0.9+7-LTS, mixed mode)
+ echo which java
which java
+ which java
/home/jenkins/tools/java/latest11/bin/java
+ java -version
java version "11.0.9" 2020-10-20 LTS
Java(TM) SE Runtime Environment 18.9 (build 11.0.9+7-LTS)
Java HotSpot(TM) 64-Bit Server VM 18.9 (build 11.0.9+7-LTS, mixed mode)
+ echo which javac
which javac
+ which javac
/home/jenkins/tools/java/latest11/bin/javac
+ javac -version
javac 11.0.9
+ echo Ant-Home:
Ant-Home:
+ ls -al
total 484
drwxr-xr-x 16 jenkins jenkins   4096 Feb 22 00:24 .
drwxr-xr-x  6 jenkins jenkins   4096 Mar 10 00:32 ..
drwxr-xr-x 31 jenkins jenkins   4096 Feb 21 18:51 build
-rw-r--r--  1 jenkins jenkins  14570 Mar 17 22:54 build.gradle
-rw-r--r--  1 jenkins jenkins    172 Mar 19 21:09 build.javacheck.xml
-rw-r--r--  1 jenkins jenkins 165104 Mar 14 22:54 build.xml
-rw-r--r--  1 jenkins jenkins   3264 Mar 14 22:54 .classpath
-rw-r--r--  1 jenkins jenkins   6325 Feb 21 18:39 doap_POI.rdf
-rw-r--r--  1 jenkins jenkins   2934 Feb 21 18:39 file-leak-detector.exclude
-rw-r--r--  1 jenkins jenkins   6229 Feb 21 18:39 forrest.properties
-rw-r--r--  1 jenkins jenkins     53 Feb 21 18:39 .gitattributes
drwxr-xr-x  3 jenkins jenkins   4096 Feb 21 18:39 .github
-rw-r--r--  1 jenkins jenkins    475 Feb 22 00:24 .gitignore
drwxr-xr-x  3 jenkins jenkins   4096 Feb 21 18:39 gradle
drwxr-xr-x  6 jenkins jenkins   4096 Feb 21 18:40 .gradle
-rwxr-xr-x  1 jenkins jenkins   5770 Feb 21 18:39 gradlew
-rw-r--r--  1 jenkins jenkins   3058 Feb 21 18:39 gradlew.bat
drwxr-xr-x  2 jenkins jenkins   4096 Mar 20 10:09 jenkins
-rw-r--r--  1 jenkins jenkins 167281 Mar 11 21:54 KEYS
drwxr-xr-x  2 jenkins jenkins   4096 Feb 21 18:39 legal
drwxr-xr-x 10 jenkins jenkins   4096 Feb 22 00:25 lib
drwxr-xr-x  2 jenkins jenkins   4096 Mar 14 22:54 maven
drwxr-xr-x  3 jenkins jenkins   4096 Feb 22 00:24 osgi
-rw-r--r--  1 jenkins jenkins   4813 Feb 21 18:39 patch.xml
-rw-r--r--  1 jenkins jenkins    426 Feb 21 18:39 .project
-rw-r--r--  1 jenkins jenkins   4278 Feb 21 18:39 README.rst
drwxr-xr-x  2 jenkins jenkins   4096 Feb 21 18:39 .settings
-rw-r--r--  1 jenkins jenkins    556 Feb 21 18:39 settings.gradle
drwxr-xr-x  9 jenkins jenkins   4096 Mar 14 23:54 sonar
drwxr-xr-x 16 jenkins jenkins   4096 Feb 21 18:39 src
drwxr-xr-x  4 jenkins jenkins   4096 Mar 20 10:09 .svn
drwxr-xr-x 15 jenkins jenkins   4096 Feb 21 18:39 test-data
-rw-r--r--  1 jenkins jenkins    419 Feb 21 18:39 .travis.yml
+ echo which ant
which ant
+ which ant
/usr/bin/ant
+ ant -version
Apache Ant(TM) version 1.10.5 compiled on March 28 2019
+ echo <project default="test"><target name="test"><echo>Java ${ant.java.version}/${java.version}</echo><exec executable="javac"><arg value="-version"/></exec></target></project>
+ ant -f build.javacheck.xml -v
Apache Ant(TM) version 1.10.5 compiled on March 28 2019
Buildfile: <https://ci-builds.apache.org/job/POI/job/POI-DSL-SonarQube-Gradle/ws/build.javacheck.xml>
Detected Java version: 11 in: /usr/local/asfpackages/java/oraclejdk-11.0.9
Detected OS: Linux
parsing buildfile <https://ci-builds.apache.org/job/POI/job/POI-DSL-SonarQube-Gradle/ws/build.javacheck.xml> with URI = <https://ci-builds.apache.org/job/POI/job/POI-DSL-SonarQube-Gradle/ws/build.javacheck.xml>
Project base dir set to: <https://ci-builds.apache.org/job/POI/job/POI-DSL-SonarQube-Gradle/ws/>
Build sequence for target(s) `test' is [test]
Complete build sequence is [test, ]

test:
parsing buildfile jar:file:/usr/share/ant/lib/ant.jar!/org/apache/tools/ant/antlib.xml with URI = jar:file:/usr/share/ant/lib/ant.jar!/org/apache/tools/ant/antlib.xml from a zip file
     [echo] Java 11/11.0.9
     [exec] Current OS is Linux
     [exec] Executing 'javac' with arguments:
     [exec] '-version'
     [exec]
     [exec] The ' characters around the executable and arguments are
     [exec] not part of the command.
     [exec] javac 11.0.9

BUILD SUCCESSFUL
Total time: 0 seconds
+ exit 0
[Gradle] - Launching build.
[POI-DSL-SonarQube-Gradle] $ gradle -PenableSonar -Dsonar.login=**** -Dsonar.organization=apache -Dsonar.projectKey=poi-parent -Dsonar.host.url=https://sonarcloud.io check jacocoTestReport sonarqube
To honour the JVM settings for this build a new JVM will be forked. Please consider using the daemon: https://docs.gradle.org/6.1/userguide/gradle_daemon.html.
Daemon will be stopped at the end of the build stopping after processing

> Configure project :
Enabling Sonar support
Trying to override old definition of datatype junit
writing file <https://ci-builds.apache.org/job/POI/job/POI-DSL-SonarQube-Gradle/ws/build/ooxml/../../lib/ooxml/xmlbeans-5.0.0.jar>

FAILURE: Build failed with an exception.

* Where:
Build file '<https://ci-builds.apache.org/job/POI/job/POI-DSL-SonarQube-Gradle/ws/build.gradle'> line: 279

* What went wrong:
A problem occurred evaluating root project 'poi'.
> https://ci-builds.apache.org/job/POI/job/POI-XMLBeans-DSL-1.8/lastSuccessfulBuild/artifact/build/xmlbeans-5.0.0.jar

* Try:
Run with --stacktrace option to get the stack trace. Run with --info or --debug option to get more log output. Run with --scan to get full insights.

* Get more help at https://help.gradle.org

Deprecated Gradle features were used in this build, making it incompatible with Gradle 7.0.
Use '--warning-mode all' to show the individual deprecation warnings.
See https://docs.gradle.org/6.1/userguide/command_line_interface.html#sec:command_line_warnings

BUILD FAILED in 8s
Build step 'Invoke Gradle script' changed build result to FAILURE
Build step 'Invoke Gradle script' marked build as failure

---------------------------------------------------------------------
To unsubscribe, e-mail: [hidden email]
For additional commands, e-mail: [hidden email]

Reply | Threaded
Open this post in threaded view
|

Build failed in Jenkins: POI » POI-DSL-SonarQube-Gradle #271

Apache Jenkins Server
See <https://ci-builds.apache.org/job/POI/job/POI-DSL-SonarQube-Gradle/271/display/redirect?page=changes>

Changes:

[Bida Fan] Create, get, modify and remove comments, support operating paragraphs, pictures and tables in comments


------------------------------------------
Started by an SCM change
Running as SYSTEM
[EnvInject] - Loading node environment variables.
[EnvInject] - Preparing an environment for the build.
[EnvInject] - Keeping Jenkins system variables.
[EnvInject] - Keeping Jenkins build variables.
[EnvInject] - Injecting as environment variables the properties content
LANG=en_US.UTF-8
FORREST_HOME=/home/jenkins/tools/forrest/latest

[EnvInject] - Variables injected successfully.
[EnvInject] - Injecting contributions.
Building remotely on H41 (ubuntu) in workspace <https://ci-builds.apache.org/job/POI/job/POI-DSL-SonarQube-Gradle/ws/>
[WS-CLEANUP] Deleting project workspace...
[WS-CLEANUP] Done
Updating https://svn.apache.org/repos/asf/poi/trunk at revision '2021-03-20T16:24:13.781 +0000'
U         src/ooxml/java/org/apache/poi/xwpf/usermodel/BodyType.java
U         src/ooxml/java/org/apache/poi/xwpf/usermodel/XWPFComment.java
AU        src/ooxml/java/org/apache/poi/xwpf/usermodel/XWPFComments.java
U         src/ooxml/java/org/apache/poi/xwpf/usermodel/XWPFDocument.java
U         src/ooxml/java/org/apache/poi/xwpf/usermodel/XWPFRelation.java
U         src/ooxml/java/org/apache/poi/xwpf/usermodel/XWPFRun.java
U         src/ooxml/testcases/org/apache/poi/xwpf/usermodel/TestXWPFComment.java
AU        src/ooxml/testcases/org/apache/poi/xwpf/usermodel/TestXWPFComments.java

<-- Got one external: forrest.properties, svn url: https://svn.apache.org/repos/asf/poi/site/forrest.properties -->
Fetching 'https://svn.apache.org/repos/asf/poi/site/forrest.properties' at -1 into '<https://ci-builds.apache.org/job/POI/job/POI-DSL-SonarQube-Gradle/ws/forrest.properties'>
At revision 1887867


<-- Got one external: documentation, svn url: https://svn.apache.org/repos/asf/poi/site/src/documentation -->
Fetching 'https://svn.apache.org/repos/asf/poi/site/src/documentation' at -1 into '<https://ci-builds.apache.org/job/POI/job/POI-DSL-SonarQube-Gradle/ws/src/documentation'>
At revision 1887867

At revision 1887867

No changes for https://svn.apache.org/repos/asf/poi/site/forrest.properties since the previous build
No changes for https://svn.apache.org/repos/asf/poi/site/src/documentation since the previous build
Injecting SonarQube environment variables using the configuration: sonarcloud.io
[POI-DSL-SonarQube-Gradle] $ /bin/sh -xe /tmp/jenkins2170378336806541375.sh
+ svn status
?       build.javacheck.xml
    X   forrest.properties
X       src/documentation

Performing status on external item at 'src/documentation':
+ echo Java-Home: /home/jenkins/tools/java/latest11
Java-Home: /home/jenkins/tools/java/latest11
+ ls -al /home/jenkins/tools/java/latest11/
total 40
drwxr-xr-x  8 root root 4096 Dec  7 23:00 .
drwxr-xr-x 43 root root 4096 Feb 16 14:44 ..
drwxr-xr-x  2 root root 4096 Dec  7 23:00 bin
drwxr-xr-x  4 root root 4096 Dec  7 23:00 conf
drwxr-xr-x  3 root root 4096 Dec  7 23:00 include
drwxr-xr-x  2 root root 4096 Dec  7 23:00 jmods
drwxr-xr-x 73 root root 4096 Dec  7 23:00 legal
drwxr-xr-x  6 root root 4096 Dec  7 23:00 lib
-r--r--r--  1 root root  160 Sep 15  2020 README.html
-rw-r--r--  1 root root 1278 Sep 15  2020 release
+ ls -al /home/jenkins/tools/java/latest11/bin
total 640
drwxr-xr-x 2 root root   4096 Dec  7 23:00 .
drwxr-xr-x 8 root root   4096 Dec  7 23:00 ..
-rwxr-xr-x 1 root root  12984 Sep 15  2020 jaotc
-rwxr-xr-x 1 root root  12864 Sep 15  2020 jar
-rwxr-xr-x 1 root root  12864 Sep 15  2020 jarsigner
-rwxr-xr-x 1 root root  12848 Sep 15  2020 java
-rwxr-xr-x 1 root root  12896 Sep 15  2020 javac
-rwxr-xr-x 1 root root  12896 Sep 15  2020 javadoc
-rwxr-xr-x 1 root root  12864 Sep 15  2020 javap
-rwxr-xr-x 1 root root  12864 Sep 15  2020 jcmd
-rwxr-xr-x 1 root root  12912 Sep 15  2020 jconsole
-rwxr-xr-x 1 root root  12864 Sep 15  2020 jdb
-rwxr-xr-x 1 root root  12864 Sep 15  2020 jdeprscan
-rwxr-xr-x 1 root root  12864 Sep 15  2020 jdeps
-rwxr-xr-x 1 root root  12864 Sep 15  2020 jfr
-rwxr-xr-x 1 root root  12864 Sep 15  2020 jhsdb
-rwxr-xr-x 1 root root  12864 Sep 15  2020 jimage
-rwxr-xr-x 1 root root  12896 Sep 15  2020 jinfo
-rwxr-xr-x 1 root root  12896 Sep 15  2020 jjs
-rwxr-xr-x 1 root root  12896 Sep 15  2020 jlink
-rwxr-xr-x 1 root root  12896 Sep 15  2020 jmap
-rwxr-xr-x 1 root root  12864 Sep 15  2020 jmod
-rwxr-xr-x 1 root root  12864 Sep 15  2020 jps
-rwxr-xr-x 1 root root  12904 Sep 15  2020 jrunscript
-rwxr-xr-x 1 root root  12864 Sep 15  2020 jshell
-rwxr-xr-x 1 root root  12896 Sep 15  2020 jstack
-rwxr-xr-x 1 root root  12864 Sep 15  2020 jstat
-rwxr-xr-x 1 root root  12864 Sep 15  2020 jstatd
-rwxr-xr-x 1 root root  12864 Sep 15  2020 keytool
-rwxr-xr-x 1 root root  12864 Sep 15  2020 pack200
-rwxr-xr-x 1 root root  12864 Sep 15  2020 rmic
-rwxr-xr-x 1 root root  12864 Sep 15  2020 rmid
-rwxr-xr-x 1 root root  12872 Sep 15  2020 rmiregistry
-rwxr-xr-x 1 root root  12864 Sep 15  2020 serialver
-rwxr-xr-x 1 root root 121568 Sep 15  2020 unpack200
+ /home/jenkins/tools/java/latest11/bin/java -version
java version "11.0.9" 2020-10-20 LTS
Java(TM) SE Runtime Environment 18.9 (build 11.0.9+7-LTS)
Java HotSpot(TM) 64-Bit Server VM 18.9 (build 11.0.9+7-LTS, mixed mode)
+ echo which java
which java
+ which java
/home/jenkins/tools/java/latest11/bin/java
+ java -version
java version "11.0.9" 2020-10-20 LTS
Java(TM) SE Runtime Environment 18.9 (build 11.0.9+7-LTS)
Java HotSpot(TM) 64-Bit Server VM 18.9 (build 11.0.9+7-LTS, mixed mode)
+ echo which javac
which javac
+ which javac
/home/jenkins/tools/java/latest11/bin/javac
+ javac -version
javac 11.0.9
+ echo Ant-Home:
Ant-Home:
+ ls -al
total 484
drwxr-xr-x 16 jenkins jenkins   4096 Feb 22 00:24 .
drwxr-xr-x  6 jenkins jenkins   4096 Mar 10 00:32 ..
drwxr-xr-x 31 jenkins jenkins   4096 Feb 21 18:51 build
-rw-r--r--  1 jenkins jenkins  14570 Mar 17 22:54 build.gradle
-rw-r--r--  1 jenkins jenkins    172 Mar 20 10:09 build.javacheck.xml
-rw-r--r--  1 jenkins jenkins 165104 Mar 14 22:54 build.xml
-rw-r--r--  1 jenkins jenkins   3264 Mar 14 22:54 .classpath
-rw-r--r--  1 jenkins jenkins   6325 Feb 21 18:39 doap_POI.rdf
-rw-r--r--  1 jenkins jenkins   2934 Feb 21 18:39 file-leak-detector.exclude
-rw-r--r--  1 jenkins jenkins   6229 Feb 21 18:39 forrest.properties
-rw-r--r--  1 jenkins jenkins     53 Feb 21 18:39 .gitattributes
drwxr-xr-x  3 jenkins jenkins   4096 Feb 21 18:39 .github
-rw-r--r--  1 jenkins jenkins    475 Feb 22 00:24 .gitignore
drwxr-xr-x  3 jenkins jenkins   4096 Feb 21 18:39 gradle
drwxr-xr-x  6 jenkins jenkins   4096 Feb 21 18:40 .gradle
-rwxr-xr-x  1 jenkins jenkins   5770 Feb 21 18:39 gradlew
-rw-r--r--  1 jenkins jenkins   3058 Feb 21 18:39 gradlew.bat
drwxr-xr-x  2 jenkins jenkins   4096 Mar 20 10:09 jenkins
-rw-r--r--  1 jenkins jenkins 167281 Mar 11 21:54 KEYS
drwxr-xr-x  2 jenkins jenkins   4096 Feb 21 18:39 legal
drwxr-xr-x 10 jenkins jenkins   4096 Feb 22 00:25 lib
drwxr-xr-x  2 jenkins jenkins   4096 Mar 14 22:54 maven
drwxr-xr-x  3 jenkins jenkins   4096 Feb 22 00:24 osgi
-rw-r--r--  1 jenkins jenkins   4813 Feb 21 18:39 patch.xml
-rw-r--r--  1 jenkins jenkins    426 Feb 21 18:39 .project
-rw-r--r--  1 jenkins jenkins   4278 Feb 21 18:39 README.rst
drwxr-xr-x  2 jenkins jenkins   4096 Feb 21 18:39 .settings
-rw-r--r--  1 jenkins jenkins    556 Feb 21 18:39 settings.gradle
drwxr-xr-x  9 jenkins jenkins   4096 Mar 14 23:54 sonar
drwxr-xr-x 16 jenkins jenkins   4096 Feb 21 18:39 src
drwxr-xr-x  4 jenkins jenkins   4096 Mar 20 16:24 .svn
drwxr-xr-x 15 jenkins jenkins   4096 Feb 21 18:39 test-data
-rw-r--r--  1 jenkins jenkins    419 Feb 21 18:39 .travis.yml
+ echo which ant
which ant
+ which ant
/usr/bin/ant
+ ant -version
Apache Ant(TM) version 1.10.5 compiled on March 28 2019
+ echo <project default="test"><target name="test"><echo>Java ${ant.java.version}/${java.version}</echo><exec executable="javac"><arg value="-version"/></exec></target></project>
+ ant -f build.javacheck.xml -v
Apache Ant(TM) version 1.10.5 compiled on March 28 2019
Buildfile: <https://ci-builds.apache.org/job/POI/job/POI-DSL-SonarQube-Gradle/ws/build.javacheck.xml>
Detected Java version: 11 in: /usr/local/asfpackages/java/oraclejdk-11.0.9
Detected OS: Linux
parsing buildfile <https://ci-builds.apache.org/job/POI/job/POI-DSL-SonarQube-Gradle/ws/build.javacheck.xml> with URI = <https://ci-builds.apache.org/job/POI/job/POI-DSL-SonarQube-Gradle/ws/build.javacheck.xml>
Project base dir set to: <https://ci-builds.apache.org/job/POI/job/POI-DSL-SonarQube-Gradle/ws/>
Build sequence for target(s) `test' is [test]
Complete build sequence is [test, ]

test:
parsing buildfile jar:file:/usr/share/ant/lib/ant.jar!/org/apache/tools/ant/antlib.xml with URI = jar:file:/usr/share/ant/lib/ant.jar!/org/apache/tools/ant/antlib.xml from a zip file
     [echo] Java 11/11.0.9
     [exec] Current OS is Linux
     [exec] Executing 'javac' with arguments:
     [exec] '-version'
     [exec]
     [exec] The ' characters around the executable and arguments are
     [exec] not part of the command.
     [exec] javac 11.0.9

BUILD SUCCESSFUL
Total time: 0 seconds
+ exit 0
[Gradle] - Launching build.
[POI-DSL-SonarQube-Gradle] $ gradle -PenableSonar -Dsonar.login=**** -Dsonar.organization=apache -Dsonar.projectKey=poi-parent -Dsonar.host.url=https://sonarcloud.io check jacocoTestReport sonarqube
To honour the JVM settings for this build a new JVM will be forked. Please consider using the daemon: https://docs.gradle.org/6.1/userguide/gradle_daemon.html.
Daemon will be stopped at the end of the build stopping after processing

> Configure project :
Enabling Sonar support
Trying to override old definition of datatype junit
writing file <https://ci-builds.apache.org/job/POI/job/POI-DSL-SonarQube-Gradle/ws/build/ooxml/../../lib/ooxml/xmlbeans-5.0.0.jar>

FAILURE: Build failed with an exception.

* Where:
Build file '<https://ci-builds.apache.org/job/POI/job/POI-DSL-SonarQube-Gradle/ws/build.gradle'> line: 279

* What went wrong:
A problem occurred evaluating root project 'poi'.
> https://ci-builds.apache.org/job/POI/job/POI-XMLBeans-DSL-1.8/lastSuccessfulBuild/artifact/build/xmlbeans-5.0.0.jar

* Try:
Run with --stacktrace option to get the stack trace. Run with --info or --debug option to get more log output. Run with --scan to get full insights.

* Get more help at https://help.gradle.org

Deprecated Gradle features were used in this build, making it incompatible with Gradle 7.0.
Use '--warning-mode all' to show the individual deprecation warnings.
See https://docs.gradle.org/6.1/userguide/command_line_interface.html#sec:command_line_warnings

BUILD FAILED in 8s
Build step 'Invoke Gradle script' changed build result to FAILURE
Build step 'Invoke Gradle script' marked build as failure

---------------------------------------------------------------------
To unsubscribe, e-mail: [hidden email]
For additional commands, e-mail: [hidden email]

Reply | Threaded
Open this post in threaded view
|

Build failed in Jenkins: POI » POI-DSL-SonarQube-Gradle #272

Apache Jenkins Server
See <https://ci-builds.apache.org/job/POI/job/POI-DSL-SonarQube-Gradle/272/display/redirect?page=changes>

Changes:

[Bida Fan] dispose cursor finally


------------------------------------------
Started by an SCM change
Running as SYSTEM
[EnvInject] - Loading node environment variables.
[EnvInject] - Preparing an environment for the build.
[EnvInject] - Keeping Jenkins system variables.
[EnvInject] - Keeping Jenkins build variables.
[EnvInject] - Injecting as environment variables the properties content
LANG=en_US.UTF-8
FORREST_HOME=/home/jenkins/tools/forrest/latest

[EnvInject] - Variables injected successfully.
[EnvInject] - Injecting contributions.
Building remotely on H33 (ubuntu) in workspace <https://ci-builds.apache.org/job/POI/job/POI-DSL-SonarQube-Gradle/ws/>
[WS-CLEANUP] Deleting project workspace...
[WS-CLEANUP] Done
Updating https://svn.apache.org/repos/asf/poi/trunk at revision '2021-03-20T17:09:11.669 +0000'
U         src/ooxml/java/org/apache/poi/xwpf/usermodel/XWPFAbstractFootnoteEndnote.java
U         src/ooxml/java/org/apache/poi/xwpf/usermodel/BodyType.java
U         src/ooxml/java/org/apache/poi/xwpf/usermodel/XWPFComment.java
AU        src/ooxml/java/org/apache/poi/xwpf/usermodel/XWPFComments.java
U         src/ooxml/java/org/apache/poi/xwpf/usermodel/XWPFDocument.java
U         src/ooxml/java/org/apache/poi/xwpf/usermodel/XWPFRelation.java
U         src/ooxml/java/org/apache/poi/xwpf/usermodel/XWPFRun.java
U         src/ooxml/testcases/org/apache/poi/xwpf/usermodel/TestXWPFComment.java
AU        src/ooxml/testcases/org/apache/poi/xwpf/usermodel/TestXWPFComments.java
U         src/java/org/apache/poi/poifs/filesystem/POIFSMiniStore.java
U         src/scratchpad/testcases/org/apache/poi/hsmf/TestBasics.java
U         jenkins/create_jobs.groovy

<-- Got one external: forrest.properties, svn url: https://svn.apache.org/repos/asf/poi/site/forrest.properties -->
Fetching 'https://svn.apache.org/repos/asf/poi/site/forrest.properties' at -1 into '<https://ci-builds.apache.org/job/POI/job/POI-DSL-SonarQube-Gradle/ws/forrest.properties'>
At revision 1887870


<-- Got one external: documentation, svn url: https://svn.apache.org/repos/asf/poi/site/src/documentation -->
Fetching 'https://svn.apache.org/repos/asf/poi/site/src/documentation' at -1 into '<https://ci-builds.apache.org/job/POI/job/POI-DSL-SonarQube-Gradle/ws/src/documentation'>
At revision 1887870

At revision 1887870

No changes for https://svn.apache.org/repos/asf/poi/site/forrest.properties since the previous build
No changes for https://svn.apache.org/repos/asf/poi/site/src/documentation since the previous build
Injecting SonarQube environment variables using the configuration: sonarcloud.io
[POI-DSL-SonarQube-Gradle] $ /bin/sh -xe /tmp/jenkins8582142678362373385.sh
+ svn status
?       build.javacheck.xml
    X   forrest.properties
X       src/documentation

Performing status on external item at 'src/documentation':
+ echo Java-Home: /home/jenkins/tools/java/latest11
Java-Home: /home/jenkins/tools/java/latest11
+ ls -al /home/jenkins/tools/java/latest11/
total 40
drwxr-xr-x  8 root root 4096 Dec  7 22:54 .
drwxr-xr-x 43 root root 4096 Feb 16 14:45 ..
drwxr-xr-x  2 root root 4096 Dec  7 22:54 bin
drwxr-xr-x  4 root root 4096 Dec  7 22:54 conf
drwxr-xr-x  3 root root 4096 Dec  7 22:54 include
drwxr-xr-x  2 root root 4096 Dec  7 22:54 jmods
drwxr-xr-x 73 root root 4096 Dec  7 22:54 legal
drwxr-xr-x  6 root root 4096 Dec  7 22:54 lib
-r--r--r--  1 root root  160 Sep 15  2020 README.html
-rw-r--r--  1 root root 1278 Sep 15  2020 release
+ ls -al /home/jenkins/tools/java/latest11/bin
total 640
drwxr-xr-x 2 root root   4096 Dec  7 22:54 .
drwxr-xr-x 8 root root   4096 Dec  7 22:54 ..
-rwxr-xr-x 1 root root  12984 Sep 15  2020 jaotc
-rwxr-xr-x 1 root root  12864 Sep 15  2020 jar
-rwxr-xr-x 1 root root  12864 Sep 15  2020 jarsigner
-rwxr-xr-x 1 root root  12848 Sep 15  2020 java
-rwxr-xr-x 1 root root  12896 Sep 15  2020 javac
-rwxr-xr-x 1 root root  12896 Sep 15  2020 javadoc
-rwxr-xr-x 1 root root  12864 Sep 15  2020 javap
-rwxr-xr-x 1 root root  12864 Sep 15  2020 jcmd
-rwxr-xr-x 1 root root  12912 Sep 15  2020 jconsole
-rwxr-xr-x 1 root root  12864 Sep 15  2020 jdb
-rwxr-xr-x 1 root root  12864 Sep 15  2020 jdeprscan
-rwxr-xr-x 1 root root  12864 Sep 15  2020 jdeps
-rwxr-xr-x 1 root root  12864 Sep 15  2020 jfr
-rwxr-xr-x 1 root root  12864 Sep 15  2020 jhsdb
-rwxr-xr-x 1 root root  12864 Sep 15  2020 jimage
-rwxr-xr-x 1 root root  12896 Sep 15  2020 jinfo
-rwxr-xr-x 1 root root  12896 Sep 15  2020 jjs
-rwxr-xr-x 1 root root  12896 Sep 15  2020 jlink
-rwxr-xr-x 1 root root  12896 Sep 15  2020 jmap
-rwxr-xr-x 1 root root  12864 Sep 15  2020 jmod
-rwxr-xr-x 1 root root  12864 Sep 15  2020 jps
-rwxr-xr-x 1 root root  12904 Sep 15  2020 jrunscript
-rwxr-xr-x 1 root root  12864 Sep 15  2020 jshell
-rwxr-xr-x 1 root root  12896 Sep 15  2020 jstack
-rwxr-xr-x 1 root root  12864 Sep 15  2020 jstat
-rwxr-xr-x 1 root root  12864 Sep 15  2020 jstatd
-rwxr-xr-x 1 root root  12864 Sep 15  2020 keytool
-rwxr-xr-x 1 root root  12864 Sep 15  2020 pack200
-rwxr-xr-x 1 root root  12864 Sep 15  2020 rmic
-rwxr-xr-x 1 root root  12864 Sep 15  2020 rmid
-rwxr-xr-x 1 root root  12872 Sep 15  2020 rmiregistry
-rwxr-xr-x 1 root root  12864 Sep 15  2020 serialver
-rwxr-xr-x 1 root root 121568 Sep 15  2020 unpack200
+ /home/jenkins/tools/java/latest11/bin/java -version
java version "11.0.9" 2020-10-20 LTS
Java(TM) SE Runtime Environment 18.9 (build 11.0.9+7-LTS)
Java HotSpot(TM) 64-Bit Server VM 18.9 (build 11.0.9+7-LTS, mixed mode)
+ echo which java
which java
+ which java
/home/jenkins/tools/java/latest11/bin/java
+ java -version
java version "11.0.9" 2020-10-20 LTS
Java(TM) SE Runtime Environment 18.9 (build 11.0.9+7-LTS)
Java HotSpot(TM) 64-Bit Server VM 18.9 (build 11.0.9+7-LTS, mixed mode)
+ echo which javac
which javac
+ which javac
/home/jenkins/tools/java/latest11/bin/javac
+ javac -version
javac 11.0.9
+ echo Ant-Home:
Ant-Home:
+ ls -al
total 476
drwxr-xr-x 14 jenkins jenkins   4096 Feb 24 21:54 .
drwxr-xr-x  9 jenkins jenkins   4096 Mar 20 10:06 ..
-rw-r--r--  1 jenkins jenkins  14570 Mar 16 11:39 build.gradle
-rw-r--r--  1 jenkins jenkins    172 Mar 19 09:54 build.javacheck.xml
-rw-r--r--  1 jenkins jenkins 165104 Mar 16 11:39 build.xml
-rw-r--r--  1 jenkins jenkins   3264 Mar 16 11:39 .classpath
-rw-r--r--  1 jenkins jenkins   6325 Feb 15 15:25 doap_POI.rdf
-rw-r--r--  1 jenkins jenkins   2934 Feb 15 15:25 file-leak-detector.exclude
-rw-r--r--  1 jenkins jenkins   6229 Feb 15 15:25 forrest.properties
-rw-r--r--  1 jenkins jenkins     53 Feb 15 15:25 .gitattributes
drwxr-xr-x  3 jenkins jenkins   4096 Feb 15 15:24 .github
-rw-r--r--  1 jenkins jenkins    475 Feb 24 21:54 .gitignore
drwxr-xr-x  3 jenkins jenkins   4096 Feb 15 15:25 gradle
drwxr-xr-x  4 jenkins jenkins   4096 Feb 15 15:25 .gradle
-rwxr-xr-x  1 jenkins jenkins   5770 Feb 15 15:25 gradlew
-rw-r--r--  1 jenkins jenkins   3058 Feb 15 15:25 gradlew.bat
drwxr-xr-x  2 jenkins jenkins   4096 Mar 20 17:09 jenkins
-rw-r--r--  1 jenkins jenkins 167281 Mar 14 01:54 KEYS
drwxr-xr-x  2 jenkins jenkins   4096 Feb 15 15:25 legal
drwxr-xr-x  2 jenkins jenkins   4096 Mar 16 11:39 maven
drwxr-xr-x  3 jenkins jenkins   4096 Feb 24 21:54 osgi
-rw-r--r--  1 jenkins jenkins   4813 Feb 15 15:25 patch.xml
-rw-r--r--  1 jenkins jenkins    426 Feb 15 15:25 .project
-rw-r--r--  1 jenkins jenkins   4278 Feb 15 15:25 README.rst
drwxr-xr-x  2 jenkins jenkins   4096 Feb 15 15:25 .settings
-rw-r--r--  1 jenkins jenkins    556 Feb 15 15:25 settings.gradle
drwxr-xr-x  9 jenkins jenkins   4096 Mar 16 11:39 sonar
drwxr-xr-x 16 jenkins jenkins   4096 Feb 15 15:25 src
drwxr-xr-x  4 jenkins jenkins   4096 Mar 20 17:09 .svn
drwxr-xr-x 15 jenkins jenkins   4096 Feb 15 15:25 test-data
-rw-r--r--  1 jenkins jenkins    419 Feb 15 15:25 .travis.yml
+ echo which ant
which ant
+ which ant
/usr/bin/ant
+ ant -version
Apache Ant(TM) version 1.10.5 compiled on March 28 2019
+ echo <project default="test"><target name="test"><echo>Java ${ant.java.version}/${java.version}</echo><exec executable="javac"><arg value="-version"/></exec></target></project>
+ ant -f build.javacheck.xml -v
Apache Ant(TM) version 1.10.5 compiled on March 28 2019
Buildfile: <https://ci-builds.apache.org/job/POI/job/POI-DSL-SonarQube-Gradle/ws/build.javacheck.xml>
Detected Java version: 11 in: /usr/local/asfpackages/java/oraclejdk-11.0.9
Detected OS: Linux
parsing buildfile <https://ci-builds.apache.org/job/POI/job/POI-DSL-SonarQube-Gradle/ws/build.javacheck.xml> with URI = <https://ci-builds.apache.org/job/POI/job/POI-DSL-SonarQube-Gradle/ws/build.javacheck.xml>
Project base dir set to: <https://ci-builds.apache.org/job/POI/job/POI-DSL-SonarQube-Gradle/ws/>
Build sequence for target(s) `test' is [test]
Complete build sequence is [test, ]

test:
parsing buildfile jar:file:/usr/share/ant/lib/ant.jar!/org/apache/tools/ant/antlib.xml with URI = jar:file:/usr/share/ant/lib/ant.jar!/org/apache/tools/ant/antlib.xml from a zip file
     [echo] Java 11/11.0.9
     [exec] Current OS is Linux
     [exec] Executing 'javac' with arguments:
     [exec] '-version'
     [exec]
     [exec] The ' characters around the executable and arguments are
     [exec] not part of the command.
     [exec] javac 11.0.9

BUILD SUCCESSFUL
Total time: 1 second
+ exit 0
[Gradle] - Launching build.
[POI-DSL-SonarQube-Gradle] $ gradle -PenableSonar -Dsonar.login=**** -Dsonar.organization=apache -Dsonar.projectKey=poi-parent -Dsonar.host.url=https://sonarcloud.io check jacocoTestReport sonarqube
WARNING: An illegal reflective access operation has occurred
WARNING: Illegal reflective access by org.codehaus.groovy.reflection.CachedClass (file:/usr/lib/gradle/4.10.3/lib/groovy-all-2.4.15.jar) to method java.lang.Object.finalize()
WARNING: Please consider reporting this to the maintainers of org.codehaus.groovy.reflection.CachedClass
WARNING: Use --illegal-access=warn to enable warnings of further illegal reflective access operations
WARNING: All illegal access operations will be denied in a future release

> Configure project :
Enabling Sonar support

FAILURE: Build failed with an exception.

* Where:
Build file '<https://ci-builds.apache.org/job/POI/job/POI-DSL-SonarQube-Gradle/ws/build.gradle'> line: 45

* What went wrong:
A problem occurred evaluating root project 'poi'.
> Could not get unknown property 'Bundling' for {} of type org.gradle.api.internal.attributes.DefaultMutableAttributeContainer.

* Try:
Run with --stacktrace option to get the stack trace. Run with --info or --debug option to get more log output. Run with --scan to get full insights.

* Get more help at https://help.gradle.org

BUILD FAILED in 6s
Build step 'Invoke Gradle script' changed build result to FAILURE
Build step 'Invoke Gradle script' marked build as failure
WARN: Unable to locate 'report-task.txt' in the workspace. Did the SonarScanner succeed?

---------------------------------------------------------------------
To unsubscribe, e-mail: [hidden email]
For additional commands, e-mail: [hidden email]

Reply | Threaded
Open this post in threaded view
|

Build failed in Jenkins: POI » POI-DSL-SonarQube-Gradle #273

Apache Jenkins Server
See <https://ci-builds.apache.org/job/POI/job/POI-DSL-SonarQube-Gradle/273/display/redirect?page=changes>

Changes:

[Andreas Beeker] Forbidden apis fix


------------------------------------------
Started by an SCM change
Running as SYSTEM
[EnvInject] - Loading node environment variables.
[EnvInject] - Preparing an environment for the build.
[EnvInject] - Keeping Jenkins system variables.
[EnvInject] - Keeping Jenkins build variables.
[EnvInject] - Injecting as environment variables the properties content
LANG=en_US.UTF-8
FORREST_HOME=/home/jenkins/tools/forrest/latest

[EnvInject] - Variables injected successfully.
[EnvInject] - Injecting contributions.
Building remotely on H41 (ubuntu) in workspace <https://ci-builds.apache.org/job/POI/job/POI-DSL-SonarQube-Gradle/ws/>
[WS-CLEANUP] Deleting project workspace...
[WS-CLEANUP] Done
Updating https://svn.apache.org/repos/asf/poi/trunk at revision '2021-03-20T21:39:14.251 +0000'
U         src/ooxml/testcases/org/apache/poi/xwpf/usermodel/TestXWPFComment.java
U         src/ooxml/java/org/apache/poi/xwpf/usermodel/XWPFAbstractFootnoteEndnote.java

<-- Got one external: forrest.properties, svn url: https://svn.apache.org/repos/asf/poi/site/forrest.properties -->
Fetching 'https://svn.apache.org/repos/asf/poi/site/forrest.properties' at -1 into '<https://ci-builds.apache.org/job/POI/job/POI-DSL-SonarQube-Gradle/ws/forrest.properties'>
At revision 1887880


<-- Got one external: documentation, svn url: https://svn.apache.org/repos/asf/poi/site/src/documentation -->
Fetching 'https://svn.apache.org/repos/asf/poi/site/src/documentation' at -1 into '<https://ci-builds.apache.org/job/POI/job/POI-DSL-SonarQube-Gradle/ws/src/documentation'>
At revision 1887880

At revision 1887880

No changes for https://svn.apache.org/repos/asf/poi/site/forrest.properties since the previous build
No changes for https://svn.apache.org/repos/asf/poi/site/src/documentation since the previous build
Injecting SonarQube environment variables using the configuration: sonarcloud.io
[POI-DSL-SonarQube-Gradle] $ /bin/sh -xe /tmp/jenkins4441312079608832935.sh
+ svn status
?       build.javacheck.xml
    X   forrest.properties
X       src/documentation

Performing status on external item at 'src/documentation':
+ echo Java-Home: /home/jenkins/tools/java/latest11
Java-Home: /home/jenkins/tools/java/latest11
+ ls -al /home/jenkins/tools/java/latest11/
total 40
drwxr-xr-x  8 root root 4096 Dec  7 23:00 .
drwxr-xr-x 43 root root 4096 Feb 16 14:44 ..
drwxr-xr-x  2 root root 4096 Dec  7 23:00 bin
drwxr-xr-x  4 root root 4096 Dec  7 23:00 conf
drwxr-xr-x  3 root root 4096 Dec  7 23:00 include
drwxr-xr-x  2 root root 4096 Dec  7 23:00 jmods
drwxr-xr-x 73 root root 4096 Dec  7 23:00 legal
drwxr-xr-x  6 root root 4096 Dec  7 23:00 lib
-r--r--r--  1 root root  160 Sep 15  2020 README.html
-rw-r--r--  1 root root 1278 Sep 15  2020 release
+ ls -al /home/jenkins/tools/java/latest11/bin
total 640
drwxr-xr-x 2 root root   4096 Dec  7 23:00 .
drwxr-xr-x 8 root root   4096 Dec  7 23:00 ..
-rwxr-xr-x 1 root root  12984 Sep 15  2020 jaotc
-rwxr-xr-x 1 root root  12864 Sep 15  2020 jar
-rwxr-xr-x 1 root root  12864 Sep 15  2020 jarsigner
-rwxr-xr-x 1 root root  12848 Sep 15  2020 java
-rwxr-xr-x 1 root root  12896 Sep 15  2020 javac
-rwxr-xr-x 1 root root  12896 Sep 15  2020 javadoc
-rwxr-xr-x 1 root root  12864 Sep 15  2020 javap
-rwxr-xr-x 1 root root  12864 Sep 15  2020 jcmd
-rwxr-xr-x 1 root root  12912 Sep 15  2020 jconsole
-rwxr-xr-x 1 root root  12864 Sep 15  2020 jdb
-rwxr-xr-x 1 root root  12864 Sep 15  2020 jdeprscan
-rwxr-xr-x 1 root root  12864 Sep 15  2020 jdeps
-rwxr-xr-x 1 root root  12864 Sep 15  2020 jfr
-rwxr-xr-x 1 root root  12864 Sep 15  2020 jhsdb
-rwxr-xr-x 1 root root  12864 Sep 15  2020 jimage
-rwxr-xr-x 1 root root  12896 Sep 15  2020 jinfo
-rwxr-xr-x 1 root root  12896 Sep 15  2020 jjs
-rwxr-xr-x 1 root root  12896 Sep 15  2020 jlink
-rwxr-xr-x 1 root root  12896 Sep 15  2020 jmap
-rwxr-xr-x 1 root root  12864 Sep 15  2020 jmod
-rwxr-xr-x 1 root root  12864 Sep 15  2020 jps
-rwxr-xr-x 1 root root  12904 Sep 15  2020 jrunscript
-rwxr-xr-x 1 root root  12864 Sep 15  2020 jshell
-rwxr-xr-x 1 root root  12896 Sep 15  2020 jstack
-rwxr-xr-x 1 root root  12864 Sep 15  2020 jstat
-rwxr-xr-x 1 root root  12864 Sep 15  2020 jstatd
-rwxr-xr-x 1 root root  12864 Sep 15  2020 keytool
-rwxr-xr-x 1 root root  12864 Sep 15  2020 pack200
-rwxr-xr-x 1 root root  12864 Sep 15  2020 rmic
-rwxr-xr-x 1 root root  12864 Sep 15  2020 rmid
-rwxr-xr-x 1 root root  12872 Sep 15  2020 rmiregistry
-rwxr-xr-x 1 root root  12864 Sep 15  2020 serialver
-rwxr-xr-x 1 root root 121568 Sep 15  2020 unpack200
+ /home/jenkins/tools/java/latest11/bin/java -version
java version "11.0.9" 2020-10-20 LTS
Java(TM) SE Runtime Environment 18.9 (build 11.0.9+7-LTS)
Java HotSpot(TM) 64-Bit Server VM 18.9 (build 11.0.9+7-LTS, mixed mode)
+ echo which java
which java
+ which java
/home/jenkins/tools/java/latest11/bin/java
+ java -version
java version "11.0.9" 2020-10-20 LTS
Java(TM) SE Runtime Environment 18.9 (build 11.0.9+7-LTS)
Java HotSpot(TM) 64-Bit Server VM 18.9 (build 11.0.9+7-LTS, mixed mode)
+ echo which javac
which javac
+ which javac
/home/jenkins/tools/java/latest11/bin/javac
+ javac -version
javac 11.0.9
+ echo Ant-Home:
Ant-Home:
+ ls -al
total 484
drwxr-xr-x 16 jenkins jenkins   4096 Feb 22 00:24 .
drwxr-xr-x  6 jenkins jenkins   4096 Mar 10 00:32 ..
drwxr-xr-x 31 jenkins jenkins   4096 Feb 21 18:51 build
-rw-r--r--  1 jenkins jenkins  14570 Mar 17 22:54 build.gradle
-rw-r--r--  1 jenkins jenkins    172 Mar 20 16:24 build.javacheck.xml
-rw-r--r--  1 jenkins jenkins 165104 Mar 14 22:54 build.xml
-rw-r--r--  1 jenkins jenkins   3264 Mar 14 22:54 .classpath
-rw-r--r--  1 jenkins jenkins   6325 Feb 21 18:39 doap_POI.rdf
-rw-r--r--  1 jenkins jenkins   2934 Feb 21 18:39 file-leak-detector.exclude
-rw-r--r--  1 jenkins jenkins   6229 Feb 21 18:39 forrest.properties
-rw-r--r--  1 jenkins jenkins     53 Feb 21 18:39 .gitattributes
drwxr-xr-x  3 jenkins jenkins   4096 Feb 21 18:39 .github
-rw-r--r--  1 jenkins jenkins    475 Feb 22 00:24 .gitignore
drwxr-xr-x  3 jenkins jenkins   4096 Feb 21 18:39 gradle
drwxr-xr-x  6 jenkins jenkins   4096 Feb 21 18:40 .gradle
-rwxr-xr-x  1 jenkins jenkins   5770 Feb 21 18:39 gradlew
-rw-r--r--  1 jenkins jenkins   3058 Feb 21 18:39 gradlew.bat
drwxr-xr-x  2 jenkins jenkins   4096 Mar 20 10:09 jenkins
-rw-r--r--  1 jenkins jenkins 167281 Mar 11 21:54 KEYS
drwxr-xr-x  2 jenkins jenkins   4096 Feb 21 18:39 legal
drwxr-xr-x 10 jenkins jenkins   4096 Feb 22 00:25 lib
drwxr-xr-x  2 jenkins jenkins   4096 Mar 14 22:54 maven
drwxr-xr-x  3 jenkins jenkins   4096 Feb 22 00:24 osgi
-rw-r--r--  1 jenkins jenkins   4813 Feb 21 18:39 patch.xml
-rw-r--r--  1 jenkins jenkins    426 Feb 21 18:39 .project
-rw-r--r--  1 jenkins jenkins   4278 Feb 21 18:39 README.rst
drwxr-xr-x  2 jenkins jenkins   4096 Feb 21 18:39 .settings
-rw-r--r--  1 jenkins jenkins    556 Feb 21 18:39 settings.gradle
drwxr-xr-x  9 jenkins jenkins   4096 Mar 14 23:54 sonar
drwxr-xr-x 16 jenkins jenkins   4096 Feb 21 18:39 src
drwxr-xr-x  4 jenkins jenkins   4096 Mar 20 21:39 .svn
drwxr-xr-x 15 jenkins jenkins   4096 Feb 21 18:39 test-data
-rw-r--r--  1 jenkins jenkins    419 Feb 21 18:39 .travis.yml
+ echo which ant
which ant
+ which ant
/usr/bin/ant
+ ant -version
Apache Ant(TM) version 1.10.5 compiled on March 28 2019
+ echo <project default="test"><target name="test"><echo>Java ${ant.java.version}/${java.version}</echo><exec executable="javac"><arg value="-version"/></exec></target></project>
+ ant -f build.javacheck.xml -v
Apache Ant(TM) version 1.10.5 compiled on March 28 2019
Buildfile: <https://ci-builds.apache.org/job/POI/job/POI-DSL-SonarQube-Gradle/ws/build.javacheck.xml>
Detected Java version: 11 in: /usr/local/asfpackages/java/oraclejdk-11.0.9
Detected OS: Linux
parsing buildfile <https://ci-builds.apache.org/job/POI/job/POI-DSL-SonarQube-Gradle/ws/build.javacheck.xml> with URI = <https://ci-builds.apache.org/job/POI/job/POI-DSL-SonarQube-Gradle/ws/build.javacheck.xml>
Project base dir set to: <https://ci-builds.apache.org/job/POI/job/POI-DSL-SonarQube-Gradle/ws/>
Build sequence for target(s) `test' is [test]
Complete build sequence is [test, ]

test:
parsing buildfile jar:file:/usr/share/ant/lib/ant.jar!/org/apache/tools/ant/antlib.xml with URI = jar:file:/usr/share/ant/lib/ant.jar!/org/apache/tools/ant/antlib.xml from a zip file
     [echo] Java 11/11.0.9
     [exec] Current OS is Linux
     [exec] Executing 'javac' with arguments:
     [exec] '-version'
     [exec]
     [exec] The ' characters around the executable and arguments are
     [exec] not part of the command.
     [exec] javac 11.0.9

BUILD SUCCESSFUL
Total time: 0 seconds
+ exit 0
[Gradle] - Launching build.
[POI-DSL-SonarQube-Gradle] $ gradle -PenableSonar -Dsonar.login=**** -Dsonar.organization=apache -Dsonar.projectKey=poi-parent -Dsonar.host.url=https://sonarcloud.io check jacocoTestReport sonarqube
To honour the JVM settings for this build a new JVM will be forked. Please consider using the daemon: https://docs.gradle.org/6.1/userguide/gradle_daemon.html.
Daemon will be stopped at the end of the build stopping after processing

> Configure project :
Enabling Sonar support
Trying to override old definition of datatype junit
writing file <https://ci-builds.apache.org/job/POI/job/POI-DSL-SonarQube-Gradle/ws/build/ooxml/../../lib/ooxml/xmlbeans-5.0.0.jar>

FAILURE: Build failed with an exception.

* Where:
Build file '<https://ci-builds.apache.org/job/POI/job/POI-DSL-SonarQube-Gradle/ws/build.gradle'> line: 279

* What went wrong:
A problem occurred evaluating root project 'poi'.
> https://ci-builds.apache.org/job/POI/job/POI-XMLBeans-DSL-1.8/lastSuccessfulBuild/artifact/build/xmlbeans-5.0.0.jar

* Try:
Run with --stacktrace option to get the stack trace. Run with --info or --debug option to get more log output. Run with --scan to get full insights.

* Get more help at https://help.gradle.org

Deprecated Gradle features were used in this build, making it incompatible with Gradle 7.0.
Use '--warning-mode all' to show the individual deprecation warnings.
See https://docs.gradle.org/6.1/userguide/command_line_interface.html#sec:command_line_warnings

BUILD FAILED in 8s
Build step 'Invoke Gradle script' changed build result to FAILURE
Build step 'Invoke Gradle script' marked build as failure

---------------------------------------------------------------------
To unsubscribe, e-mail: [hidden email]
For additional commands, e-mail: [hidden email]

Reply | Threaded
Open this post in threaded view
|

Build failed in Jenkins: POI » POI-DSL-SonarQube-Gradle #274

Apache Jenkins Server
See <https://ci-builds.apache.org/job/POI/job/POI-DSL-SonarQube-Gradle/274/display/redirect?page=changes>

Changes:

[Andreas Beeker] add more xsbs to the ooxml-lite jar by recursing through XWPF and XSSF documents


------------------------------------------
Started by an SCM change
Running as SYSTEM
[EnvInject] - Loading node environment variables.
[EnvInject] - Preparing an environment for the build.
[EnvInject] - Keeping Jenkins system variables.
[EnvInject] - Keeping Jenkins build variables.
[EnvInject] - Injecting as environment variables the properties content
LANG=en_US.UTF-8
FORREST_HOME=/home/jenkins/tools/forrest/latest

[EnvInject] - Variables injected successfully.
[EnvInject] - Injecting contributions.
Building remotely on H41 (ubuntu) in workspace <https://ci-builds.apache.org/job/POI/job/POI-DSL-SonarQube-Gradle/ws/>
[WS-CLEANUP] Deleting project workspace...
[WS-CLEANUP] Done
Updating https://svn.apache.org/repos/asf/poi/trunk at revision '2021-03-24T00:09:13.774 +0000'
U         src/integrationtest/org/apache/poi/stress/POIXMLDocumentHandler.java
U         src/integrationtest/org/apache/poi/stress/XSSFFileHandler.java
U         src/integrationtest/org/apache/poi/stress/XWPFFileHandler.java
U         src/multimodule/ooxml-lite/java9/module-info.class
U         src/multimodule/ooxml-lite/java9/module-info.java

<-- Got one external: forrest.properties, svn url: https://svn.apache.org/repos/asf/poi/site/forrest.properties -->
Fetching 'https://svn.apache.org/repos/asf/poi/site/forrest.properties' at -1 into '<https://ci-builds.apache.org/job/POI/job/POI-DSL-SonarQube-Gradle/ws/forrest.properties'>
At revision 1887978


<-- Got one external: documentation, svn url: https://svn.apache.org/repos/asf/poi/site/src/documentation -->
Fetching 'https://svn.apache.org/repos/asf/poi/site/src/documentation' at -1 into '<https://ci-builds.apache.org/job/POI/job/POI-DSL-SonarQube-Gradle/ws/src/documentation'>
At revision 1887978

At revision 1887978

No changes for https://svn.apache.org/repos/asf/poi/site/forrest.properties since the previous build
No changes for https://svn.apache.org/repos/asf/poi/site/src/documentation since the previous build
Injecting SonarQube environment variables using the configuration: sonarcloud.io
[POI-DSL-SonarQube-Gradle] $ /bin/sh -xe /tmp/jenkins9147815702945500967.sh
+ svn status
?       build.javacheck.xml
    X   forrest.properties
X       src/documentation

Performing status on external item at 'src/documentation':
+ echo Java-Home: /home/jenkins/tools/java/latest11
Java-Home: /home/jenkins/tools/java/latest11
+ ls -al /home/jenkins/tools/java/latest11/
total 40
drwxr-xr-x  8 root root 4096 Dec  7 23:00 .
drwxr-xr-x 43 root root 4096 Feb 16 14:44 ..
drwxr-xr-x  2 root root 4096 Dec  7 23:00 bin
drwxr-xr-x  4 root root 4096 Dec  7 23:00 conf
drwxr-xr-x  3 root root 4096 Dec  7 23:00 include
drwxr-xr-x  2 root root 4096 Dec  7 23:00 jmods
drwxr-xr-x 73 root root 4096 Dec  7 23:00 legal
drwxr-xr-x  6 root root 4096 Dec  7 23:00 lib
-r--r--r--  1 root root  160 Sep 15  2020 README.html
-rw-r--r--  1 root root 1278 Sep 15  2020 release
+ ls -al /home/jenkins/tools/java/latest11/bin
total 640
drwxr-xr-x 2 root root   4096 Dec  7 23:00 .
drwxr-xr-x 8 root root   4096 Dec  7 23:00 ..
-rwxr-xr-x 1 root root  12984 Sep 15  2020 jaotc
-rwxr-xr-x 1 root root  12864 Sep 15  2020 jar
-rwxr-xr-x 1 root root  12864 Sep 15  2020 jarsigner
-rwxr-xr-x 1 root root  12848 Sep 15  2020 java
-rwxr-xr-x 1 root root  12896 Sep 15  2020 javac
-rwxr-xr-x 1 root root  12896 Sep 15  2020 javadoc
-rwxr-xr-x 1 root root  12864 Sep 15  2020 javap
-rwxr-xr-x 1 root root  12864 Sep 15  2020 jcmd
-rwxr-xr-x 1 root root  12912 Sep 15  2020 jconsole
-rwxr-xr-x 1 root root  12864 Sep 15  2020 jdb
-rwxr-xr-x 1 root root  12864 Sep 15  2020 jdeprscan
-rwxr-xr-x 1 root root  12864 Sep 15  2020 jdeps
-rwxr-xr-x 1 root root  12864 Sep 15  2020 jfr
-rwxr-xr-x 1 root root  12864 Sep 15  2020 jhsdb
-rwxr-xr-x 1 root root  12864 Sep 15  2020 jimage
-rwxr-xr-x 1 root root  12896 Sep 15  2020 jinfo
-rwxr-xr-x 1 root root  12896 Sep 15  2020 jjs
-rwxr-xr-x 1 root root  12896 Sep 15  2020 jlink
-rwxr-xr-x 1 root root  12896 Sep 15  2020 jmap
-rwxr-xr-x 1 root root  12864 Sep 15  2020 jmod
-rwxr-xr-x 1 root root  12864 Sep 15  2020 jps
-rwxr-xr-x 1 root root  12904 Sep 15  2020 jrunscript
-rwxr-xr-x 1 root root  12864 Sep 15  2020 jshell
-rwxr-xr-x 1 root root  12896 Sep 15  2020 jstack
-rwxr-xr-x 1 root root  12864 Sep 15  2020 jstat
-rwxr-xr-x 1 root root  12864 Sep 15  2020 jstatd
-rwxr-xr-x 1 root root  12864 Sep 15  2020 keytool
-rwxr-xr-x 1 root root  12864 Sep 15  2020 pack200
-rwxr-xr-x 1 root root  12864 Sep 15  2020 rmic
-rwxr-xr-x 1 root root  12864 Sep 15  2020 rmid
-rwxr-xr-x 1 root root  12872 Sep 15  2020 rmiregistry
-rwxr-xr-x 1 root root  12864 Sep 15  2020 serialver
-rwxr-xr-x 1 root root 121568 Sep 15  2020 unpack200
+ /home/jenkins/tools/java/latest11/bin/java -version
java version "11.0.9" 2020-10-20 LTS
Java(TM) SE Runtime Environment 18.9 (build 11.0.9+7-LTS)
Java HotSpot(TM) 64-Bit Server VM 18.9 (build 11.0.9+7-LTS, mixed mode)
+ echo which java
which java
+ which java
/home/jenkins/tools/java/latest11/bin/java
+ java -version
java version "11.0.9" 2020-10-20 LTS
Java(TM) SE Runtime Environment 18.9 (build 11.0.9+7-LTS)
Java HotSpot(TM) 64-Bit Server VM 18.9 (build 11.0.9+7-LTS, mixed mode)
+ echo which javac
which javac
+ which javac
/home/jenkins/tools/java/latest11/bin/javac
+ javac -version
javac 11.0.9
+ echo Ant-Home:
Ant-Home:
+ ls -al
total 484
drwxr-xr-x 16 jenkins jenkins   4096 Feb 22 00:24 .
drwxr-xr-x  6 jenkins jenkins   4096 Mar 10 00:32 ..
drwxr-xr-x 31 jenkins jenkins   4096 Feb 21 18:51 build
-rw-r--r--  1 jenkins jenkins  14570 Mar 17 22:54 build.gradle
-rw-r--r--  1 jenkins jenkins    172 Mar 20 21:39 build.javacheck.xml
-rw-r--r--  1 jenkins jenkins 165104 Mar 14 22:54 build.xml
-rw-r--r--  1 jenkins jenkins   3264 Mar 14 22:54 .classpath
-rw-r--r--  1 jenkins jenkins   6325 Feb 21 18:39 doap_POI.rdf
-rw-r--r--  1 jenkins jenkins   2934 Feb 21 18:39 file-leak-detector.exclude
-rw-r--r--  1 jenkins jenkins   6229 Feb 21 18:39 forrest.properties
-rw-r--r--  1 jenkins jenkins     53 Feb 21 18:39 .gitattributes
drwxr-xr-x  3 jenkins jenkins   4096 Feb 21 18:39 .github
-rw-r--r--  1 jenkins jenkins    475 Feb 22 00:24 .gitignore
drwxr-xr-x  3 jenkins jenkins   4096 Feb 21 18:39 gradle
drwxr-xr-x  6 jenkins jenkins   4096 Feb 21 18:40 .gradle
-rwxr-xr-x  1 jenkins jenkins   5770 Feb 21 18:39 gradlew
-rw-r--r--  1 jenkins jenkins   3058 Feb 21 18:39 gradlew.bat
drwxr-xr-x  2 jenkins jenkins   4096 Mar 20 10:09 jenkins
-rw-r--r--  1 jenkins jenkins 167281 Mar 11 21:54 KEYS
drwxr-xr-x  2 jenkins jenkins   4096 Feb 21 18:39 legal
drwxr-xr-x 10 jenkins jenkins   4096 Feb 22 00:25 lib
drwxr-xr-x  2 jenkins jenkins   4096 Mar 14 22:54 maven
drwxr-xr-x  3 jenkins jenkins   4096 Feb 22 00:24 osgi
-rw-r--r--  1 jenkins jenkins   4813 Feb 21 18:39 patch.xml
-rw-r--r--  1 jenkins jenkins    426 Feb 21 18:39 .project
-rw-r--r--  1 jenkins jenkins   4278 Feb 21 18:39 README.rst
drwxr-xr-x  2 jenkins jenkins   4096 Feb 21 18:39 .settings
-rw-r--r--  1 jenkins jenkins    556 Feb 21 18:39 settings.gradle
drwxr-xr-x  9 jenkins jenkins   4096 Mar 14 23:54 sonar
drwxr-xr-x 16 jenkins jenkins   4096 Feb 21 18:39 src
drwxr-xr-x  4 jenkins jenkins   4096 Mar 24 00:09 .svn
drwxr-xr-x 15 jenkins jenkins   4096 Feb 21 18:39 test-data
-rw-r--r--  1 jenkins jenkins    419 Feb 21 18:39 .travis.yml
+ echo which ant
which ant
+ which ant
/usr/bin/ant
+ ant -version
Apache Ant(TM) version 1.10.5 compiled on March 28 2019
+ echo <project default="test"><target name="test"><echo>Java ${ant.java.version}/${java.version}</echo><exec executable="javac"><arg value="-version"/></exec></target></project>
+ ant -f build.javacheck.xml -v
Apache Ant(TM) version 1.10.5 compiled on March 28 2019
Buildfile: <https://ci-builds.apache.org/job/POI/job/POI-DSL-SonarQube-Gradle/ws/build.javacheck.xml>
Detected Java version: 11 in: /usr/local/asfpackages/java/oraclejdk-11.0.9
Detected OS: Linux
parsing buildfile <https://ci-builds.apache.org/job/POI/job/POI-DSL-SonarQube-Gradle/ws/build.javacheck.xml> with URI = <https://ci-builds.apache.org/job/POI/job/POI-DSL-SonarQube-Gradle/ws/build.javacheck.xml>
Project base dir set to: <https://ci-builds.apache.org/job/POI/job/POI-DSL-SonarQube-Gradle/ws/>
Build sequence for target(s) `test' is [test]
Complete build sequence is [test, ]

test:
parsing buildfile jar:file:/usr/share/ant/lib/ant.jar!/org/apache/tools/ant/antlib.xml with URI = jar:file:/usr/share/ant/lib/ant.jar!/org/apache/tools/ant/antlib.xml from a zip file
     [echo] Java 11/11.0.9
     [exec] Current OS is Linux
     [exec] Executing 'javac' with arguments:
     [exec] '-version'
     [exec]
     [exec] The ' characters around the executable and arguments are
     [exec] not part of the command.
     [exec] javac 11.0.9

BUILD SUCCESSFUL
Total time: 0 seconds
+ exit 0
[Gradle] - Launching build.
[POI-DSL-SonarQube-Gradle] $ gradle -PenableSonar -Dsonar.login=**** -Dsonar.organization=apache -Dsonar.projectKey=poi-parent -Dsonar.host.url=https://sonarcloud.io check jacocoTestReport sonarqube
To honour the JVM settings for this build a new JVM will be forked. Please consider using the daemon: https://docs.gradle.org/6.1/userguide/gradle_daemon.html.
Daemon will be stopped at the end of the build stopping after processing

> Configure project :
Enabling Sonar support
Trying to override old definition of datatype junit
writing file <https://ci-builds.apache.org/job/POI/job/POI-DSL-SonarQube-Gradle/ws/build/ooxml/../../lib/ooxml/xmlbeans-5.0.0.jar>

FAILURE: Build failed with an exception.

* Where:
Build file '<https://ci-builds.apache.org/job/POI/job/POI-DSL-SonarQube-Gradle/ws/build.gradle'> line: 279

* What went wrong:
A problem occurred evaluating root project 'poi'.
> https://ci-builds.apache.org/job/POI/job/POI-XMLBeans-DSL-1.8/lastSuccessfulBuild/artifact/build/xmlbeans-5.0.0.jar

* Try:
Run with --stacktrace option to get the stack trace. Run with --info or --debug option to get more log output. Run with --scan to get full insights.

* Get more help at https://help.gradle.org

Deprecated Gradle features were used in this build, making it incompatible with Gradle 7.0.
Use '--warning-mode all' to show the individual deprecation warnings.
See https://docs.gradle.org/6.1/userguide/command_line_interface.html#sec:command_line_warnings

BUILD FAILED in 12s
Build step 'Invoke Gradle script' changed build result to FAILURE
Build step 'Invoke Gradle script' marked build as failure

---------------------------------------------------------------------
To unsubscribe, e-mail: [hidden email]
For additional commands, e-mail: [hidden email]

Reply | Threaded
Open this post in threaded view
|

Build failed in Jenkins: POI » POI-DSL-SonarQube-Gradle #275

Apache Jenkins Server
See <https://ci-builds.apache.org/job/POI/job/POI-DSL-SonarQube-Gradle/275/display/redirect?page=changes>

Changes:

[Dominik Stadler] Don't use a hardcoded temporary file (and also not a hardcoded /tmp directory)

This could cause issues in CI or when multiple different users run tests of POI on one machine!

[Dominik Stadler] Make new tests for IOUtils work on Windows as well


------------------------------------------
Started by an SCM change
Running as SYSTEM
[EnvInject] - Loading node environment variables.
[EnvInject] - Preparing an environment for the build.
[EnvInject] - Keeping Jenkins system variables.
[EnvInject] - Keeping Jenkins build variables.
[EnvInject] - Injecting as environment variables the properties content
LANG=en_US.UTF-8
FORREST_HOME=/home/jenkins/tools/forrest/latest

[EnvInject] - Variables injected successfully.
[EnvInject] - Injecting contributions.
Building remotely on H41 (ubuntu) in workspace <https://ci-builds.apache.org/job/POI/job/POI-DSL-SonarQube-Gradle/ws/>
[WS-CLEANUP] Deleting project workspace...
[WS-CLEANUP] Done
Updating https://svn.apache.org/repos/asf/poi/trunk at revision '2021-03-24T09:39:11.961 +0000'
U         src/ooxml/testcases/org/apache/poi/xddf/usermodel/chart/TestXDDFChart.java
U         src/testcases/org/apache/poi/util/TestIOUtils.java

<-- Got one external: forrest.properties, svn url: https://svn.apache.org/repos/asf/poi/site/forrest.properties -->
Fetching 'https://svn.apache.org/repos/asf/poi/site/forrest.properties' at -1 into '<https://ci-builds.apache.org/job/POI/job/POI-DSL-SonarQube-Gradle/ws/forrest.properties'>
At revision 1887999


<-- Got one external: documentation, svn url: https://svn.apache.org/repos/asf/poi/site/src/documentation -->
Fetching 'https://svn.apache.org/repos/asf/poi/site/src/documentation' at -1 into '<https://ci-builds.apache.org/job/POI/job/POI-DSL-SonarQube-Gradle/ws/src/documentation'>
At revision 1887999

At revision 1887999

No changes for https://svn.apache.org/repos/asf/poi/site/forrest.properties since the previous build
No changes for https://svn.apache.org/repos/asf/poi/site/src/documentation since the previous build
Injecting SonarQube environment variables using the configuration: sonarcloud.io
[POI-DSL-SonarQube-Gradle] $ /bin/sh -xe /tmp/jenkins6072110839842684448.sh
+ svn status
?       build.javacheck.xml
    X   forrest.properties
X       src/documentation

Performing status on external item at 'src/documentation':
+ echo Java-Home: /home/jenkins/tools/java/latest11
Java-Home: /home/jenkins/tools/java/latest11
+ ls -al /home/jenkins/tools/java/latest11/
total 40
drwxr-xr-x  8 root root 4096 Dec  7 23:00 .
drwxr-xr-x 43 root root 4096 Feb 16 14:44 ..
drwxr-xr-x  2 root root 4096 Dec  7 23:00 bin
drwxr-xr-x  4 root root 4096 Dec  7 23:00 conf
drwxr-xr-x  3 root root 4096 Dec  7 23:00 include
drwxr-xr-x  2 root root 4096 Dec  7 23:00 jmods
drwxr-xr-x 73 root root 4096 Dec  7 23:00 legal
drwxr-xr-x  6 root root 4096 Dec  7 23:00 lib
-r--r--r--  1 root root  160 Sep 15  2020 README.html
-rw-r--r--  1 root root 1278 Sep 15  2020 release
+ ls -al /home/jenkins/tools/java/latest11/bin
total 640
drwxr-xr-x 2 root root   4096 Dec  7 23:00 .
drwxr-xr-x 8 root root   4096 Dec  7 23:00 ..
-rwxr-xr-x 1 root root  12984 Sep 15  2020 jaotc
-rwxr-xr-x 1 root root  12864 Sep 15  2020 jar
-rwxr-xr-x 1 root root  12864 Sep 15  2020 jarsigner
-rwxr-xr-x 1 root root  12848 Sep 15  2020 java
-rwxr-xr-x 1 root root  12896 Sep 15  2020 javac
-rwxr-xr-x 1 root root  12896 Sep 15  2020 javadoc
-rwxr-xr-x 1 root root  12864 Sep 15  2020 javap
-rwxr-xr-x 1 root root  12864 Sep 15  2020 jcmd
-rwxr-xr-x 1 root root  12912 Sep 15  2020 jconsole
-rwxr-xr-x 1 root root  12864 Sep 15  2020 jdb
-rwxr-xr-x 1 root root  12864 Sep 15  2020 jdeprscan
-rwxr-xr-x 1 root root  12864 Sep 15  2020 jdeps
-rwxr-xr-x 1 root root  12864 Sep 15  2020 jfr
-rwxr-xr-x 1 root root  12864 Sep 15  2020 jhsdb
-rwxr-xr-x 1 root root  12864 Sep 15  2020 jimage
-rwxr-xr-x 1 root root  12896 Sep 15  2020 jinfo
-rwxr-xr-x 1 root root  12896 Sep 15  2020 jjs
-rwxr-xr-x 1 root root  12896 Sep 15  2020 jlink
-rwxr-xr-x 1 root root  12896 Sep 15  2020 jmap
-rwxr-xr-x 1 root root  12864 Sep 15  2020 jmod
-rwxr-xr-x 1 root root  12864 Sep 15  2020 jps
-rwxr-xr-x 1 root root  12904 Sep 15  2020 jrunscript
-rwxr-xr-x 1 root root  12864 Sep 15  2020 jshell
-rwxr-xr-x 1 root root  12896 Sep 15  2020 jstack
-rwxr-xr-x 1 root root  12864 Sep 15  2020 jstat
-rwxr-xr-x 1 root root  12864 Sep 15  2020 jstatd
-rwxr-xr-x 1 root root  12864 Sep 15  2020 keytool
-rwxr-xr-x 1 root root  12864 Sep 15  2020 pack200
-rwxr-xr-x 1 root root  12864 Sep 15  2020 rmic
-rwxr-xr-x 1 root root  12864 Sep 15  2020 rmid
-rwxr-xr-x 1 root root  12872 Sep 15  2020 rmiregistry
-rwxr-xr-x 1 root root  12864 Sep 15  2020 serialver
-rwxr-xr-x 1 root root 121568 Sep 15  2020 unpack200
+ /home/jenkins/tools/java/latest11/bin/java -version
java version "11.0.9" 2020-10-20 LTS
Java(TM) SE Runtime Environment 18.9 (build 11.0.9+7-LTS)
Java HotSpot(TM) 64-Bit Server VM 18.9 (build 11.0.9+7-LTS, mixed mode)
+ echo which java
which java
+ which java
/home/jenkins/tools/java/latest11/bin/java
+ java -version
java version "11.0.9" 2020-10-20 LTS
Java(TM) SE Runtime Environment 18.9 (build 11.0.9+7-LTS)
Java HotSpot(TM) 64-Bit Server VM 18.9 (build 11.0.9+7-LTS, mixed mode)
+ echo which javac
which javac
+ which javac
/home/jenkins/tools/java/latest11/bin/javac
+ javac -version
javac 11.0.9
+ echo Ant-Home:
Ant-Home:
+ ls -al
total 484
drwxr-xr-x 16 jenkins jenkins   4096 Feb 22 00:24 .
drwxr-xr-x  6 jenkins jenkins   4096 Mar 10 00:32 ..
drwxr-xr-x 31 jenkins jenkins   4096 Feb 21 18:51 build
-rw-r--r--  1 jenkins jenkins  14570 Mar 17 22:54 build.gradle
-rw-r--r--  1 jenkins jenkins    172 Mar 24 00:09 build.javacheck.xml
-rw-r--r--  1 jenkins jenkins 165104 Mar 14 22:54 build.xml
-rw-r--r--  1 jenkins jenkins   3264 Mar 14 22:54 .classpath
-rw-r--r--  1 jenkins jenkins   6325 Feb 21 18:39 doap_POI.rdf
-rw-r--r--  1 jenkins jenkins   2934 Feb 21 18:39 file-leak-detector.exclude
-rw-r--r--  1 jenkins jenkins   6229 Feb 21 18:39 forrest.properties
-rw-r--r--  1 jenkins jenkins     53 Feb 21 18:39 .gitattributes
drwxr-xr-x  3 jenkins jenkins   4096 Feb 21 18:39 .github
-rw-r--r--  1 jenkins jenkins    475 Feb 22 00:24 .gitignore
drwxr-xr-x  3 jenkins jenkins   4096 Feb 21 18:39 gradle
drwxr-xr-x  6 jenkins jenkins   4096 Feb 21 18:40 .gradle
-rwxr-xr-x  1 jenkins jenkins   5770 Feb 21 18:39 gradlew
-rw-r--r--  1 jenkins jenkins   3058 Feb 21 18:39 gradlew.bat
drwxr-xr-x  2 jenkins jenkins   4096 Mar 20 10:09 jenkins
-rw-r--r--  1 jenkins jenkins 167281 Mar 11 21:54 KEYS
drwxr-xr-x  2 jenkins jenkins   4096 Feb 21 18:39 legal
drwxr-xr-x 10 jenkins jenkins   4096 Feb 22 00:25 lib
drwxr-xr-x  2 jenkins jenkins   4096 Mar 14 22:54 maven
drwxr-xr-x  3 jenkins jenkins   4096 Feb 22 00:24 osgi
-rw-r--r--  1 jenkins jenkins   4813 Feb 21 18:39 patch.xml
-rw-r--r--  1 jenkins jenkins    426 Feb 21 18:39 .project
-rw-r--r--  1 jenkins jenkins   4278 Feb 21 18:39 README.rst
drwxr-xr-x  2 jenkins jenkins   4096 Feb 21 18:39 .settings
-rw-r--r--  1 jenkins jenkins    556 Feb 21 18:39 settings.gradle
drwxr-xr-x  9 jenkins jenkins   4096 Mar 14 23:54 sonar
drwxr-xr-x 16 jenkins jenkins   4096 Feb 21 18:39 src
drwxr-xr-x  4 jenkins jenkins   4096 Mar 24 09:39 .svn
drwxr-xr-x 15 jenkins jenkins   4096 Feb 21 18:39 test-data
-rw-r--r--  1 jenkins jenkins    419 Feb 21 18:39 .travis.yml
+ echo which ant
which ant
+ which ant
/usr/bin/ant
+ ant -version
Apache Ant(TM) version 1.10.5 compiled on March 28 2019
+ echo <project default="test"><target name="test"><echo>Java ${ant.java.version}/${java.version}</echo><exec executable="javac"><arg value="-version"/></exec></target></project>
+ ant -f build.javacheck.xml -v
Apache Ant(TM) version 1.10.5 compiled on March 28 2019
Buildfile: <https://ci-builds.apache.org/job/POI/job/POI-DSL-SonarQube-Gradle/ws/build.javacheck.xml>
Detected Java version: 11 in: /usr/local/asfpackages/java/oraclejdk-11.0.9
Detected OS: Linux
parsing buildfile <https://ci-builds.apache.org/job/POI/job/POI-DSL-SonarQube-Gradle/ws/build.javacheck.xml> with URI = <https://ci-builds.apache.org/job/POI/job/POI-DSL-SonarQube-Gradle/ws/build.javacheck.xml>
Project base dir set to: <https://ci-builds.apache.org/job/POI/job/POI-DSL-SonarQube-Gradle/ws/>
Build sequence for target(s) `test' is [test]
Complete build sequence is [test, ]

test:
parsing buildfile jar:file:/usr/share/ant/lib/ant.jar!/org/apache/tools/ant/antlib.xml with URI = jar:file:/usr/share/ant/lib/ant.jar!/org/apache/tools/ant/antlib.xml from a zip file
     [echo] Java 11/11.0.9
     [exec] Current OS is Linux
     [exec] Executing 'javac' with arguments:
     [exec] '-version'
     [exec]
     [exec] The ' characters around the executable and arguments are
     [exec] not part of the command.
     [exec] javac 11.0.9

BUILD SUCCESSFUL
Total time: 0 seconds
+ exit 0
[Gradle] - Launching build.
[POI-DSL-SonarQube-Gradle] $ gradle -PenableSonar -Dsonar.login=**** -Dsonar.organization=apache -Dsonar.projectKey=poi-parent -Dsonar.host.url=https://sonarcloud.io check jacocoTestReport sonarqube
To honour the JVM settings for this build a new JVM will be forked. Please consider using the daemon: https://docs.gradle.org/6.1/userguide/gradle_daemon.html.
Daemon will be stopped at the end of the build stopping after processing

> Configure project :
Enabling Sonar support
Trying to override old definition of datatype junit
writing file <https://ci-builds.apache.org/job/POI/job/POI-DSL-SonarQube-Gradle/ws/build/ooxml/../../lib/ooxml/xmlbeans-5.0.0.jar>

FAILURE: Build failed with an exception.

* Where:
Build file '<https://ci-builds.apache.org/job/POI/job/POI-DSL-SonarQube-Gradle/ws/build.gradle'> line: 279

* What went wrong:
A problem occurred evaluating root project 'poi'.
> https://ci-builds.apache.org/job/POI/job/POI-XMLBeans-DSL-1.8/lastSuccessfulBuild/artifact/build/xmlbeans-5.0.0.jar

* Try:
Run with --stacktrace option to get the stack trace. Run with --info or --debug option to get more log output. Run with --scan to get full insights.

* Get more help at https://help.gradle.org

Deprecated Gradle features were used in this build, making it incompatible with Gradle 7.0.
Use '--warning-mode all' to show the individual deprecation warnings.
See https://docs.gradle.org/6.1/userguide/command_line_interface.html#sec:command_line_warnings

BUILD FAILED in 10s
Build step 'Invoke Gradle script' changed build result to FAILURE
Build step 'Invoke Gradle script' marked build as failure

---------------------------------------------------------------------
To unsubscribe, e-mail: [hidden email]
For additional commands, e-mail: [hidden email]

Reply | Threaded
Open this post in threaded view
|

Build failed in Jenkins: POI » POI-DSL-SonarQube-Gradle #276

Apache Jenkins Server
See <https://ci-builds.apache.org/job/POI/job/POI-DSL-SonarQube-Gradle/276/display/redirect?page=changes>

Changes:

[Dominik Stadler] Make "normalizing" the file-path actually work


------------------------------------------
Started by an SCM change
Running as SYSTEM
[EnvInject] - Loading node environment variables.
[EnvInject] - Preparing an environment for the build.
[EnvInject] - Keeping Jenkins system variables.
[EnvInject] - Keeping Jenkins build variables.
[EnvInject] - Injecting as environment variables the properties content
LANG=en_US.UTF-8
FORREST_HOME=/home/jenkins/tools/forrest/latest

[EnvInject] - Variables injected successfully.
[EnvInject] - Injecting contributions.
Building remotely on H41 (ubuntu) in workspace <https://ci-builds.apache.org/job/POI/job/POI-DSL-SonarQube-Gradle/ws/>
[WS-CLEANUP] Deleting project workspace...
[WS-CLEANUP] Done
Updating https://svn.apache.org/repos/asf/poi/trunk at revision '2021-03-24T16:09:13.259 +0000'
U         src/integrationtest/org/apache/poi/stress/AbstractFileHandler.java
U         src/integrationtest/org/apache/poi/stress/XSSFFileHandler.java

<-- Got one external: forrest.properties, svn url: https://svn.apache.org/repos/asf/poi/site/forrest.properties -->
Fetching 'https://svn.apache.org/repos/asf/poi/site/forrest.properties' at -1 into '<https://ci-builds.apache.org/job/POI/job/POI-DSL-SonarQube-Gradle/ws/forrest.properties'>
At revision 1888021


<-- Got one external: documentation, svn url: https://svn.apache.org/repos/asf/poi/site/src/documentation -->
Fetching 'https://svn.apache.org/repos/asf/poi/site/src/documentation' at -1 into '<https://ci-builds.apache.org/job/POI/job/POI-DSL-SonarQube-Gradle/ws/src/documentation'>
At revision 1888021

At revision 1888021

No changes for https://svn.apache.org/repos/asf/poi/site/forrest.properties since the previous build
No changes for https://svn.apache.org/repos/asf/poi/site/src/documentation since the previous build
Injecting SonarQube environment variables using the configuration: sonarcloud.io
[POI-DSL-SonarQube-Gradle] $ /bin/sh -xe /tmp/jenkins5399684648796149915.sh
+ svn status
?       build.javacheck.xml
    X   forrest.properties
X       src/documentation

Performing status on external item at 'src/documentation':
+ echo Java-Home: /home/jenkins/tools/java/latest11
Java-Home: /home/jenkins/tools/java/latest11
+ ls -al /home/jenkins/tools/java/latest11/
total 40
drwxr-xr-x  8 root root 4096 Dec  7 23:00 .
drwxr-xr-x 43 root root 4096 Feb 16 14:44 ..
drwxr-xr-x  2 root root 4096 Dec  7 23:00 bin
drwxr-xr-x  4 root root 4096 Dec  7 23:00 conf
drwxr-xr-x  3 root root 4096 Dec  7 23:00 include
drwxr-xr-x  2 root root 4096 Dec  7 23:00 jmods
drwxr-xr-x 73 root root 4096 Dec  7 23:00 legal
drwxr-xr-x  6 root root 4096 Dec  7 23:00 lib
-r--r--r--  1 root root  160 Sep 15  2020 README.html
-rw-r--r--  1 root root 1278 Sep 15  2020 release
+ ls -al /home/jenkins/tools/java/latest11/bin
total 640
drwxr-xr-x 2 root root   4096 Dec  7 23:00 .
drwxr-xr-x 8 root root   4096 Dec  7 23:00 ..
-rwxr-xr-x 1 root root  12984 Sep 15  2020 jaotc
-rwxr-xr-x 1 root root  12864 Sep 15  2020 jar
-rwxr-xr-x 1 root root  12864 Sep 15  2020 jarsigner
-rwxr-xr-x 1 root root  12848 Sep 15  2020 java
-rwxr-xr-x 1 root root  12896 Sep 15  2020 javac
-rwxr-xr-x 1 root root  12896 Sep 15  2020 javadoc
-rwxr-xr-x 1 root root  12864 Sep 15  2020 javap
-rwxr-xr-x 1 root root  12864 Sep 15  2020 jcmd
-rwxr-xr-x 1 root root  12912 Sep 15  2020 jconsole
-rwxr-xr-x 1 root root  12864 Sep 15  2020 jdb
-rwxr-xr-x 1 root root  12864 Sep 15  2020 jdeprscan
-rwxr-xr-x 1 root root  12864 Sep 15  2020 jdeps
-rwxr-xr-x 1 root root  12864 Sep 15  2020 jfr
-rwxr-xr-x 1 root root  12864 Sep 15  2020 jhsdb
-rwxr-xr-x 1 root root  12864 Sep 15  2020 jimage
-rwxr-xr-x 1 root root  12896 Sep 15  2020 jinfo
-rwxr-xr-x 1 root root  12896 Sep 15  2020 jjs
-rwxr-xr-x 1 root root  12896 Sep 15  2020 jlink
-rwxr-xr-x 1 root root  12896 Sep 15  2020 jmap
-rwxr-xr-x 1 root root  12864 Sep 15  2020 jmod
-rwxr-xr-x 1 root root  12864 Sep 15  2020 jps
-rwxr-xr-x 1 root root  12904 Sep 15  2020 jrunscript
-rwxr-xr-x 1 root root  12864 Sep 15  2020 jshell
-rwxr-xr-x 1 root root  12896 Sep 15  2020 jstack
-rwxr-xr-x 1 root root  12864 Sep 15  2020 jstat
-rwxr-xr-x 1 root root  12864 Sep 15  2020 jstatd
-rwxr-xr-x 1 root root  12864 Sep 15  2020 keytool
-rwxr-xr-x 1 root root  12864 Sep 15  2020 pack200
-rwxr-xr-x 1 root root  12864 Sep 15  2020 rmic
-rwxr-xr-x 1 root root  12864 Sep 15  2020 rmid
-rwxr-xr-x 1 root root  12872 Sep 15  2020 rmiregistry
-rwxr-xr-x 1 root root  12864 Sep 15  2020 serialver
-rwxr-xr-x 1 root root 121568 Sep 15  2020 unpack200
+ /home/jenkins/tools/java/latest11/bin/java -version
java version "11.0.9" 2020-10-20 LTS
Java(TM) SE Runtime Environment 18.9 (build 11.0.9+7-LTS)
Java HotSpot(TM) 64-Bit Server VM 18.9 (build 11.0.9+7-LTS, mixed mode)
+ echo which java
which java
+ which java
/home/jenkins/tools/java/latest11/bin/java
+ java -version
java version "11.0.9" 2020-10-20 LTS
Java(TM) SE Runtime Environment 18.9 (build 11.0.9+7-LTS)
Java HotSpot(TM) 64-Bit Server VM 18.9 (build 11.0.9+7-LTS, mixed mode)
+ echo which javac
which javac
+ which javac
/home/jenkins/tools/java/latest11/bin/javac
+ javac -version
javac 11.0.9
+ echo Ant-Home:
Ant-Home:
+ ls -al
total 484
drwxr-xr-x 16 jenkins jenkins   4096 Feb 22 00:24 .
drwxr-xr-x  6 jenkins jenkins   4096 Mar 10 00:32 ..
drwxr-xr-x 31 jenkins jenkins   4096 Feb 21 18:51 build
-rw-r--r--  1 jenkins jenkins  14570 Mar 17 22:54 build.gradle
-rw-r--r--  1 jenkins jenkins    172 Mar 24 09:39 build.javacheck.xml
-rw-r--r--  1 jenkins jenkins 165104 Mar 14 22:54 build.xml
-rw-r--r--  1 jenkins jenkins   3264 Mar 14 22:54 .classpath
-rw-r--r--  1 jenkins jenkins   6325 Feb 21 18:39 doap_POI.rdf
-rw-r--r--  1 jenkins jenkins   2934 Feb 21 18:39 file-leak-detector.exclude
-rw-r--r--  1 jenkins jenkins   6229 Feb 21 18:39 forrest.properties
-rw-r--r--  1 jenkins jenkins     53 Feb 21 18:39 .gitattributes
drwxr-xr-x  3 jenkins jenkins   4096 Feb 21 18:39 .github
-rw-r--r--  1 jenkins jenkins    475 Feb 22 00:24 .gitignore
drwxr-xr-x  3 jenkins jenkins   4096 Feb 21 18:39 gradle
drwxr-xr-x  6 jenkins jenkins   4096 Feb 21 18:40 .gradle
-rwxr-xr-x  1 jenkins jenkins   5770 Feb 21 18:39 gradlew
-rw-r--r--  1 jenkins jenkins   3058 Feb 21 18:39 gradlew.bat
drwxr-xr-x  2 jenkins jenkins   4096 Mar 20 10:09 jenkins
-rw-r--r--  1 jenkins jenkins 167281 Mar 11 21:54 KEYS
drwxr-xr-x  2 jenkins jenkins   4096 Feb 21 18:39 legal
drwxr-xr-x 10 jenkins jenkins   4096 Feb 22 00:25 lib
drwxr-xr-x  2 jenkins jenkins   4096 Mar 14 22:54 maven
drwxr-xr-x  3 jenkins jenkins   4096 Feb 22 00:24 osgi
-rw-r--r--  1 jenkins jenkins   4813 Feb 21 18:39 patch.xml
-rw-r--r--  1 jenkins jenkins    426 Feb 21 18:39 .project
-rw-r--r--  1 jenkins jenkins   4278 Feb 21 18:39 README.rst
drwxr-xr-x  2 jenkins jenkins   4096 Feb 21 18:39 .settings
-rw-r--r--  1 jenkins jenkins    556 Feb 21 18:39 settings.gradle
drwxr-xr-x  9 jenkins jenkins   4096 Mar 14 23:54 sonar
drwxr-xr-x 16 jenkins jenkins   4096 Feb 21 18:39 src
drwxr-xr-x  4 jenkins jenkins   4096 Mar 24 16:09 .svn
drwxr-xr-x 15 jenkins jenkins   4096 Feb 21 18:39 test-data
-rw-r--r--  1 jenkins jenkins    419 Feb 21 18:39 .travis.yml
+ echo which ant
which ant
+ which ant
/usr/bin/ant
+ ant -version
Apache Ant(TM) version 1.10.5 compiled on March 28 2019
+ echo <project default="test"><target name="test"><echo>Java ${ant.java.version}/${java.version}</echo><exec executable="javac"><arg value="-version"/></exec></target></project>
+ ant -f build.javacheck.xml -v
Apache Ant(TM) version 1.10.5 compiled on March 28 2019
Buildfile: <https://ci-builds.apache.org/job/POI/job/POI-DSL-SonarQube-Gradle/ws/build.javacheck.xml>
Detected Java version: 11 in: /usr/local/asfpackages/java/oraclejdk-11.0.9
Detected OS: Linux
parsing buildfile <https://ci-builds.apache.org/job/POI/job/POI-DSL-SonarQube-Gradle/ws/build.javacheck.xml> with URI = <https://ci-builds.apache.org/job/POI/job/POI-DSL-SonarQube-Gradle/ws/build.javacheck.xml>
Project base dir set to: <https://ci-builds.apache.org/job/POI/job/POI-DSL-SonarQube-Gradle/ws/>
Build sequence for target(s) `test' is [test]
Complete build sequence is [test, ]

test:
parsing buildfile jar:file:/usr/share/ant/lib/ant.jar!/org/apache/tools/ant/antlib.xml with URI = jar:file:/usr/share/ant/lib/ant.jar!/org/apache/tools/ant/antlib.xml from a zip file
     [echo] Java 11/11.0.9
     [exec] Current OS is Linux
     [exec] Executing 'javac' with arguments:
     [exec] '-version'
     [exec]
     [exec] The ' characters around the executable and arguments are
     [exec] not part of the command.
     [exec] javac 11.0.9

BUILD SUCCESSFUL
Total time: 0 seconds
+ exit 0
[Gradle] - Launching build.
[POI-DSL-SonarQube-Gradle] $ gradle -PenableSonar -Dsonar.login=**** -Dsonar.organization=apache -Dsonar.projectKey=poi-parent -Dsonar.host.url=https://sonarcloud.io check jacocoTestReport sonarqube
To honour the JVM settings for this build a new JVM will be forked. Please consider using the daemon: https://docs.gradle.org/6.1/userguide/gradle_daemon.html.
Daemon will be stopped at the end of the build stopping after processing

> Configure project :
Enabling Sonar support
Trying to override old definition of datatype junit
writing file <https://ci-builds.apache.org/job/POI/job/POI-DSL-SonarQube-Gradle/ws/build/ooxml/../../lib/ooxml/xmlbeans-5.0.0.jar>

FAILURE: Build failed with an exception.

* Where:
Build file '<https://ci-builds.apache.org/job/POI/job/POI-DSL-SonarQube-Gradle/ws/build.gradle'> line: 279

* What went wrong:
A problem occurred evaluating root project 'poi'.
> https://ci-builds.apache.org/job/POI/job/POI-XMLBeans-DSL-1.8/lastSuccessfulBuild/artifact/build/xmlbeans-5.0.0.jar

* Try:
Run with --stacktrace option to get the stack trace. Run with --info or --debug option to get more log output. Run with --scan to get full insights.

* Get more help at https://help.gradle.org

Deprecated Gradle features were used in this build, making it incompatible with Gradle 7.0.
Use '--warning-mode all' to show the individual deprecation warnings.
See https://docs.gradle.org/6.1/userguide/command_line_interface.html#sec:command_line_warnings

BUILD FAILED in 8s
Build step 'Invoke Gradle script' changed build result to FAILURE
Build step 'Invoke Gradle script' marked build as failure

---------------------------------------------------------------------
To unsubscribe, e-mail: [hidden email]
For additional commands, e-mail: [hidden email]

Reply | Threaded
Open this post in threaded view
|

Build failed in Jenkins: POI » POI-DSL-SonarQube-Gradle #277

Apache Jenkins Server
See <https://ci-builds.apache.org/job/POI/job/POI-DSL-SonarQube-Gradle/277/display/redirect?page=changes>

Changes:

[PJ Fanning] [github-233] Updated de.rototor.pdfbox:graphics2d to 0.31. Thanks to Tobias Stadler. This closes #233


------------------------------------------
Started by an SCM change
Running as SYSTEM
[EnvInject] - Loading node environment variables.
[EnvInject] - Preparing an environment for the build.
[EnvInject] - Keeping Jenkins system variables.
[EnvInject] - Keeping Jenkins build variables.
[EnvInject] - Injecting as environment variables the properties content
LANG=en_US.UTF-8
FORREST_HOME=/home/jenkins/tools/forrest/latest

[EnvInject] - Variables injected successfully.
[EnvInject] - Injecting contributions.
Building remotely on H25 (ubuntu) in workspace <https://ci-builds.apache.org/job/POI/job/POI-DSL-SonarQube-Gradle/ws/>
[WS-CLEANUP] Deleting project workspace...
[WS-CLEANUP] Done
Updating https://svn.apache.org/repos/asf/poi/trunk at revision '2021-03-25T09:27:07.449 +0000'
U         build.gradle
U         build.xml
U         maven/poi-ooxml.pom
U         maven/poi-ooxml-full.pom
U         maven/poi-ooxml-lite.pom
U         sonar/ooxml/pom.xml
U         sonar/pom.xml
U         src/integrationtest/org/apache/poi/stress/AbstractFileHandler.java
U         src/integrationtest/org/apache/poi/stress/XSSFFileHandler.java
U         src/integrationtest/org/apache/poi/stress/POIXMLDocumentHandler.java
U         src/integrationtest/org/apache/poi/stress/XWPFFileHandler.java
U         src/ooxml/testcases/org/apache/poi/xddf/usermodel/chart/TestXDDFChart.java
U         src/ooxml/testcases/org/apache/poi/xwpf/usermodel/TestXWPFComment.java
AU        src/ooxml/testcases/org/apache/poi/xwpf/usermodel/TestXWPFComments.java
U         src/ooxml/testcases/org/apache/poi/poifs/crypt/tests/TestHxxFEncryption.java
U         src/ooxml/java/org/apache/poi/xwpf/usermodel/XWPFAbstractFootnoteEndnote.java
U         src/ooxml/java/org/apache/poi/xwpf/usermodel/BodyType.java
U         src/ooxml/java/org/apache/poi/xwpf/usermodel/XWPFComment.java
AU        src/ooxml/java/org/apache/poi/xwpf/usermodel/XWPFComments.java
U         src/ooxml/java/org/apache/poi/xwpf/usermodel/XWPFDocument.java
U         src/ooxml/java/org/apache/poi/xwpf/usermodel/XWPFRelation.java
U         src/ooxml/java/org/apache/poi/xwpf/usermodel/XWPFRun.java
U         src/testcases/org/apache/poi/util/TestIOUtils.java
U         src/multimodule/ooxml-lite/java9/module-info.class
U         src/multimodule/ooxml-lite/java9/module-info.java
U         src/java/org/apache/poi/poifs/filesystem/POIFSMiniStore.java
U         src/java/org/apache/poi/poifs/filesystem/POIFSStream.java
U         src/java/org/apache/poi/ss/format/CellFormatPart.java
U         src/java/org/apache/poi/ss/formula/atp/AnalysisToolPak.java
AU        src/java/org/apache/poi/ss/formula/functions/Single.java
U         src/java/org/apache/poi/ss/formula/functions/TextFunction.java
U         src/java/org/apache/poi/util/IOUtils.java
U         src/java/org/apache/poi/POIDocument.java
U         src/java/org/apache/poi/hssf/usermodel/HSSFWorkbook.java
U         src/java/org/apache/poi/hssf/dev/BiffViewer.java
U         src/java/org/apache/poi/hssf/model/InternalSheet.java
U         src/java/org/apache/poi/hssf/model/InternalWorkbook.java
U         src/scratchpad/testcases/org/apache/poi/hsmf/TestBasics.java
U         src/scratchpad/src/org/apache/poi/hslf/usermodel/HSLFSlideShow.java
U         jenkins/create_jobs.groovy
U         test-data/spreadsheet/FormatConditionTests.xlsx
U         test-data/spreadsheet/FormulaEvalTestData.xls
U         .classpath

<-- Got one external: forrest.properties, svn url: https://svn.apache.org/repos/asf/poi/site/forrest.properties -->
Fetching 'https://svn.apache.org/repos/asf/poi/site/forrest.properties' at -1 into '<https://ci-builds.apache.org/job/POI/job/POI-DSL-SonarQube-Gradle/ws/forrest.properties'>
At revision 1888058


<-- Got one external: documentation, svn url: https://svn.apache.org/repos/asf/poi/site/src/documentation -->
Fetching 'https://svn.apache.org/repos/asf/poi/site/src/documentation' at -1 into '<https://ci-builds.apache.org/job/POI/job/POI-DSL-SonarQube-Gradle/ws/src/documentation'>
U         src/documentation/content/xdocs/changes.xml
At revision 1888058

At revision 1888058

No changes for https://svn.apache.org/repos/asf/poi/site/forrest.properties since the previous build
No changes for https://svn.apache.org/repos/asf/poi/site/src/documentation since the previous build
Injecting SonarQube environment variables using the configuration: sonarcloud.io
[POI-DSL-SonarQube-Gradle] $ /bin/sh -xe /tmp/jenkins6576178575887024870.sh
+ svn status
?       build.javacheck.xml
    X   forrest.properties
X       src/documentation
M       src/multimodule/ooxml-full/java9/module-info.class

Performing status on external item at 'src/documentation':
+ echo Java-Home: /home/jenkins/tools/java/latest11
Java-Home: /home/jenkins/tools/java/latest11
+ ls -al /home/jenkins/tools/java/latest11/
total 40
drwxr-xr-x  8 root root 4096 Dec  7 22:56 .
drwxr-xr-x 43 root root 4096 Feb 16 14:45 ..
drwxr-xr-x  2 root root 4096 Dec  7 22:56 bin
drwxr-xr-x  4 root root 4096 Dec  7 22:56 conf
drwxr-xr-x  3 root root 4096 Dec  7 22:56 include
drwxr-xr-x  2 root root 4096 Dec  7 22:56 jmods
drwxr-xr-x 73 root root 4096 Dec  7 22:56 legal
drwxr-xr-x  6 root root 4096 Dec  7 22:56 lib
-r--r--r--  1 root root  160 Sep 15  2020 README.html
-rw-r--r--  1 root root 1278 Sep 15  2020 release
+ ls -al /home/jenkins/tools/java/latest11/bin
total 640
drwxr-xr-x 2 root root   4096 Dec  7 22:56 .
drwxr-xr-x 8 root root   4096 Dec  7 22:56 ..
-rwxr-xr-x 1 root root  12984 Sep 15  2020 jaotc
-rwxr-xr-x 1 root root  12864 Sep 15  2020 jar
-rwxr-xr-x 1 root root  12864 Sep 15  2020 jarsigner
-rwxr-xr-x 1 root root  12848 Sep 15  2020 java
-rwxr-xr-x 1 root root  12896 Sep 15  2020 javac
-rwxr-xr-x 1 root root  12896 Sep 15  2020 javadoc
-rwxr-xr-x 1 root root  12864 Sep 15  2020 javap
-rwxr-xr-x 1 root root  12864 Sep 15  2020 jcmd
-rwxr-xr-x 1 root root  12912 Sep 15  2020 jconsole
-rwxr-xr-x 1 root root  12864 Sep 15  2020 jdb
-rwxr-xr-x 1 root root  12864 Sep 15  2020 jdeprscan
-rwxr-xr-x 1 root root  12864 Sep 15  2020 jdeps
-rwxr-xr-x 1 root root  12864 Sep 15  2020 jfr
-rwxr-xr-x 1 root root  12864 Sep 15  2020 jhsdb
-rwxr-xr-x 1 root root  12864 Sep 15  2020 jimage
-rwxr-xr-x 1 root root  12896 Sep 15  2020 jinfo
-rwxr-xr-x 1 root root  12896 Sep 15  2020 jjs
-rwxr-xr-x 1 root root  12896 Sep 15  2020 jlink
-rwxr-xr-x 1 root root  12896 Sep 15  2020 jmap
-rwxr-xr-x 1 root root  12864 Sep 15  2020 jmod
-rwxr-xr-x 1 root root  12864 Sep 15  2020 jps
-rwxr-xr-x 1 root root  12904 Sep 15  2020 jrunscript
-rwxr-xr-x 1 root root  12864 Sep 15  2020 jshell
-rwxr-xr-x 1 root root  12896 Sep 15  2020 jstack
-rwxr-xr-x 1 root root  12864 Sep 15  2020 jstat
-rwxr-xr-x 1 root root  12864 Sep 15  2020 jstatd
-rwxr-xr-x 1 root root  12864 Sep 15  2020 keytool
-rwxr-xr-x 1 root root  12864 Sep 15  2020 pack200
-rwxr-xr-x 1 root root  12864 Sep 15  2020 rmic
-rwxr-xr-x 1 root root  12864 Sep 15  2020 rmid
-rwxr-xr-x 1 root root  12872 Sep 15  2020 rmiregistry
-rwxr-xr-x 1 root root  12864 Sep 15  2020 serialver
-rwxr-xr-x 1 root root 121568 Sep 15  2020 unpack200
+ /home/jenkins/tools/java/latest11/bin/java -version
java version "11.0.9" 2020-10-20 LTS
Java(TM) SE Runtime Environment 18.9 (build 11.0.9+7-LTS)
Java HotSpot(TM) 64-Bit Server VM 18.9 (build 11.0.9+7-LTS, mixed mode)
+ echo which java
which java
+ which java
/home/jenkins/tools/java/latest11/bin/java
+ java -version
java version "11.0.9" 2020-10-20 LTS
Java(TM) SE Runtime Environment 18.9 (build 11.0.9+7-LTS)
Java HotSpot(TM) 64-Bit Server VM 18.9 (build 11.0.9+7-LTS, mixed mode)
+ echo which javac
which javac
+ which javac
/home/jenkins/tools/java/latest11/bin/javac
+ javac -version
javac 11.0.9
+ echo Ant-Home:
Ant-Home:
+ ls -al
total 484
drwxr-xr-x 16 jenkins jenkins   4096 Feb 22 18:39 .
drwxr-xr-x  8 jenkins jenkins   4096 Mar 23 14:31 ..
drwxr-xr-x 31 jenkins jenkins   4096 Dec  4 05:21 build
-rw-r--r--  1 jenkins jenkins  14570 Mar 25 09:27 build.gradle
-rw-r--r--  1 jenkins jenkins    172 Mar 14 19:09 build.javacheck.xml
-rw-r--r--  1 jenkins jenkins 165104 Mar 25 09:27 build.xml
-rw-r--r--  1 jenkins jenkins   3264 Mar 25 09:27 .classpath
-rw-r--r--  1 jenkins jenkins   6325 Jan 23 23:09 doap_POI.rdf
-rw-r--r--  1 jenkins jenkins   2934 Jan 23 23:09 file-leak-detector.exclude
-rw-r--r--  1 jenkins jenkins   6229 Dec  4 05:11 forrest.properties
-rw-r--r--  1 jenkins jenkins     53 Dec  4 05:11 .gitattributes
drwxr-xr-x  3 jenkins jenkins   4096 Dec 28 14:54 .github
-rw-r--r--  1 jenkins jenkins    475 Feb 22 18:39 .gitignore
drwxr-xr-x  3 jenkins jenkins   4096 Dec  4 05:11 gradle
drwxr-xr-x  5 jenkins jenkins   4096 Dec  4 05:11 .gradle
-rwxr-xr-x  1 jenkins jenkins   5770 Jan 23 23:09 gradlew
-rw-r--r--  1 jenkins jenkins   3058 Jan 23 23:09 gradlew.bat
drwxr-xr-x  2 jenkins jenkins   4096 Mar 25 09:27 jenkins
-rw-r--r--  1 jenkins jenkins 167281 Mar 14 10:54 KEYS
drwxr-xr-x  2 jenkins jenkins   4096 Dec  4 05:11 legal
drwxr-xr-x 10 jenkins jenkins   4096 Feb 22 18:40 lib
drwxr-xr-x  2 jenkins jenkins   4096 Mar 25 09:27 maven
drwxr-xr-x  3 jenkins jenkins   4096 Feb 22 18:39 osgi
-rw-r--r--  1 jenkins jenkins   4813 Dec  4 05:11 patch.xml
-rw-r--r--  1 jenkins jenkins    426 Dec  4 05:11 .project
-rw-r--r--  1 jenkins jenkins   4278 Dec 13 18:46 README.rst
drwxr-xr-x  2 jenkins jenkins   4096 Dec  4 05:11 .settings
-rw-r--r--  1 jenkins jenkins    556 Dec  4 05:11 settings.gradle
drwxr-xr-x  9 jenkins jenkins   4096 Mar 25 09:27 sonar
drwxr-xr-x 16 jenkins jenkins   4096 Dec  4 05:11 src
drwxr-xr-x  4 jenkins jenkins   4096 Mar 25 09:27 .svn
drwxr-xr-x 15 jenkins jenkins   4096 Jan 23 23:09 test-data
-rw-r--r--  1 jenkins jenkins    419 Dec 10 18:24 .travis.yml
+ echo which ant
which ant
+ which ant
/usr/bin/ant
+ ant -version
Apache Ant(TM) version 1.10.5 compiled on March 28 2019
+ echo <project default="test"><target name="test"><echo>Java ${ant.java.version}/${java.version}</echo><exec executable="javac"><arg value="-version"/></exec></target></project>
+ ant -f build.javacheck.xml -v
Apache Ant(TM) version 1.10.5 compiled on March 28 2019
Buildfile: <https://ci-builds.apache.org/job/POI/job/POI-DSL-SonarQube-Gradle/ws/build.javacheck.xml>
Detected Java version: 11 in: /usr/local/asfpackages/java/oraclejdk-11.0.9
Detected OS: Linux
parsing buildfile <https://ci-builds.apache.org/job/POI/job/POI-DSL-SonarQube-Gradle/ws/build.javacheck.xml> with URI = <https://ci-builds.apache.org/job/POI/job/POI-DSL-SonarQube-Gradle/ws/build.javacheck.xml>
Project base dir set to: <https://ci-builds.apache.org/job/POI/job/POI-DSL-SonarQube-Gradle/ws/>
Build sequence for target(s) `test' is [test]
Complete build sequence is [test, ]

test:
parsing buildfile jar:file:/usr/share/ant/lib/ant.jar!/org/apache/tools/ant/antlib.xml with URI = jar:file:/usr/share/ant/lib/ant.jar!/org/apache/tools/ant/antlib.xml from a zip file
     [echo] Java 11/11.0.9
     [exec] Current OS is Linux
     [exec] Executing 'javac' with arguments:
     [exec] '-version'
     [exec]
     [exec] The ' characters around the executable and arguments are
     [exec] not part of the command.
     [exec] javac 11.0.9

BUILD SUCCESSFUL
Total time: 0 seconds
+ exit 0
[Gradle] - Launching build.
[POI-DSL-SonarQube-Gradle] $ gradle -PenableSonar -Dsonar.login=**** -Dsonar.organization=apache -Dsonar.projectKey=poi-parent -Dsonar.host.url=https://sonarcloud.io check jacocoTestReport sonarqube
To honour the JVM settings for this build a new JVM will be forked. Please consider using the daemon: https://docs.gradle.org/5.6/userguide/gradle_daemon.html.
Daemon will be stopped at the end of the build stopping after processing

> Configure project :
Enabling Sonar support
Trying to override old definition of datatype junit
writing file <https://ci-builds.apache.org/job/POI/job/POI-DSL-SonarQube-Gradle/ws/build/ooxml/../../lib/ooxml/xmlbeans-5.0.0.jar>

FAILURE: Build failed with an exception.

* Where:
Build file '<https://ci-builds.apache.org/job/POI/job/POI-DSL-SonarQube-Gradle/ws/build.gradle'> line: 279

* What went wrong:
A problem occurred evaluating root project 'poi'.
> https://ci-builds.apache.org/job/POI/job/POI-XMLBeans-DSL-1.8/lastSuccessfulBuild/artifact/build/xmlbeans-5.0.0.jar

* Try:
Run with --stacktrace option to get the stack trace. Run with --info or --debug option to get more log output. Run with --scan to get full insights.

* Get more help at https://help.gradle.org

BUILD FAILED in 12s
Build step 'Invoke Gradle script' changed build result to FAILURE
Build step 'Invoke Gradle script' marked build as failure

---------------------------------------------------------------------
To unsubscribe, e-mail: [hidden email]
For additional commands, e-mail: [hidden email]

Reply | Threaded
Open this post in threaded view
|

Jenkins build is back to normal : POI » POI-DSL-SonarQube-Gradle #278

Apache Jenkins Server
See <https://ci-builds.apache.org/job/POI/job/POI-DSL-SonarQube-Gradle/278/display/redirect?page=changes>


---------------------------------------------------------------------
To unsubscribe, e-mail: [hidden email]
For additional commands, e-mail: [hidden email]