Build failed in Jenkins: POI » POI-DSL-SonarQube-Gradle #206

classic Classic list List threaded Threaded
2 messages Options
Reply | Threaded
Open this post in threaded view
|

Build failed in Jenkins: POI » POI-DSL-SonarQube-Gradle #206

Apache Jenkins Server
See <https://ci-builds.apache.org/job/POI/job/POI-DSL-SonarQube-Gradle/206/display/redirect?page=changes>

Changes:

[Marius Volkhart] Documentation for some EscherRecordTypes


------------------------------------------
Started by an SCM change
Running as SYSTEM
[EnvInject] - Loading node environment variables.
[EnvInject] - Preparing an environment for the build.
[EnvInject] - Keeping Jenkins system variables.
[EnvInject] - Keeping Jenkins build variables.
[EnvInject] - Injecting as environment variables the properties content
LANG=en_US.UTF-8
FORREST_HOME=/home/jenkins/tools/forrest/latest

[EnvInject] - Variables injected successfully.
[EnvInject] - Injecting contributions.
Building remotely on H33 (ubuntu) in workspace <https://ci-builds.apache.org/job/POI/job/POI-DSL-SonarQube-Gradle/ws/>
[WS-CLEANUP] Deleting project workspace...
[WS-CLEANUP] Done
Updating https://svn.apache.org/repos/asf/poi/trunk at revision '2021-02-17T15:24:15.886 +0000'
U         src/java/org/apache/poi/ddf/EscherRecordTypes.java
U         src/java/org/apache/poi/hssf/record/DrawingGroupRecord.java
U         src/ooxml/java/org/apache/poi/xddf/usermodel/chart/XDDFCategoryDataSource.java
U         src/ooxml/java/org/apache/poi/xddf/usermodel/chart/XDDFChart.java
U         src/ooxml/java/org/apache/poi/xddf/usermodel/chart/XDDFChartData.java
U         src/ooxml/java/org/apache/poi/xddf/usermodel/chart/XDDFDataSource.java
U         src/ooxml/java/org/apache/poi/xddf/usermodel/chart/XDDFDataSourcesFactory.java
U         src/ooxml/java/org/apache/poi/xslf/usermodel/XSLFChart.java
U         src/ooxml/java/org/apache/poi/xssf/usermodel/XSSFChart.java
U         src/ooxml/java/org/apache/poi/xssf/usermodel/XSSFDrawing.java
U         src/ooxml/java/org/apache/poi/xssf/usermodel/XSSFWorkbook.java
U         src/ooxml/java/org/apache/poi/xssf/eventusermodel/XSSFReader.java
U         src/ooxml/java/org/apache/poi/openxml4j/opc/OPCPackage.java
U         src/ooxml/testcases/org/apache/poi/xssf/TestXSSFCloneSheet.java
U         src/ooxml/testcases/org/apache/poi/xssf/usermodel/TestXSSFDrawing.java
U         src/ooxml/testcases/org/apache/poi/openxml4j/opc/TestPackage.java

<-- Got one external: forrest.properties, svn url: https://svn.apache.org/repos/asf/poi/site/forrest.properties -->
Fetching 'https://svn.apache.org/repos/asf/poi/site/forrest.properties' at -1 into '<https://ci-builds.apache.org/job/POI/job/POI-DSL-SonarQube-Gradle/ws/forrest.properties'>
At revision 1886620


<-- Got one external: documentation, svn url: https://svn.apache.org/repos/asf/poi/site/src/documentation -->
Fetching 'https://svn.apache.org/repos/asf/poi/site/src/documentation' at -1 into '<https://ci-builds.apache.org/job/POI/job/POI-DSL-SonarQube-Gradle/ws/src/documentation'>
U         src/documentation/content/xdocs/changes.xml
At revision 1886620

At revision 1886620

No changes for https://svn.apache.org/repos/asf/poi/site/forrest.properties since the previous build
No changes for https://svn.apache.org/repos/asf/poi/site/src/documentation since the previous build
Injecting SonarQube environment variables using the configuration: sonarcloud.io
[POI-DSL-SonarQube-Gradle] $ /bin/sh -xe /tmp/jenkins7722249839111730420.sh
+ svn status
?       build.javacheck.xml
    X   forrest.properties
X       src/documentation

Performing status on external item at 'src/documentation':
+ echo Java-Home: /home/jenkins/tools/java/latest11
Java-Home: /home/jenkins/tools/java/latest11
+ ls -al /home/jenkins/tools/java/latest11/
total 40
drwxr-xr-x  8 root root 4096 Dec  7 22:54 .
drwxr-xr-x 43 root root 4096 Feb 16 14:45 ..
drwxr-xr-x  2 root root 4096 Dec  7 22:54 bin
drwxr-xr-x  4 root root 4096 Dec  7 22:54 conf
drwxr-xr-x  3 root root 4096 Dec  7 22:54 include
drwxr-xr-x  2 root root 4096 Dec  7 22:54 jmods
drwxr-xr-x 73 root root 4096 Dec  7 22:54 legal
drwxr-xr-x  6 root root 4096 Dec  7 22:54 lib
-r--r--r--  1 root root  160 Sep 15 15:56 README.html
-rw-r--r--  1 root root 1278 Sep 15 15:56 release
+ ls -al /home/jenkins/tools/java/latest11/bin
total 640
drwxr-xr-x 2 root root   4096 Dec  7 22:54 .
drwxr-xr-x 8 root root   4096 Dec  7 22:54 ..
-rwxr-xr-x 1 root root  12984 Sep 15 15:56 jaotc
-rwxr-xr-x 1 root root  12864 Sep 15 15:56 jar
-rwxr-xr-x 1 root root  12864 Sep 15 15:56 jarsigner
-rwxr-xr-x 1 root root  12848 Sep 15 15:56 java
-rwxr-xr-x 1 root root  12896 Sep 15 15:56 javac
-rwxr-xr-x 1 root root  12896 Sep 15 15:56 javadoc
-rwxr-xr-x 1 root root  12864 Sep 15 15:56 javap
-rwxr-xr-x 1 root root  12864 Sep 15 15:56 jcmd
-rwxr-xr-x 1 root root  12912 Sep 15 15:56 jconsole
-rwxr-xr-x 1 root root  12864 Sep 15 15:56 jdb
-rwxr-xr-x 1 root root  12864 Sep 15 15:56 jdeprscan
-rwxr-xr-x 1 root root  12864 Sep 15 15:56 jdeps
-rwxr-xr-x 1 root root  12864 Sep 15 15:56 jfr
-rwxr-xr-x 1 root root  12864 Sep 15 15:56 jhsdb
-rwxr-xr-x 1 root root  12864 Sep 15 15:56 jimage
-rwxr-xr-x 1 root root  12896 Sep 15 15:56 jinfo
-rwxr-xr-x 1 root root  12896 Sep 15 15:56 jjs
-rwxr-xr-x 1 root root  12896 Sep 15 15:56 jlink
-rwxr-xr-x 1 root root  12896 Sep 15 15:56 jmap
-rwxr-xr-x 1 root root  12864 Sep 15 15:56 jmod
-rwxr-xr-x 1 root root  12864 Sep 15 15:56 jps
-rwxr-xr-x 1 root root  12904 Sep 15 15:56 jrunscript
-rwxr-xr-x 1 root root  12864 Sep 15 15:56 jshell
-rwxr-xr-x 1 root root  12896 Sep 15 15:56 jstack
-rwxr-xr-x 1 root root  12864 Sep 15 15:56 jstat
-rwxr-xr-x 1 root root  12864 Sep 15 15:56 jstatd
-rwxr-xr-x 1 root root  12864 Sep 15 15:56 keytool
-rwxr-xr-x 1 root root  12864 Sep 15 15:56 pack200
-rwxr-xr-x 1 root root  12864 Sep 15 15:56 rmic
-rwxr-xr-x 1 root root  12864 Sep 15 15:56 rmid
-rwxr-xr-x 1 root root  12872 Sep 15 15:56 rmiregistry
-rwxr-xr-x 1 root root  12864 Sep 15 15:56 serialver
-rwxr-xr-x 1 root root 121568 Sep 15 15:56 unpack200
+ /home/jenkins/tools/java/latest11/bin/java -version
java version "11.0.9" 2020-10-20 LTS
Java(TM) SE Runtime Environment 18.9 (build 11.0.9+7-LTS)
Java HotSpot(TM) 64-Bit Server VM 18.9 (build 11.0.9+7-LTS, mixed mode)
+ echo which java
which java
+ which java
/home/jenkins/tools/java/latest11/bin/java
+ java -version
java version "11.0.9" 2020-10-20 LTS
Java(TM) SE Runtime Environment 18.9 (build 11.0.9+7-LTS)
Java HotSpot(TM) 64-Bit Server VM 18.9 (build 11.0.9+7-LTS, mixed mode)
+ echo which javac
which javac
+ which javac
/home/jenkins/tools/java/latest11/bin/javac
+ javac -version
javac 11.0.9
+ echo Ant-Home:
Ant-Home:
+ ls -al
total 468
drwxr-xr-x 14 jenkins jenkins   4096 Feb 15 15:25 .
drwxr-xr-x  8 jenkins jenkins   4096 Feb 15 15:24 ..
-rw-r--r--  1 jenkins jenkins  14850 Feb 15 15:24 build.gradle
-rw-r--r--  1 jenkins jenkins    172 Feb 15 15:25 build.javacheck.xml
-rw-r--r--  1 jenkins jenkins 157302 Feb 15 15:24 build.xml
-rw-r--r--  1 jenkins jenkins   3345 Feb 15 15:24 .classpath
-rw-r--r--  1 jenkins jenkins   6325 Feb 15 15:25 doap_POI.rdf
-rw-r--r--  1 jenkins jenkins   2934 Feb 15 15:25 file-leak-detector.exclude
-rw-r--r--  1 jenkins jenkins   6229 Feb 15 15:25 forrest.properties
-rw-r--r--  1 jenkins jenkins     53 Feb 15 15:25 .gitattributes
drwxr-xr-x  3 jenkins jenkins   4096 Feb 15 15:24 .github
-rw-r--r--  1 jenkins jenkins    482 Feb 15 15:25 .gitignore
drwxr-xr-x  3 jenkins jenkins   4096 Feb 15 15:25 gradle
drwxr-xr-x  4 jenkins jenkins   4096 Feb 15 15:25 .gradle
-rwxr-xr-x  1 jenkins jenkins   5770 Feb 15 15:25 gradlew
-rw-r--r--  1 jenkins jenkins   3058 Feb 15 15:25 gradlew.bat
drwxr-xr-x  2 jenkins jenkins   4096 Feb 15 15:25 jenkins
-rw-r--r--  1 jenkins jenkins 167284 Feb 15 15:25 KEYS
drwxr-xr-x  2 jenkins jenkins   4096 Feb 15 15:25 legal
drwxr-xr-x  2 jenkins jenkins   4096 Feb 15 15:24 maven
drwxr-xr-x  3 jenkins jenkins   4096 Feb 15 15:24 osgi
-rw-r--r--  1 jenkins jenkins   4813 Feb 15 15:25 patch.xml
-rw-r--r--  1 jenkins jenkins    426 Feb 15 15:25 .project
-rw-r--r--  1 jenkins jenkins   4278 Feb 15 15:25 README.rst
drwxr-xr-x  2 jenkins jenkins   4096 Feb 15 15:25 .settings
-rw-r--r--  1 jenkins jenkins    556 Feb 15 15:25 settings.gradle
drwxr-xr-x  9 jenkins jenkins   4096 Feb 15 15:24 sonar
drwxr-xr-x 16 jenkins jenkins   4096 Feb 15 15:25 src
drwxr-xr-x  4 jenkins jenkins   4096 Feb 17 15:24 .svn
drwxr-xr-x 15 jenkins jenkins   4096 Feb 15 15:25 test-data
-rw-r--r--  1 jenkins jenkins    419 Feb 15 15:25 .travis.yml
+ echo which ant
which ant
+ which ant
/usr/bin/ant
+ ant -version
Apache Ant(TM) version 1.10.5 compiled on March 28 2019
+ echo <project default="test"><target name="test"><echo>Java ${ant.java.version}/${java.version}</echo><exec executable="javac"><arg value="-version"/></exec></target></project>
+ ant -f build.javacheck.xml -v
Apache Ant(TM) version 1.10.5 compiled on March 28 2019
Buildfile: <https://ci-builds.apache.org/job/POI/job/POI-DSL-SonarQube-Gradle/ws/build.javacheck.xml>
Detected Java version: 11 in: /usr/local/asfpackages/java/oraclejdk-11.0.9
Detected OS: Linux
parsing buildfile <https://ci-builds.apache.org/job/POI/job/POI-DSL-SonarQube-Gradle/ws/build.javacheck.xml> with URI = <https://ci-builds.apache.org/job/POI/job/POI-DSL-SonarQube-Gradle/ws/build.javacheck.xml>
Project base dir set to: <https://ci-builds.apache.org/job/POI/job/POI-DSL-SonarQube-Gradle/ws/>
Build sequence for target(s) `test' is [test]
Complete build sequence is [test, ]

test:
parsing buildfile jar:file:/usr/share/ant/lib/ant.jar!/org/apache/tools/ant/antlib.xml with URI = jar:file:/usr/share/ant/lib/ant.jar!/org/apache/tools/ant/antlib.xml from a zip file
     [echo] Java 11/11.0.9
     [exec] Current OS is Linux
     [exec] Executing 'javac' with arguments:
     [exec] '-version'
     [exec]
     [exec] The ' characters around the executable and arguments are
     [exec] not part of the command.
     [exec] javac 11.0.9

BUILD SUCCESSFUL
Total time: 1 second
+ exit 0
[Gradle] - Launching build.
[POI-DSL-SonarQube-Gradle] $ gradle -PenableSonar -Dsonar.login=**** -Dsonar.organization=apache -Dsonar.projectKey=poi-parent -Dsonar.host.url=https://sonarcloud.io check jacocoTestReport sonarqube
WARNING: An illegal reflective access operation has occurred
WARNING: Illegal reflective access by org.codehaus.groovy.reflection.CachedClass (file:/usr/lib/gradle/4.10.3/lib/groovy-all-2.4.15.jar) to method java.lang.Object.finalize()
WARNING: Please consider reporting this to the maintainers of org.codehaus.groovy.reflection.CachedClass
WARNING: Use --illegal-access=warn to enable warnings of further illegal reflective access operations
WARNING: All illegal access operations will be denied in a future release

> Configure project :
Enabling Sonar support

FAILURE: Build failed with an exception.

* Where:
Build file '<https://ci-builds.apache.org/job/POI/job/POI-DSL-SonarQube-Gradle/ws/build.gradle'> line: 45

* What went wrong:
A problem occurred evaluating root project 'poi'.
> Could not get unknown property 'Bundling' for {} of type org.gradle.api.internal.attributes.DefaultMutableAttributeContainer.

* Try:
Run with --stacktrace option to get the stack trace. Run with --info or --debug option to get more log output. Run with --scan to get full insights.

* Get more help at https://help.gradle.org

BUILD FAILED in 8s
Build step 'Invoke Gradle script' changed build result to FAILURE
Build step 'Invoke Gradle script' marked build as failure
WARN: Unable to locate 'report-task.txt' in the workspace. Did the SonarScanner succeed?

---------------------------------------------------------------------
To unsubscribe, e-mail: [hidden email]
For additional commands, e-mail: [hidden email]

Reply | Threaded
Open this post in threaded view
|

Jenkins build is back to normal : POI » POI-DSL-SonarQube-Gradle #207

Apache Jenkins Server
See <https://ci-builds.apache.org/job/POI/job/POI-DSL-SonarQube-Gradle/207/display/redirect?page=changes>


---------------------------------------------------------------------
To unsubscribe, e-mail: [hidden email]
For additional commands, e-mail: [hidden email]