Build failed in Jenkins: POI » POI-DSL-SonarQube-Gradle #140

classic Classic list List threaded Threaded
3 messages Options
Reply | Threaded
Open this post in threaded view
|

Build failed in Jenkins: POI » POI-DSL-SonarQube-Gradle #140

Apache Jenkins Server
See <https://ci-builds.apache.org/job/POI/job/POI-DSL-SonarQube-Gradle/140/display/redirect?page=changes>

Changes:

[Andreas Beeker] Sonar fixes
add asserts to tests


------------------------------------------
[...truncated 80.18 KB...]
U         src/scratchpad/src/org/apache/poi/extractor/ole2/OLE2ScratchpadExtractorFactory.java
U         src/scratchpad/src/org/apache/poi/hslf/usermodel/HSLFSlideShow.java
U         src/scratchpad/src/org/apache/poi/hslf/usermodel/HSLFSlideShowImpl.java
U         src/scratchpad/src/org/apache/poi/hwpf/model/TextPieceTable.java
U         src/java/org/apache/poi/hssf/extractor/EventBasedExcelExtractor.java
U         src/java/org/apache/poi/hssf/extractor/OldExcelExtractor.java
U         src/java/org/apache/poi/hssf/usermodel/HSSFWorkbookFactory.java
U         src/java/org/apache/poi/EmptyFileException.java
U         src/java/org/apache/poi/extractor/ExtractorFactory.java
U         src/java/org/apache/poi/poifs/filesystem/POIFSFileSystem.java
U         src/java/org/apache/poi/sl/usermodel/SlideShowFactory.java
U         src/java/org/apache/poi/sl/draw/PathGradientPaint.java
U         src/java/org/apache/poi/sl/draw/DrawTexturePaint.java
U         src/java/org/apache/poi/ss/usermodel/WorkbookFactory.java
U         src/java/org/apache/poi/ss/formula/BaseFormulaEvaluator.java
U         src/java/org/apache/poi/ss/formula/eval/ErrorEval.java
U         src/java/org/apache/poi/ss/formula/eval/NumericValueEval.java
U         src/java/org/apache/poi/ss/formula/functions/Match.java
U         src/java/org/apache/poi/ss/util/SheetUtil.java
U         src/java/org/apache/poi/util/IOUtils.java
U         src/java/org/apache/poi/ddf/DefaultEscherRecordFactory.java
U         src/java/org/apache/poi/ddf/EscherBitmapBlip.java
U         src/java/org/apache/poi/ddf/EscherRecordTypes.java
U         src/examples/src/org/apache/poi/examples/ss/ExcelComparator.java
U         build.xml
U         test-data/spreadsheet/resize_compare.xlsx
A         test-data/spreadsheet/64450.xlsx
A         test-data/spreadsheet/64750.xlsx
U         test-data/spreadsheet/MatchFunctionTestCaseData.xls
A         test-data/spreadsheet/64759.xlsx
AU        test-data/slideshow/empty-polygon-close.wmf
A         test-data/document/64132.doc
A         test-data/integration
A         test-data/integration/stress023.docx
A         test-data/integration/stress024.xlsx
A         test-data/integration/stress025.docx
AU        test-data/integration/stress022.pptx
AU        test-data/integration/stress021.pptx
AU        test-data/integration/stress001.docx
AU        test-data/integration/stress002.xlsx
AU        test-data/integration/stress003.docx
AU        test-data/integration/stress004.docx
AU        test-data/integration/stress005.docx
AU        test-data/integration/stress006.docx
AU        test-data/integration/stress007.docx
AU        test-data/integration/stress008.docx
AU        test-data/integration/stress009.docx
AU        test-data/integration/stress010.docx
AU        test-data/integration/stress011.docx
AU        test-data/integration/stress012.docx
AU        test-data/integration/stress013.pptx
AU        test-data/integration/stress014.docx
AU        test-data/integration/stress015.docx
AU        test-data/integration/stress016.docx
AU        test-data/integration/stress017.docx
AU        test-data/integration/stress018.docx
AU        test-data/integration/stress019.docx
AU        test-data/integration/stress020.xlsx
U         file-leak-detector.exclude
U         build.gradle
U         .github/workflows/test-ant.yml

<-- Got one external: forrest.properties, svn url: https://svn.apache.org/repos/asf/poi/site/forrest.properties -->
Fetching 'https://svn.apache.org/repos/asf/poi/site/forrest.properties' at -1 into '<https://ci-builds.apache.org/job/POI/job/POI-DSL-SonarQube-Gradle/ws/forrest.properties'>
At revision 1885343


<-- Got one external: documentation, svn url: https://svn.apache.org/repos/asf/poi/site/src/documentation -->
Fetching 'https://svn.apache.org/repos/asf/poi/site/src/documentation' at -1 into '<https://ci-builds.apache.org/job/POI/job/POI-DSL-SonarQube-Gradle/ws/src/documentation'>
U         src/documentation/content/xdocs/changes.xml
At revision 1885343

At revision 1885343

No changes for https://svn.apache.org/repos/asf/poi/site/forrest.properties since the previous build
No changes for https://svn.apache.org/repos/asf/poi/site/src/documentation since the previous build
Injecting SonarQube environment variables using the configuration: sonarcloud.io
[POI-DSL-SonarQube-Gradle] $ /bin/sh -xe /tmp/jenkins2670985832346591541.sh
+ svn status
?       build.javacheck.xml
    X   forrest.properties
X       src/documentation

Performing status on external item at 'src/documentation':
+ echo Java-Home: /home/jenkins/tools/java/latest11
Java-Home: /home/jenkins/tools/java/latest11
+ ls -al /home/jenkins/tools/java/latest11/
total 40
drwxr-xr-x  8 root root 4096 Dec  7 22:54 .
drwxr-xr-x 39 root root 4096 Jan  2 19:03 ..
drwxr-xr-x  2 root root 4096 Dec  7 22:54 bin
drwxr-xr-x  4 root root 4096 Dec  7 22:54 conf
drwxr-xr-x  3 root root 4096 Dec  7 22:54 include
drwxr-xr-x  2 root root 4096 Dec  7 22:54 jmods
drwxr-xr-x 73 root root 4096 Dec  7 22:54 legal
drwxr-xr-x  6 root root 4096 Dec  7 22:54 lib
-r--r--r--  1 root root  160 Sep 15 15:56 README.html
-rw-r--r--  1 root root 1278 Sep 15 15:56 release
+ ls -al /home/jenkins/tools/java/latest11/bin
total 640
drwxr-xr-x 2 root root   4096 Dec  7 22:54 .
drwxr-xr-x 8 root root   4096 Dec  7 22:54 ..
-rwxr-xr-x 1 root root  12984 Sep 15 15:56 jaotc
-rwxr-xr-x 1 root root  12864 Sep 15 15:56 jar
-rwxr-xr-x 1 root root  12864 Sep 15 15:56 jarsigner
-rwxr-xr-x 1 root root  12848 Sep 15 15:56 java
-rwxr-xr-x 1 root root  12896 Sep 15 15:56 javac
-rwxr-xr-x 1 root root  12896 Sep 15 15:56 javadoc
-rwxr-xr-x 1 root root  12864 Sep 15 15:56 javap
-rwxr-xr-x 1 root root  12864 Sep 15 15:56 jcmd
-rwxr-xr-x 1 root root  12912 Sep 15 15:56 jconsole
-rwxr-xr-x 1 root root  12864 Sep 15 15:56 jdb
-rwxr-xr-x 1 root root  12864 Sep 15 15:56 jdeprscan
-rwxr-xr-x 1 root root  12864 Sep 15 15:56 jdeps
-rwxr-xr-x 1 root root  12864 Sep 15 15:56 jfr
-rwxr-xr-x 1 root root  12864 Sep 15 15:56 jhsdb
-rwxr-xr-x 1 root root  12864 Sep 15 15:56 jimage
-rwxr-xr-x 1 root root  12896 Sep 15 15:56 jinfo
-rwxr-xr-x 1 root root  12896 Sep 15 15:56 jjs
-rwxr-xr-x 1 root root  12896 Sep 15 15:56 jlink
-rwxr-xr-x 1 root root  12896 Sep 15 15:56 jmap
-rwxr-xr-x 1 root root  12864 Sep 15 15:56 jmod
-rwxr-xr-x 1 root root  12864 Sep 15 15:56 jps
-rwxr-xr-x 1 root root  12904 Sep 15 15:56 jrunscript
-rwxr-xr-x 1 root root  12864 Sep 15 15:56 jshell
-rwxr-xr-x 1 root root  12896 Sep 15 15:56 jstack
-rwxr-xr-x 1 root root  12864 Sep 15 15:56 jstat
-rwxr-xr-x 1 root root  12864 Sep 15 15:56 jstatd
-rwxr-xr-x 1 root root  12864 Sep 15 15:56 keytool
-rwxr-xr-x 1 root root  12864 Sep 15 15:56 pack200
-rwxr-xr-x 1 root root  12864 Sep 15 15:56 rmic
-rwxr-xr-x 1 root root  12864 Sep 15 15:56 rmid
-rwxr-xr-x 1 root root  12872 Sep 15 15:56 rmiregistry
-rwxr-xr-x 1 root root  12864 Sep 15 15:56 serialver
-rwxr-xr-x 1 root root 121568 Sep 15 15:56 unpack200
+ /home/jenkins/tools/java/latest11/bin/java -version
java version "11.0.9" 2020-10-20 LTS
Java(TM) SE Runtime Environment 18.9 (build 11.0.9+7-LTS)
Java HotSpot(TM) 64-Bit Server VM 18.9 (build 11.0.9+7-LTS, mixed mode)
+ echo which java
which java
+ which java
/home/jenkins/tools/java/latest11/bin/java
+ java -version
java version "11.0.9" 2020-10-20 LTS
Java(TM) SE Runtime Environment 18.9 (build 11.0.9+7-LTS)
Java HotSpot(TM) 64-Bit Server VM 18.9 (build 11.0.9+7-LTS, mixed mode)
+ echo which javac
which javac
+ which javac
/home/jenkins/tools/java/latest11/bin/javac
+ javac -version
javac 11.0.9
+ echo Ant-Home:
Ant-Home:
+ ls -al
total 476
drwxr-xr-x 16 jenkins jenkins   4096 Jan 11 00:39 .
drwxr-xr-x  5 jenkins jenkins   4096 Jan  9 14:00 ..
drwxr-xr-x 31 jenkins jenkins   4096 Dec  1 00:28 build
-rw-r--r--  1 jenkins jenkins  14850 Jan 11 00:39 build.gradle
-rw-r--r--  1 jenkins jenkins    172 Dec 29 19:39 build.javacheck.xml
-rw-r--r--  1 jenkins jenkins 156957 Jan 11 00:39 build.xml
-rw-r--r--  1 jenkins jenkins   3345 Dec 28 14:09 .classpath
-rw-r--r--  1 jenkins jenkins   6160 Dec  1 00:10 doap_POI.rdf
-rw-r--r--  1 jenkins jenkins   2934 Jan 11 00:39 file-leak-detector.exclude
-rw-r--r--  1 jenkins jenkins   6229 Dec  1 00:10 forrest.properties
-rw-r--r--  1 jenkins jenkins     53 Dec  1 00:10 .gitattributes
drwxr-xr-x  3 jenkins jenkins   4096 Dec 28 14:09 .github
-rw-r--r--  1 jenkins jenkins    482 Dec 13 15:39 .gitignore
drwxr-xr-x  3 jenkins jenkins   4096 Dec  1 00:10 gradle
drwxr-xr-x  5 jenkins jenkins   4096 Dec  1 00:10 .gradle
-rwxr-xr-x  1 jenkins jenkins   5917 Dec  1 00:10 gradlew
-rw-r--r--  1 jenkins jenkins   2842 Dec  1 00:10 gradlew.bat
drwxr-xr-x  2 jenkins jenkins   4096 Dec 28 14:09 jenkins
-rw-r--r--  1 jenkins jenkins 167284 Dec  1 00:10 KEYS
drwxr-xr-x  2 jenkins jenkins   4096 Dec  1 00:10 legal
drwxr-xr-x  9 jenkins jenkins   4096 Dec  1 00:11 lib
drwxr-xr-x  2 jenkins jenkins   4096 Dec 28 14:09 maven
drwxr-xr-x  3 jenkins jenkins   4096 Dec 28 14:09 osgi
-rw-r--r--  1 jenkins jenkins   4813 Dec  1 00:10 patch.xml
-rw-r--r--  1 jenkins jenkins    426 Dec  1 00:10 .project
-rw-r--r--  1 jenkins jenkins   4278 Dec 13 15:39 README.rst
drwxr-xr-x  2 jenkins jenkins   4096 Dec  1 00:10 .settings
-rw-r--r--  1 jenkins jenkins    556 Dec  1 00:10 settings.gradle
drwxr-xr-x  9 jenkins jenkins   4096 Dec 28 14:09 sonar
drwxr-xr-x 16 jenkins jenkins   4096 Dec  1 00:10 src
drwxr-xr-x  4 jenkins jenkins   4096 Jan 11 00:40 .svn
drwxr-xr-x 15 jenkins jenkins   4096 Jan 11 00:39 test-data
-rw-r--r--  1 jenkins jenkins    419 Dec  9 00:24 .travis.yml
+ echo which ant
which ant
+ which ant
/usr/bin/ant
+ ant -version
Apache Ant(TM) version 1.10.5 compiled on March 28 2019
+ echo <project default="test"><target name="test"><echo>Java ${ant.java.version}/${java.version}</echo><exec executable="javac"><arg value="-version"/></exec></target></project>
+ ant -f build.javacheck.xml -v
Apache Ant(TM) version 1.10.5 compiled on March 28 2019
Buildfile: <https://ci-builds.apache.org/job/POI/job/POI-DSL-SonarQube-Gradle/ws/build.javacheck.xml>
Detected Java version: 11 in: /usr/local/asfpackages/java/oraclejdk-11.0.9
Detected OS: Linux
parsing buildfile <https://ci-builds.apache.org/job/POI/job/POI-DSL-SonarQube-Gradle/ws/build.javacheck.xml> with URI = <https://ci-builds.apache.org/job/POI/job/POI-DSL-SonarQube-Gradle/ws/build.javacheck.xml>
Project base dir set to: <https://ci-builds.apache.org/job/POI/job/POI-DSL-SonarQube-Gradle/ws/>
Build sequence for target(s) `test' is [test]
Complete build sequence is [test, ]

test:
parsing buildfile jar:file:/usr/share/ant/lib/ant.jar!/org/apache/tools/ant/antlib.xml with URI = jar:file:/usr/share/ant/lib/ant.jar!/org/apache/tools/ant/antlib.xml from a zip file
     [echo] Java 11/11.0.9
     [exec] Current OS is Linux
     [exec] Executing 'javac' with arguments:
     [exec] '-version'
     [exec]
     [exec] The ' characters around the executable and arguments are
     [exec] not part of the command.
     [exec] javac 11.0.9

BUILD SUCCESSFUL
Total time: 1 second
+ exit 0
[Gradle] - Launching build.
[POI-DSL-SonarQube-Gradle] $ gradle -PenableSonar -Dsonar.login=**** -Dsonar.organization=apache -Dsonar.projectKey=poi-parent -Dsonar.host.url=https://sonarcloud.io check jacocoTestReport sonarqube
WARNING: An illegal reflective access operation has occurred
WARNING: Illegal reflective access by org.codehaus.groovy.reflection.CachedClass (file:/usr/lib/gradle/4.10.3/lib/groovy-all-2.4.15.jar) to method java.lang.Object.finalize()
WARNING: Please consider reporting this to the maintainers of org.codehaus.groovy.reflection.CachedClass
WARNING: Use --illegal-access=warn to enable warnings of further illegal reflective access operations
WARNING: All illegal access operations will be denied in a future release

> Configure project :
Enabling Sonar support

FAILURE: Build failed with an exception.

* Where:
Build file '<https://ci-builds.apache.org/job/POI/job/POI-DSL-SonarQube-Gradle/ws/build.gradle'> line: 45

* What went wrong:
A problem occurred evaluating root project 'poi'.
> Could not get unknown property 'Bundling' for {} of type org.gradle.api.internal.attributes.DefaultMutableAttributeContainer.

* Try:
Run with --stacktrace option to get the stack trace. Run with --info or --debug option to get more log output. Run with --scan to get full insights.

* Get more help at https://help.gradle.org

BUILD FAILED in 9s
Build step 'Invoke Gradle script' changed build result to FAILURE
Build step 'Invoke Gradle script' marked build as failure

---------------------------------------------------------------------
To unsubscribe, e-mail: [hidden email]
For additional commands, e-mail: [hidden email]

Reply | Threaded
Open this post in threaded view
|

Build failed in Jenkins: POI » POI-DSL-SonarQube-Gradle #141

Apache Jenkins Server
See <https://ci-builds.apache.org/job/POI/job/POI-DSL-SonarQube-Gradle/141/display/redirect?page=changes>

Changes:

[Andreas Beeker] Update maven dependencies

[Andreas Beeker] Update maven dependencies


------------------------------------------
[...truncated 375.24 KB...]
AU        src/documentation/resources/images/logoRandyStanard02.png
AU        src/documentation/resources/images/POIFSWriteArchive.gif
AU        src/documentation/resources/images/logoRandyStanard03.png
AU        src/documentation/resources/images/logoRandyStanard04.png
AU        src/documentation/resources/images/logoRandyStanard05.png
AU        src/documentation/resources/images/POIFSWriteFilesystem.gif
AU        src/documentation/resources/images/logoRandyStanard06.png
AU        src/documentation/resources/images/logoRandyStanard07.png
AU        src/documentation/resources/images/built-with-forrest-button.png
AU        src/documentation/resources/images/logoRandyStanard08.png
AU        src/documentation/resources/images/timesheet.jpg
AU        src/documentation/resources/images/poi-logo.png
AU        src/documentation/resources/images/unknown.jpg
AU        src/documentation/resources/images/logoKarmokar1s.png
AU        src/documentation/resources/images/POIFSRootPropertyPreWrite.gif
AU        src/documentation/resources/images/logoWendyWise.png
AU        src/documentation/resources/images/POIFSPropertyTablePreWrite.gif
AU        src/documentation/resources/images/logoKarmokar5s.png
AU        src/documentation/resources/images/ss-features.png
AU        src/documentation/resources/images/businessplan.jpg
AU        src/documentation/resources/images/logoJanssen1.png
AU        src/documentation/resources/images/logoJanssen2.png
AU        src/documentation/resources/images/calendar.jpg
AU        src/documentation/resources/images/loancalc.jpg
AU        src/documentation/resources/images/usermodel.gif
AU        src/documentation/resources/images/logoLoicLefevre.png
AU        src/documentation/resources/images/simple-xls-with-function.jpg
AU        src/documentation/resources/images/logoRaPiGmbH1.png
AU        src/documentation/resources/images/PropertySet.jpg
AU        src/documentation/resources/images/logoRaPiGmbH2.png
AU        src/documentation/resources/images/vba-example.jpg
AU        src/documentation/resources/images/logoKarmokar2s.png
AU        src/documentation/resources/images/logoRaPiGmbH5.png
AU        src/documentation/resources/images/logoRaPiGmbH6.png
AU        src/documentation/resources/images/logoKarmokar6s.png
AU        src/documentation/resources/images/logoRaPiGmbH7.png
AU        src/documentation/resources/images/logoRaPiGmbH8.png
AU        src/documentation/resources/images/logoRaPiGmbH9.png
AU        src/documentation/resources/images/logoDanielFernandez.png
AU        src/documentation/resources/images/logoAndrewClements2.png
AU        src/documentation/resources/images/hslf_shapes.gif
AU        src/documentation/resources/images/logoWendyWise2.png
AU        src/documentation/resources/images/POIFSLifeCycle.gif
AU        src/documentation/resources/images/logoAdria1.png
AU        src/documentation/resources/images/logoAdria2.png
AU        src/documentation/resources/images/logoAdria3.png
AU        src/documentation/resources/images/remove.jpg
AU        src/documentation/resources/images/logoKarmokar3s.png
AU        src/documentation/resources/images/logoGlenStampoutlzis.png
AU        src/documentation/resources/images/logoKarmokar1.png
AU        src/documentation/resources/images/POIFSInitialization.gif
AU        src/documentation/resources/images/logoKarmokar2.png
AU        src/documentation/resources/images/logoRaPiGmbH10.png
AU        src/documentation/resources/images/logoKarmokar3.png
AU        src/documentation/resources/images/logoRaPiGmbH11.png
AU        src/documentation/resources/images/logoMichaelMosmann.png
AU        src/documentation/resources/images/logoKarmokar4.png
AU        src/documentation/resources/images/logoRaPiGmbH12.png
AU        src/documentation/resources/images/logoKarmokar5.png
AU        src/documentation/resources/images/logoKarmokar6.png
AU        src/documentation/resources/images/ApacheConEu08.jpg
AU        src/documentation/resources/images/BlockClassDiagram.gif
AU        src/documentation/resources/images/calculatePayment.jpg
AU        src/documentation/resources/images/PropertyTableClassDiagram.gif
AU        src/documentation/resources/images/logoRussellBeattie1.png
AU        src/documentation/resources/images/logoRussellBeattie2.png
AU        src/documentation/resources/images/logoRussellBeattie3.png
A         src/documentation/sitemap.xmap
AU        src/documentation/skinconf.xml
A         src/documentation/cli.xconf
AU        src/documentation/RELEASE-NOTES.txt
AU        src/documentation/README.txt
A         src/documentation/classes
A         src/documentation/classes/CatalogManager.properties
At revision 1885371

At revision 1885371

No changes for https://svn.apache.org/repos/asf/poi/site/forrest.properties since the previous build
No changes for https://svn.apache.org/repos/asf/poi/site/src/documentation since the previous build
Injecting SonarQube environment variables using the configuration: sonarcloud.io
[POI-DSL-SonarQube-Gradle] $ /bin/sh -xe /tmp/jenkins1012412482345797969.sh
+ svn status
    X   forrest.properties
X       src/documentation

Performing status on external item at 'src/documentation':
+ echo Java-Home: /home/jenkins/tools/java/latest11
Java-Home: /home/jenkins/tools/java/latest11
+ ls -al /home/jenkins/tools/java/latest11/
total 40
drwxr-xr-x  8 root root 4096 Dec  7 23:11 .
drwxr-xr-x 39 root root 4096 Jan  2 19:14 ..
drwxr-xr-x  2 root root 4096 Dec  7 23:11 bin
drwxr-xr-x  4 root root 4096 Dec  7 23:11 conf
drwxr-xr-x  3 root root 4096 Dec  7 23:11 include
drwxr-xr-x  2 root root 4096 Dec  7 23:11 jmods
drwxr-xr-x 73 root root 4096 Dec  7 23:11 legal
drwxr-xr-x  6 root root 4096 Dec  7 23:11 lib
-r--r--r--  1 root root  160 Sep 15 15:56 README.html
-rw-r--r--  1 root root 1278 Sep 15 15:56 release
+ ls -al /home/jenkins/tools/java/latest11/bin
total 640
drwxr-xr-x 2 root root   4096 Dec  7 23:11 .
drwxr-xr-x 8 root root   4096 Dec  7 23:11 ..
-rwxr-xr-x 1 root root  12984 Sep 15 15:56 jaotc
-rwxr-xr-x 1 root root  12864 Sep 15 15:56 jar
-rwxr-xr-x 1 root root  12864 Sep 15 15:56 jarsigner
-rwxr-xr-x 1 root root  12848 Sep 15 15:56 java
-rwxr-xr-x 1 root root  12896 Sep 15 15:56 javac
-rwxr-xr-x 1 root root  12896 Sep 15 15:56 javadoc
-rwxr-xr-x 1 root root  12864 Sep 15 15:56 javap
-rwxr-xr-x 1 root root  12864 Sep 15 15:56 jcmd
-rwxr-xr-x 1 root root  12912 Sep 15 15:56 jconsole
-rwxr-xr-x 1 root root  12864 Sep 15 15:56 jdb
-rwxr-xr-x 1 root root  12864 Sep 15 15:56 jdeprscan
-rwxr-xr-x 1 root root  12864 Sep 15 15:56 jdeps
-rwxr-xr-x 1 root root  12864 Sep 15 15:56 jfr
-rwxr-xr-x 1 root root  12864 Sep 15 15:56 jhsdb
-rwxr-xr-x 1 root root  12864 Sep 15 15:56 jimage
-rwxr-xr-x 1 root root  12896 Sep 15 15:56 jinfo
-rwxr-xr-x 1 root root  12896 Sep 15 15:56 jjs
-rwxr-xr-x 1 root root  12896 Sep 15 15:56 jlink
-rwxr-xr-x 1 root root  12896 Sep 15 15:56 jmap
-rwxr-xr-x 1 root root  12864 Sep 15 15:56 jmod
-rwxr-xr-x 1 root root  12864 Sep 15 15:56 jps
-rwxr-xr-x 1 root root  12904 Sep 15 15:56 jrunscript
-rwxr-xr-x 1 root root  12864 Sep 15 15:56 jshell
-rwxr-xr-x 1 root root  12896 Sep 15 15:56 jstack
-rwxr-xr-x 1 root root  12864 Sep 15 15:56 jstat
-rwxr-xr-x 1 root root  12864 Sep 15 15:56 jstatd
-rwxr-xr-x 1 root root  12864 Sep 15 15:56 keytool
-rwxr-xr-x 1 root root  12864 Sep 15 15:56 pack200
-rwxr-xr-x 1 root root  12864 Sep 15 15:56 rmic
-rwxr-xr-x 1 root root  12864 Sep 15 15:56 rmid
-rwxr-xr-x 1 root root  12872 Sep 15 15:56 rmiregistry
-rwxr-xr-x 1 root root  12864 Sep 15 15:56 serialver
-rwxr-xr-x 1 root root 121568 Sep 15 15:56 unpack200
+ /home/jenkins/tools/java/latest11/bin/java -version
java version "11.0.9" 2020-10-20 LTS
Java(TM) SE Runtime Environment 18.9 (build 11.0.9+7-LTS)
Java HotSpot(TM) 64-Bit Server VM 18.9 (build 11.0.9+7-LTS, mixed mode)
+ echo which java
which java
+ which java
/home/jenkins/tools/java/latest11/bin/java
+ java -version
java version "11.0.9" 2020-10-20 LTS
Java(TM) SE Runtime Environment 18.9 (build 11.0.9+7-LTS)
Java HotSpot(TM) 64-Bit Server VM 18.9 (build 11.0.9+7-LTS, mixed mode)
+ echo which javac
which javac
+ which javac
/home/jenkins/tools/java/latest11/bin/javac
+ javac -version
javac 11.0.9
+ echo Ant-Home:
Ant-Home:
+ ls -al
total 460
drwxr-xr-x 13 jenkins jenkins   4096 Jan 11 23:55 .
drwxr-xr-x  8 jenkins jenkins   4096 Jan 11 23:54 ..
-rw-r--r--  1 jenkins jenkins  14850 Jan 11 23:55 build.gradle
-rw-r--r--  1 jenkins jenkins 156957 Jan 11 23:55 build.xml
-rw-r--r--  1 jenkins jenkins   3345 Jan 11 23:55 .classpath
-rw-r--r--  1 jenkins jenkins   6160 Jan 11 23:55 doap_POI.rdf
-rw-r--r--  1 jenkins jenkins   2934 Jan 11 23:55 file-leak-detector.exclude
-rw-r--r--  1 jenkins jenkins   6229 Jan 11 23:55 forrest.properties
-rw-r--r--  1 jenkins jenkins     53 Jan 11 23:55 .gitattributes
drwxr-xr-x  3 jenkins jenkins   4096 Jan 11 23:55 .github
-rw-r--r--  1 jenkins jenkins    482 Jan 11 23:55 .gitignore
drwxr-xr-x  3 jenkins jenkins   4096 Jan 11 23:55 gradle
-rwxr-xr-x  1 jenkins jenkins   5917 Jan 11 23:55 gradlew
-rw-r--r--  1 jenkins jenkins   2842 Jan 11 23:55 gradlew.bat
drwxr-xr-x  2 jenkins jenkins   4096 Jan 11 23:55 jenkins
-rw-r--r--  1 jenkins jenkins 167284 Jan 11 23:55 KEYS
drwxr-xr-x  2 jenkins jenkins   4096 Jan 11 23:55 legal
drwxr-xr-x  2 jenkins jenkins   4096 Jan 11 23:54 maven
drwxr-xr-x  3 jenkins jenkins   4096 Jan 11 23:55 osgi
-rw-r--r--  1 jenkins jenkins   4813 Jan 11 23:55 patch.xml
-rw-r--r--  1 jenkins jenkins    426 Jan 11 23:55 .project
-rw-r--r--  1 jenkins jenkins   4278 Jan 11 23:55 README.rst
drwxr-xr-x  2 jenkins jenkins   4096 Jan 11 23:55 .settings
-rw-r--r--  1 jenkins jenkins    556 Jan 11 23:55 settings.gradle
drwxr-xr-x  9 jenkins jenkins   4096 Jan 11 23:54 sonar
drwxr-xr-x 16 jenkins jenkins   4096 Jan 11 23:55 src
drwxr-xr-x  4 jenkins jenkins   4096 Jan 11 23:56 .svn
drwxr-xr-x 15 jenkins jenkins   4096 Jan 11 23:55 test-data
-rw-r--r--  1 jenkins jenkins    419 Jan 11 23:55 .travis.yml
+ echo which ant
which ant
+ which ant
/usr/bin/ant
+ ant -version
Apache Ant(TM) version 1.10.5 compiled on March 28 2019
+ echo <project default="test"><target name="test"><echo>Java ${ant.java.version}/${java.version}</echo><exec executable="javac"><arg value="-version"/></exec></target></project>
+ ant -f build.javacheck.xml -v
Apache Ant(TM) version 1.10.5 compiled on March 28 2019
Buildfile: <https://ci-builds.apache.org/job/POI/job/POI-DSL-SonarQube-Gradle/ws/build.javacheck.xml>
Detected Java version: 11 in: /usr/local/asfpackages/java/oraclejdk-11.0.9
Detected OS: Linux
parsing buildfile <https://ci-builds.apache.org/job/POI/job/POI-DSL-SonarQube-Gradle/ws/build.javacheck.xml> with URI = <https://ci-builds.apache.org/job/POI/job/POI-DSL-SonarQube-Gradle/ws/build.javacheck.xml>
Project base dir set to: <https://ci-builds.apache.org/job/POI/job/POI-DSL-SonarQube-Gradle/ws/>
Build sequence for target(s) `test' is [test]
Complete build sequence is [test, ]

test:
parsing buildfile jar:file:/usr/share/ant/lib/ant.jar!/org/apache/tools/ant/antlib.xml with URI = jar:file:/usr/share/ant/lib/ant.jar!/org/apache/tools/ant/antlib.xml from a zip file
     [echo] Java 11/11.0.9
     [exec] Current OS is Linux
     [exec] Executing 'javac' with arguments:
     [exec] '-version'
     [exec]
     [exec] The ' characters around the executable and arguments are
     [exec] not part of the command.
     [exec] javac 11.0.9

BUILD SUCCESSFUL
Total time: 0 seconds
+ exit 0
[Gradle] - Launching build.
[POI-DSL-SonarQube-Gradle] $ gradle -PenableSonar -Dsonar.login=**** -Dsonar.organization=apache -Dsonar.projectKey=poi-parent -Dsonar.host.url=https://sonarcloud.io check jacocoTestReport sonarqube
WARNING: An illegal reflective access operation has occurred
WARNING: Illegal reflective access by org.codehaus.groovy.reflection.CachedClass (file:/usr/lib/gradle/4.10.3/lib/groovy-all-2.4.15.jar) to method java.lang.Object.finalize()
WARNING: Please consider reporting this to the maintainers of org.codehaus.groovy.reflection.CachedClass
WARNING: Use --illegal-access=warn to enable warnings of further illegal reflective access operations
WARNING: All illegal access operations will be denied in a future release

> Configure project :
Enabling Sonar support

FAILURE: Build failed with an exception.

* Where:
Build file '<https://ci-builds.apache.org/job/POI/job/POI-DSL-SonarQube-Gradle/ws/build.gradle'> line: 45

* What went wrong:
A problem occurred evaluating root project 'poi'.
> Could not get unknown property 'Bundling' for {} of type org.gradle.api.internal.attributes.DefaultMutableAttributeContainer.

* Try:
Run with --stacktrace option to get the stack trace. Run with --info or --debug option to get more log output. Run with --scan to get full insights.

* Get more help at https://help.gradle.org

BUILD FAILED in 17s
Build step 'Invoke Gradle script' changed build result to FAILURE
Build step 'Invoke Gradle script' marked build as failure
WARN: Unable to locate 'report-task.txt' in the workspace. Did the SonarScanner succeed?

---------------------------------------------------------------------
To unsubscribe, e-mail: [hidden email]
For additional commands, e-mail: [hidden email]

Reply | Threaded
Open this post in threaded view
|

Jenkins build is back to normal : POI » POI-DSL-SonarQube-Gradle #142

Apache Jenkins Server
See <https://ci-builds.apache.org/job/POI/job/POI-DSL-SonarQube-Gradle/142/display/redirect?page=changes>


---------------------------------------------------------------------
To unsubscribe, e-mail: [hidden email]
For additional commands, e-mail: [hidden email]