Build failed in Jenkins: POI » POI-DSL-SonarQube-Gradle #102

classic Classic list List threaded Threaded
2 messages Options
Reply | Threaded
Open this post in threaded view
|

Build failed in Jenkins: POI » POI-DSL-SonarQube-Gradle #102

Apache Jenkins Server
See <https://ci-builds.apache.org/job/POI/job/POI-DSL-SonarQube-Gradle/102/display/redirect?page=changes>

Changes:

[Dominik Stadler] Add missing jar-file for JavaDoc generation

[Dominik Stadler] Adjust some JavaDoc

[Dominik Stadler] Improve the speed of the styles-optimiser when there are many styles in a Workbook

Profiling showed that the call to isUserDefined() took most of the time,
so we now fetch this only once for each style and remember the result and
use it in the inner loop.

The attached sample-file took aprox. 1m30s on a decent machine, now it is down
to around 2s.


------------------------------------------
Started by an SCM change
Running as SYSTEM
[EnvInject] - Loading node environment variables.
[EnvInject] - Preparing an environment for the build.
[EnvInject] - Keeping Jenkins system variables.
[EnvInject] - Keeping Jenkins build variables.
[EnvInject] - Injecting as environment variables the properties content
LANG=en_US.UTF-8
FORREST_HOME=/home/jenkins/tools/forrest/latest

[EnvInject] - Variables injected successfully.
[EnvInject] - Injecting contributions.
Building remotely on H33 (ubuntu) in workspace <https://ci-builds.apache.org/job/POI/job/POI-DSL-SonarQube-Gradle/ws/>
[WS-CLEANUP] Deleting project workspace...
[WS-CLEANUP] Done
Updating https://svn.apache.org/repos/asf/poi/trunk at revision '2020-12-29T19:39:10.965 +0000'
U         build.xml
U         src/java/org/apache/poi/common/Duplicatable.java
U         src/java/org/apache/poi/ddf/EscherProperty.java
U         src/java/org/apache/poi/ddf/EscherRGBProperty.java
U         src/java/org/apache/poi/ddf/EscherSimpleProperty.java
U         src/java/org/apache/poi/extractor/ExtractorFactory.java
U         src/java/org/apache/poi/hssf/usermodel/HSSFWorkbook.java
U         src/java/org/apache/poi/hssf/usermodel/HSSFOptimiser.java
A         test-data/spreadsheet/styles-3563.xls

<-- Got one external: forrest.properties, svn url: https://svn.apache.org/repos/asf/poi/site/forrest.properties -->
Fetching 'https://svn.apache.org/repos/asf/poi/site/forrest.properties' at -1 into '<https://ci-builds.apache.org/job/POI/job/POI-DSL-SonarQube-Gradle/ws/forrest.properties'>
At revision 1884919


<-- Got one external: documentation, svn url: https://svn.apache.org/repos/asf/poi/site/src/documentation -->
Fetching 'https://svn.apache.org/repos/asf/poi/site/src/documentation' at -1 into '<https://ci-builds.apache.org/job/POI/job/POI-DSL-SonarQube-Gradle/ws/src/documentation'>
At revision 1884919

At revision 1884919

No changes for https://svn.apache.org/repos/asf/poi/site/forrest.properties since the previous build
No changes for https://svn.apache.org/repos/asf/poi/site/src/documentation since the previous build
Injecting SonarQube environment variables using the configuration: sonarcloud.io
[POI-DSL-SonarQube-Gradle] $ /bin/sh -xe /tmp/jenkins5657381476211526855.sh
+ svn status
?       build.javacheck.xml
    X   forrest.properties
X       src/documentation

Performing status on external item at 'src/documentation':
+ echo Java-Home: /home/jenkins/tools/java/latest11
Java-Home: /home/jenkins/tools/java/latest11
+ ls -al /home/jenkins/tools/java/latest11/
total 40
drwxr-xr-x  8 root root 4096 Dec  7 22:54 .
drwxr-xr-x 37 root root 4096 Dec 13 16:26 ..
drwxr-xr-x  2 root root 4096 Dec  7 22:54 bin
drwxr-xr-x  4 root root 4096 Dec  7 22:54 conf
drwxr-xr-x  3 root root 4096 Dec  7 22:54 include
drwxr-xr-x  2 root root 4096 Dec  7 22:54 jmods
drwxr-xr-x 73 root root 4096 Dec  7 22:54 legal
drwxr-xr-x  6 root root 4096 Dec  7 22:54 lib
-r--r--r--  1 root root  160 Sep 15 15:56 README.html
-rw-r--r--  1 root root 1278 Sep 15 15:56 release
+ ls -al /home/jenkins/tools/java/latest11/bin
total 640
drwxr-xr-x 2 root root   4096 Dec  7 22:54 .
drwxr-xr-x 8 root root   4096 Dec  7 22:54 ..
-rwxr-xr-x 1 root root  12984 Sep 15 15:56 jaotc
-rwxr-xr-x 1 root root  12864 Sep 15 15:56 jar
-rwxr-xr-x 1 root root  12864 Sep 15 15:56 jarsigner
-rwxr-xr-x 1 root root  12848 Sep 15 15:56 java
-rwxr-xr-x 1 root root  12896 Sep 15 15:56 javac
-rwxr-xr-x 1 root root  12896 Sep 15 15:56 javadoc
-rwxr-xr-x 1 root root  12864 Sep 15 15:56 javap
-rwxr-xr-x 1 root root  12864 Sep 15 15:56 jcmd
-rwxr-xr-x 1 root root  12912 Sep 15 15:56 jconsole
-rwxr-xr-x 1 root root  12864 Sep 15 15:56 jdb
-rwxr-xr-x 1 root root  12864 Sep 15 15:56 jdeprscan
-rwxr-xr-x 1 root root  12864 Sep 15 15:56 jdeps
-rwxr-xr-x 1 root root  12864 Sep 15 15:56 jfr
-rwxr-xr-x 1 root root  12864 Sep 15 15:56 jhsdb
-rwxr-xr-x 1 root root  12864 Sep 15 15:56 jimage
-rwxr-xr-x 1 root root  12896 Sep 15 15:56 jinfo
-rwxr-xr-x 1 root root  12896 Sep 15 15:56 jjs
-rwxr-xr-x 1 root root  12896 Sep 15 15:56 jlink
-rwxr-xr-x 1 root root  12896 Sep 15 15:56 jmap
-rwxr-xr-x 1 root root  12864 Sep 15 15:56 jmod
-rwxr-xr-x 1 root root  12864 Sep 15 15:56 jps
-rwxr-xr-x 1 root root  12904 Sep 15 15:56 jrunscript
-rwxr-xr-x 1 root root  12864 Sep 15 15:56 jshell
-rwxr-xr-x 1 root root  12896 Sep 15 15:56 jstack
-rwxr-xr-x 1 root root  12864 Sep 15 15:56 jstat
-rwxr-xr-x 1 root root  12864 Sep 15 15:56 jstatd
-rwxr-xr-x 1 root root  12864 Sep 15 15:56 keytool
-rwxr-xr-x 1 root root  12864 Sep 15 15:56 pack200
-rwxr-xr-x 1 root root  12864 Sep 15 15:56 rmic
-rwxr-xr-x 1 root root  12864 Sep 15 15:56 rmid
-rwxr-xr-x 1 root root  12872 Sep 15 15:56 rmiregistry
-rwxr-xr-x 1 root root  12864 Sep 15 15:56 serialver
-rwxr-xr-x 1 root root 121568 Sep 15 15:56 unpack200
+ /home/jenkins/tools/java/latest11/bin/java -version
java version "11.0.9" 2020-10-20 LTS
Java(TM) SE Runtime Environment 18.9 (build 11.0.9+7-LTS)
Java HotSpot(TM) 64-Bit Server VM 18.9 (build 11.0.9+7-LTS, mixed mode)
+ echo which java
which java
+ which java
/home/jenkins/tools/java/latest11/bin/java
+ java -version
java version "11.0.9" 2020-10-20 LTS
Java(TM) SE Runtime Environment 18.9 (build 11.0.9+7-LTS)
Java HotSpot(TM) 64-Bit Server VM 18.9 (build 11.0.9+7-LTS, mixed mode)
+ echo which javac
which javac
+ which javac
/home/jenkins/tools/java/latest11/bin/javac
+ javac -version
javac 11.0.9
+ echo Ant-Home:
Ant-Home:
+ ls -al
total 476
drwxr-xr-x 16 jenkins jenkins   4096 Dec 28 14:09 .
drwxr-xr-x  6 jenkins jenkins   4096 Dec 17 00:07 ..
drwxr-xr-x 31 jenkins jenkins   4096 Dec  1 00:28 build
-rw-r--r--  1 jenkins jenkins  15039 Dec 28 14:09 build.gradle
-rw-r--r--  1 jenkins jenkins    172 Dec 28 14:10 build.javacheck.xml
-rw-r--r--  1 jenkins jenkins 156397 Dec 29 19:39 build.xml
-rw-r--r--  1 jenkins jenkins   3345 Dec 28 14:09 .classpath
-rw-r--r--  1 jenkins jenkins   6160 Dec  1 00:10 doap_POI.rdf
-rw-r--r--  1 jenkins jenkins   2847 Dec  1 00:10 file-leak-detector.exclude
-rw-r--r--  1 jenkins jenkins   6229 Dec  1 00:10 forrest.properties
-rw-r--r--  1 jenkins jenkins     53 Dec  1 00:10 .gitattributes
drwxr-xr-x  3 jenkins jenkins   4096 Dec 28 14:09 .github
-rw-r--r--  1 jenkins jenkins    482 Dec 13 15:39 .gitignore
drwxr-xr-x  3 jenkins jenkins   4096 Dec  1 00:10 gradle
drwxr-xr-x  5 jenkins jenkins   4096 Dec  1 00:10 .gradle
-rwxr-xr-x  1 jenkins jenkins   5917 Dec  1 00:10 gradlew
-rw-r--r--  1 jenkins jenkins   2842 Dec  1 00:10 gradlew.bat
drwxr-xr-x  2 jenkins jenkins   4096 Dec 28 14:09 jenkins
-rw-r--r--  1 jenkins jenkins 167284 Dec  1 00:10 KEYS
drwxr-xr-x  2 jenkins jenkins   4096 Dec  1 00:10 legal
drwxr-xr-x  9 jenkins jenkins   4096 Dec  1 00:11 lib
drwxr-xr-x  2 jenkins jenkins   4096 Dec 28 14:09 maven
drwxr-xr-x  3 jenkins jenkins   4096 Dec 28 14:09 osgi
-rw-r--r--  1 jenkins jenkins   4813 Dec  1 00:10 patch.xml
-rw-r--r--  1 jenkins jenkins    426 Dec  1 00:10 .project
-rw-r--r--  1 jenkins jenkins   4278 Dec 13 15:39 README.rst
drwxr-xr-x  2 jenkins jenkins   4096 Dec  1 00:10 .settings
-rw-r--r--  1 jenkins jenkins    556 Dec  1 00:10 settings.gradle
drwxr-xr-x  9 jenkins jenkins   4096 Dec 28 14:09 sonar
drwxr-xr-x 16 jenkins jenkins   4096 Dec  1 00:10 src
drwxr-xr-x  4 jenkins jenkins   4096 Dec 29 19:39 .svn
drwxr-xr-x 14 jenkins jenkins   4096 Dec  1 00:10 test-data
-rw-r--r--  1 jenkins jenkins    419 Dec  9 00:24 .travis.yml
+ echo which ant
which ant
+ which ant
/usr/bin/ant
+ ant -version
Apache Ant(TM) version 1.10.5 compiled on March 28 2019
+ echo <project default="test"><target name="test"><echo>Java ${ant.java.version}/${java.version}</echo><exec executable="javac"><arg value="-version"/></exec></target></project>
+ ant -f build.javacheck.xml -v
Apache Ant(TM) version 1.10.5 compiled on March 28 2019
Buildfile: <https://ci-builds.apache.org/job/POI/job/POI-DSL-SonarQube-Gradle/ws/build.javacheck.xml>
Detected Java version: 11 in: /usr/local/asfpackages/java/oraclejdk-11.0.9
Detected OS: Linux
parsing buildfile <https://ci-builds.apache.org/job/POI/job/POI-DSL-SonarQube-Gradle/ws/build.javacheck.xml> with URI = <https://ci-builds.apache.org/job/POI/job/POI-DSL-SonarQube-Gradle/ws/build.javacheck.xml>
Project base dir set to: <https://ci-builds.apache.org/job/POI/job/POI-DSL-SonarQube-Gradle/ws/>
Build sequence for target(s) `test' is [test]
Complete build sequence is [test, ]

test:
parsing buildfile jar:file:/usr/share/ant/lib/ant.jar!/org/apache/tools/ant/antlib.xml with URI = jar:file:/usr/share/ant/lib/ant.jar!/org/apache/tools/ant/antlib.xml from a zip file
     [echo] Java 11/11.0.9
     [exec] Current OS is Linux
     [exec] Executing 'javac' with arguments:
     [exec] '-version'
     [exec]
     [exec] The ' characters around the executable and arguments are
     [exec] not part of the command.
     [exec] javac 11.0.9

BUILD SUCCESSFUL
Total time: 1 second
+ exit 0
[Gradle] - Launching build.
[POI-DSL-SonarQube-Gradle] $ gradle -PenableSonar -Dsonar.login=**** -Dsonar.organization=apache -Dsonar.projectKey=poi-parent -Dsonar.host.url=https://sonarcloud.io check jacocoTestReport sonarqube
WARNING: An illegal reflective access operation has occurred
WARNING: Illegal reflective access by org.codehaus.groovy.reflection.CachedClass (file:/usr/lib/gradle/4.10.3/lib/groovy-all-2.4.15.jar) to method java.lang.Object.finalize()
WARNING: Please consider reporting this to the maintainers of org.codehaus.groovy.reflection.CachedClass
WARNING: Use --illegal-access=warn to enable warnings of further illegal reflective access operations
WARNING: All illegal access operations will be denied in a future release

> Configure project :
Enabling Sonar support

FAILURE: Build failed with an exception.

* Where:
Build file '<https://ci-builds.apache.org/job/POI/job/POI-DSL-SonarQube-Gradle/ws/build.gradle'> line: 45

* What went wrong:
A problem occurred evaluating root project 'poi'.
> Could not get unknown property 'Bundling' for {} of type org.gradle.api.internal.attributes.DefaultMutableAttributeContainer.

* Try:
Run with --stacktrace option to get the stack trace. Run with --info or --debug option to get more log output. Run with --scan to get full insights.

* Get more help at https://help.gradle.org

BUILD FAILED in 6s
Build step 'Invoke Gradle script' changed build result to FAILURE
Build step 'Invoke Gradle script' marked build as failure

---------------------------------------------------------------------
To unsubscribe, e-mail: [hidden email]
For additional commands, e-mail: [hidden email]

Reply | Threaded
Open this post in threaded view
|

Jenkins build is back to normal : POI » POI-DSL-SonarQube-Gradle #103

Apache Jenkins Server
See <https://ci-builds.apache.org/job/POI/job/POI-DSL-SonarQube-Gradle/103/display/redirect?page=changes>


---------------------------------------------------------------------
To unsubscribe, e-mail: [hidden email]
For additional commands, e-mail: [hidden email]