Build failed in Jenkins: POI » POI-DSL-SonarQube-Gradle #1

classic Classic list List threaded Threaded
7 messages Options
Reply | Threaded
Open this post in threaded view
|

Build failed in Jenkins: POI » POI-DSL-SonarQube-Gradle #1

Apache Jenkins Server
See <https://ci-builds.apache.org/job/POI/job/POI-DSL-SonarQube-Gradle/1/display/redirect>

Changes:


------------------------------------------
[...truncated 365.53 KB...]
A         file-leak-detector.exclude
AU        doap_POI.rdf
A         legal
AU        legal/NOTICE
AU        legal/LICENSE
AU        gradlew
A         gradlew.bat
A         .settings
A         .settings/com.vaadin.designer.prefs
A         .settings/org.eclipse.jdt.core.prefs
A         .settings/org.eclipse.jdt.ui.prefs
A         .settings/org.moreunit.prefs
A         .settings/org.eclipse.core.resources.prefs
A         .settings/org.moreunit.core.prefs
A         .travis.yml
A         .gitignore
A         .gitattributes
A         settings.gradle
AU        patch.xml
AU        .project
 U        .

<-- Got one external: forrest.properties, svn url: https://svn.apache.org/repos/asf/poi/site/forrest.properties -->
Fetching 'https://svn.apache.org/repos/asf/poi/site/forrest.properties' at -1 into '<https://ci-builds.apache.org/job/POI/job/POI-DSL-SonarQube-Gradle/ws/forrest.properties'>
A         forrest.properties
At revision 1882051


<-- Got one external: documentation, svn url: https://svn.apache.org/repos/asf/poi/site/src/documentation -->
Fetching 'https://svn.apache.org/repos/asf/poi/site/src/documentation' at -1 into '<https://ci-builds.apache.org/job/POI/job/POI-DSL-SonarQube-Gradle/ws/src/documentation'>
A         src/documentation/content
A         src/documentation/content/xdocs
AU        src/documentation/content/xdocs/changes.xml
A         src/documentation/content/xdocs/components
A         src/documentation/content/xdocs/components/slideshow
A         src/documentation/content/xdocs/components/slideshow/ppt-wmf-emf-renderer.xml
AU        src/documentation/content/xdocs/components/slideshow/xslf-cookbook.xml
AU        src/documentation/content/xdocs/components/slideshow/how-to-shapes.xml
AU        src/documentation/content/xdocs/components/slideshow/index.xml
AU        src/documentation/content/xdocs/components/slideshow/ppt-file-format.xml
AU        src/documentation/content/xdocs/components/slideshow/quick-guide.xml
A         src/documentation/content/xdocs/components/spreadsheet
AU        src/documentation/content/xdocs/components/spreadsheet/examples.xml
AU        src/documentation/content/xdocs/components/spreadsheet/how-to.xml
AU        src/documentation/content/xdocs/components/spreadsheet/quick-guide.xml
AU        src/documentation/content/xdocs/components/spreadsheet/limitations.xml
AU        src/documentation/content/xdocs/components/spreadsheet/excelant.xml
AU        src/documentation/content/xdocs/components/spreadsheet/user-defined-functions.xml
AU        src/documentation/content/xdocs/components/spreadsheet/formula.xml
AU        src/documentation/content/xdocs/components/spreadsheet/eval.xml
AU        src/documentation/content/xdocs/components/spreadsheet/chart.xml
AU        src/documentation/content/xdocs/components/spreadsheet/converting.xml
AU        src/documentation/content/xdocs/components/spreadsheet/diagram1.xml
AU        src/documentation/content/xdocs/components/spreadsheet/diagrams.xml
AU        src/documentation/content/xdocs/components/spreadsheet/eval-devguide.xml
AU        src/documentation/content/xdocs/components/spreadsheet/hacking-hssf.xml
AU        src/documentation/content/xdocs/components/spreadsheet/index.xml
AU        src/documentation/content/xdocs/components/spreadsheet/record-generator.xml
AU        src/documentation/content/xdocs/components/spreadsheet/use-case.xml
A         src/documentation/content/xdocs/components/document
AU        src/documentation/content/xdocs/components/document/index.xml
AU        src/documentation/content/xdocs/components/document/quick-guide-xwpf.xml
AU        src/documentation/content/xdocs/components/document/docoverview.xml
AU        src/documentation/content/xdocs/components/document/projectplan.xml
AU        src/documentation/content/xdocs/components/document/quick-guide.xml
A         src/documentation/content/xdocs/components/hsmf
AU        src/documentation/content/xdocs/components/hsmf/index.xml
AU        src/documentation/content/xdocs/components/index.xml
A         src/documentation/content/xdocs/components/poifs
AU        src/documentation/content/xdocs/components/poifs/how-to.xml
AU        src/documentation/content/xdocs/components/poifs/design.xml
AU        src/documentation/content/xdocs/components/poifs/embeded.xml
AU        src/documentation/content/xdocs/components/poifs/fileformat.xml
AU        src/documentation/content/xdocs/components/poifs/index.xml
AU        src/documentation/content/xdocs/components/poifs/usecases.xml
AU        src/documentation/content/xdocs/components/poi-ruby.xml
A         src/documentation/content/xdocs/components/hpsf
AU        src/documentation/content/xdocs/components/hpsf/how-to.xml
AU        src/documentation/content/xdocs/components/hpsf/internals.xml
AU        src/documentation/content/xdocs/components/hpsf/index.xml
AU        src/documentation/content/xdocs/components/hpsf/thumbnails.xml
AU        src/documentation/content/xdocs/components/hpsf/todo.xml
AU        src/documentation/content/xdocs/components/poi-jvm-languages.xml
A         src/documentation/content/xdocs/components/diagram
AU        src/documentation/content/xdocs/components/diagram/index.xml
A         src/documentation/content/xdocs/components/hmef
AU        src/documentation/content/xdocs/components/hmef/index.xml
A         src/documentation/content/xdocs/components/hpbf
AU        src/documentation/content/xdocs/components/hpbf/file-format.xml
AU        src/documentation/content/xdocs/components/hpbf/index.xml
AU        src/documentation/content/xdocs/components/logging.xml
A         src/documentation/content/xdocs/components/oxml4j
AU        src/documentation/content/xdocs/components/oxml4j/index.xml
A         src/documentation/content/xdocs/devel
AU        src/documentation/content/xdocs/devel/subversion.xml
A         src/documentation/content/xdocs/devel/history
AU        src/documentation/content/xdocs/devel/history/changes-3x.xml
A         src/documentation/content/xdocs/devel/history/changes-pre3x.xml
AU        src/documentation/content/xdocs/devel/history/index.xml
AU        src/documentation/content/xdocs/devel/index.xml
AU        src/documentation/content/xdocs/devel/guidelines.xml
A         src/documentation/content/xdocs/devel/plan
AU        src/documentation/content/xdocs/devel/plan/index.xml
AU        src/documentation/content/xdocs/devel/plan/vision10.xml
AU        src/documentation/content/xdocs/devel/plan/vision20.xml
A         src/documentation/content/xdocs/devel/references
A         src/documentation/content/xdocs/devel/references/3rdparty.xml
AU        src/documentation/content/xdocs/devel/references/index.xml
AU        src/documentation/content/xdocs/devel/references/logocontest.xml
A         src/documentation/content/xdocs/devel/resolutions
AU        src/documentation/content/xdocs/devel/resolutions/index.xml
AU        src/documentation/content/xdocs/devel/resolutions/res001.xml
AU        src/documentation/content/xdocs/devel/who.xml
AU        src/documentation/content/xdocs/download.xml
A         src/documentation/content/xdocs/help
AU        src/documentation/content/xdocs/help/faq.xml
AU        src/documentation/content/xdocs/help/index.xml
AU        src/documentation/content/xdocs/encryption.xml
AU        src/documentation/content/xdocs/related-projects.xml
A         src/documentation/content/xdocs/apidocs
A         src/documentation/content/xdocs/apidocs/index.xml
AU        src/documentation/content/xdocs/site.xml
AU        src/documentation/content/xdocs/index.xml
AU        src/documentation/content/xdocs/casestudies.xml
AU        src/documentation/content/xdocs/status.copy_module_from_bugzilla.py
A         src/documentation/content/xdocs/images
A         src/documentation/content/xdocs/images/poweredby-poi.svg
AU        src/documentation/content/xdocs/images/poweredby-poi-logo.png
AU        src/documentation/content/xdocs/images/project-header.png
A         src/documentation/content/xdocs/images/group.svg
AU        src/documentation/content/xdocs/images/add.png
AU        src/documentation/content/xdocs/images/favicon.ico
AU        src/documentation/content/xdocs/images/fix.png
AU        src/documentation/content/xdocs/images/group-logo.png
AU        src/documentation/content/xdocs/images/icon.png
AU        src/documentation/content/xdocs/images/remove.png
AU        src/documentation/content/xdocs/images/update.png
AU        src/documentation/content/xdocs/images/usemap.gif
AU        src/documentation/content/xdocs/legal.xml
AU        src/documentation/content/xdocs/news.xml
AU        src/documentation/content/xdocs/tabs.xml
AU        src/documentation/content/xdocs/text-extraction.xml
A         src/documentation/content/locationmap.xml
AU        src/documentation/release-guide.txt
A         src/documentation/resources
A         src/documentation/resources/schema
AU        src/documentation/resources/schema/changes-poi.mod
A         src/documentation/resources/schema/catalog.xcat
AU        src/documentation/resources/schema/changes-poi.dtd
A         src/documentation/resources/stylesheets
AU        src/documentation/resources/stylesheets/changes2document.xsl
AU        src/documentation/resources/stylesheets/snipplets2document.xsl
A         src/documentation/resources/images
A         src/documentation/resources/images/project-header.svg
AU        src/documentation/resources/images/support-asf.png
AU        src/documentation/resources/images/project-header.xcf
AU        src/documentation/resources/images/pb-poi.cdr
AU        src/documentation/resources/images/logoRussellBeattie4.png
AU        src/documentation/resources/images/logoAndrewClements.png
AU        src/documentation/resources/images/logoRussellBeattie5.png
AU        src/documentation/resources/images/logoGustafsson1.png
AU        src/documentation/resources/images/logoGustafsson2.png
AU        src/documentation/resources/images/logoKarmokar4s.png
AU        src/documentation/resources/images/old-project-logo.gif
AU        src/documentation/resources/images/logoLoicLefevre2.png
AU        src/documentation/resources/images/POIFSAddDocument.gif
AU        src/documentation/resources/images/utilClasses.gif
AU        src/documentation/resources/images/POIFSClassDiagram.gif
AU        src/documentation/resources/images/logoRandyStanard01.png
AU        src/documentation/resources/images/logoRandyStanard02.png
AU        src/documentation/resources/images/POIFSWriteArchive.gif
AU        src/documentation/resources/images/logoRandyStanard03.png
AU        src/documentation/resources/images/logoRandyStanard04.png
AU        src/documentation/resources/images/logoRandyStanard05.png
AU        src/documentation/resources/images/POIFSWriteFilesystem.gif
AU        src/documentation/resources/images/logoRandyStanard06.png
AU        src/documentation/resources/images/logoRandyStanard07.png
AU        src/documentation/resources/images/built-with-forrest-button.png
AU        src/documentation/resources/images/logoRandyStanard08.png
AU        src/documentation/resources/images/timesheet.jpg
AU        src/documentation/resources/images/poi-logo.png
AU        src/documentation/resources/images/unknown.jpg
AU        src/documentation/resources/images/logoKarmokar1s.png
AU        src/documentation/resources/images/POIFSRootPropertyPreWrite.gif
AU        src/documentation/resources/images/logoWendyWise.png
AU        src/documentation/resources/images/POIFSPropertyTablePreWrite.gif
AU        src/documentation/resources/images/logoKarmokar5s.png
AU        src/documentation/resources/images/ss-features.png
AU        src/documentation/resources/images/businessplan.jpg
AU        src/documentation/resources/images/logoJanssen1.png
AU        src/documentation/resources/images/logoJanssen2.png
AU        src/documentation/resources/images/calendar.jpg
AU        src/documentation/resources/images/loancalc.jpg
AU        src/documentation/resources/images/usermodel.gif
AU        src/documentation/resources/images/logoLoicLefevre.png
AU        src/documentation/resources/images/simple-xls-with-function.jpg
AU        src/documentation/resources/images/logoRaPiGmbH1.png
AU        src/documentation/resources/images/PropertySet.jpg
AU        src/documentation/resources/images/logoRaPiGmbH2.png
AU        src/documentation/resources/images/vba-example.jpg
AU        src/documentation/resources/images/logoKarmokar2s.png
AU        src/documentation/resources/images/logoRaPiGmbH5.png
AU        src/documentation/resources/images/logoRaPiGmbH6.png
AU        src/documentation/resources/images/logoKarmokar6s.png
AU        src/documentation/resources/images/logoRaPiGmbH7.png
AU        src/documentation/resources/images/logoRaPiGmbH8.png
AU        src/documentation/resources/images/logoRaPiGmbH9.png
AU        src/documentation/resources/images/logoDanielFernandez.png
AU        src/documentation/resources/images/logoAndrewClements2.png
AU        src/documentation/resources/images/hslf_shapes.gif
AU        src/documentation/resources/images/logoWendyWise2.png
AU        src/documentation/resources/images/POIFSLifeCycle.gif
AU        src/documentation/resources/images/logoAdria1.png
AU        src/documentation/resources/images/logoAdria2.png
AU        src/documentation/resources/images/logoAdria3.png
AU        src/documentation/resources/images/remove.jpg
AU        src/documentation/resources/images/logoKarmokar3s.png
AU        src/documentation/resources/images/logoGlenStampoutlzis.png
AU        src/documentation/resources/images/logoKarmokar1.png
AU        src/documentation/resources/images/POIFSInitialization.gif
AU        src/documentation/resources/images/logoKarmokar2.png
AU        src/documentation/resources/images/logoRaPiGmbH10.png
AU        src/documentation/resources/images/logoKarmokar3.png
AU        src/documentation/resources/images/logoRaPiGmbH11.png
AU        src/documentation/resources/images/logoMichaelMosmann.png
AU        src/documentation/resources/images/logoKarmokar4.png
AU        src/documentation/resources/images/logoRaPiGmbH12.png
AU        src/documentation/resources/images/logoKarmokar5.png
AU        src/documentation/resources/images/logoKarmokar6.png
AU        src/documentation/resources/images/ApacheConEu08.jpg
AU        src/documentation/resources/images/BlockClassDiagram.gif
AU        src/documentation/resources/images/calculatePayment.jpg
AU        src/documentation/resources/images/PropertyTableClassDiagram.gif
AU        src/documentation/resources/images/logoRussellBeattie1.png
AU        src/documentation/resources/images/logoRussellBeattie2.png
AU        src/documentation/resources/images/logoRussellBeattie3.png
A         src/documentation/sitemap.xmap
AU        src/documentation/skinconf.xml
A         src/documentation/cli.xconf
AU        src/documentation/RELEASE-NOTES.txt
AU        src/documentation/README.txt
A         src/documentation/classes
A         src/documentation/classes/CatalogManager.properties
At revision 1882051

At revision 1882051

ERROR: No SonarQube installation assigned for this job. There are 0 available installations that can be configured.
If you want to reassign jobs to a different SonarQube installation, check the documentation under https://redirect.sonarsource.com/plugins/jenkins.html

---------------------------------------------------------------------
To unsubscribe, e-mail: [hidden email]
For additional commands, e-mail: [hidden email]

Reply | Threaded
Open this post in threaded view
|

Build failed in Jenkins: POI » POI-DSL-SonarQube-Gradle #2

Apache Jenkins Server
See <https://ci-builds.apache.org/job/POI/job/POI-DSL-SonarQube-Gradle/2/display/redirect>

Changes:


------------------------------------------
[...truncated 365.63 KB...]
AU        legal/LICENSE
AU        gradlew
A         gradlew.bat
A         .settings
A         .settings/com.vaadin.designer.prefs
A         .settings/org.eclipse.jdt.core.prefs
A         .settings/org.eclipse.jdt.ui.prefs
A         .settings/org.moreunit.prefs
A         .settings/org.eclipse.core.resources.prefs
A         .settings/org.moreunit.core.prefs
A         .travis.yml
A         .gitignore
A         .gitattributes
A         settings.gradle
AU        patch.xml
AU        .project
 U        .

<-- Got one external: forrest.properties, svn url: https://svn.apache.org/repos/asf/poi/site/forrest.properties -->
Fetching 'https://svn.apache.org/repos/asf/poi/site/forrest.properties' at -1 into '<https://ci-builds.apache.org/job/POI/job/POI-DSL-SonarQube-Gradle/ws/forrest.properties'>
A         forrest.properties
At revision 1882085


<-- Got one external: documentation, svn url: https://svn.apache.org/repos/asf/poi/site/src/documentation -->
Fetching 'https://svn.apache.org/repos/asf/poi/site/src/documentation' at -1 into '<https://ci-builds.apache.org/job/POI/job/POI-DSL-SonarQube-Gradle/ws/src/documentation'>
A         src/documentation/content
A         src/documentation/content/xdocs
AU        src/documentation/content/xdocs/changes.xml
A         src/documentation/content/xdocs/components
A         src/documentation/content/xdocs/components/slideshow
A         src/documentation/content/xdocs/components/slideshow/ppt-wmf-emf-renderer.xml
AU        src/documentation/content/xdocs/components/slideshow/xslf-cookbook.xml
AU        src/documentation/content/xdocs/components/slideshow/how-to-shapes.xml
AU        src/documentation/content/xdocs/components/slideshow/index.xml
AU        src/documentation/content/xdocs/components/slideshow/ppt-file-format.xml
AU        src/documentation/content/xdocs/components/slideshow/quick-guide.xml
A         src/documentation/content/xdocs/components/spreadsheet
AU        src/documentation/content/xdocs/components/spreadsheet/examples.xml
AU        src/documentation/content/xdocs/components/spreadsheet/how-to.xml
AU        src/documentation/content/xdocs/components/spreadsheet/quick-guide.xml
AU        src/documentation/content/xdocs/components/spreadsheet/limitations.xml
AU        src/documentation/content/xdocs/components/spreadsheet/excelant.xml
AU        src/documentation/content/xdocs/components/spreadsheet/user-defined-functions.xml
AU        src/documentation/content/xdocs/components/spreadsheet/formula.xml
AU        src/documentation/content/xdocs/components/spreadsheet/eval.xml
AU        src/documentation/content/xdocs/components/spreadsheet/chart.xml
AU        src/documentation/content/xdocs/components/spreadsheet/converting.xml
AU        src/documentation/content/xdocs/components/spreadsheet/diagram1.xml
AU        src/documentation/content/xdocs/components/spreadsheet/diagrams.xml
AU        src/documentation/content/xdocs/components/spreadsheet/eval-devguide.xml
AU        src/documentation/content/xdocs/components/spreadsheet/hacking-hssf.xml
AU        src/documentation/content/xdocs/components/spreadsheet/index.xml
AU        src/documentation/content/xdocs/components/spreadsheet/record-generator.xml
AU        src/documentation/content/xdocs/components/spreadsheet/use-case.xml
A         src/documentation/content/xdocs/components/document
AU        src/documentation/content/xdocs/components/document/index.xml
AU        src/documentation/content/xdocs/components/document/quick-guide-xwpf.xml
AU        src/documentation/content/xdocs/components/document/docoverview.xml
AU        src/documentation/content/xdocs/components/document/projectplan.xml
AU        src/documentation/content/xdocs/components/document/quick-guide.xml
A         src/documentation/content/xdocs/components/hsmf
AU        src/documentation/content/xdocs/components/hsmf/index.xml
AU        src/documentation/content/xdocs/components/index.xml
A         src/documentation/content/xdocs/components/poifs
AU        src/documentation/content/xdocs/components/poifs/how-to.xml
AU        src/documentation/content/xdocs/components/poifs/design.xml
AU        src/documentation/content/xdocs/components/poifs/embeded.xml
AU        src/documentation/content/xdocs/components/poifs/fileformat.xml
AU        src/documentation/content/xdocs/components/poifs/index.xml
AU        src/documentation/content/xdocs/components/poifs/usecases.xml
AU        src/documentation/content/xdocs/components/poi-ruby.xml
A         src/documentation/content/xdocs/components/hpsf
AU        src/documentation/content/xdocs/components/hpsf/how-to.xml
AU        src/documentation/content/xdocs/components/hpsf/internals.xml
AU        src/documentation/content/xdocs/components/hpsf/index.xml
AU        src/documentation/content/xdocs/components/hpsf/thumbnails.xml
AU        src/documentation/content/xdocs/components/hpsf/todo.xml
AU        src/documentation/content/xdocs/components/poi-jvm-languages.xml
A         src/documentation/content/xdocs/components/diagram
AU        src/documentation/content/xdocs/components/diagram/index.xml
A         src/documentation/content/xdocs/components/hmef
AU        src/documentation/content/xdocs/components/hmef/index.xml
A         src/documentation/content/xdocs/components/hpbf
AU        src/documentation/content/xdocs/components/hpbf/file-format.xml
AU        src/documentation/content/xdocs/components/hpbf/index.xml
AU        src/documentation/content/xdocs/components/logging.xml
A         src/documentation/content/xdocs/components/oxml4j
AU        src/documentation/content/xdocs/components/oxml4j/index.xml
A         src/documentation/content/xdocs/devel
AU        src/documentation/content/xdocs/devel/subversion.xml
A         src/documentation/content/xdocs/devel/history
AU        src/documentation/content/xdocs/devel/history/changes-3x.xml
A         src/documentation/content/xdocs/devel/history/changes-pre3x.xml
AU        src/documentation/content/xdocs/devel/history/index.xml
AU        src/documentation/content/xdocs/devel/index.xml
AU        src/documentation/content/xdocs/devel/guidelines.xml
A         src/documentation/content/xdocs/devel/plan
AU        src/documentation/content/xdocs/devel/plan/index.xml
AU        src/documentation/content/xdocs/devel/plan/vision10.xml
AU        src/documentation/content/xdocs/devel/plan/vision20.xml
A         src/documentation/content/xdocs/devel/references
A         src/documentation/content/xdocs/devel/references/3rdparty.xml
AU        src/documentation/content/xdocs/devel/references/index.xml
AU        src/documentation/content/xdocs/devel/references/logocontest.xml
A         src/documentation/content/xdocs/devel/resolutions
AU        src/documentation/content/xdocs/devel/resolutions/index.xml
AU        src/documentation/content/xdocs/devel/resolutions/res001.xml
AU        src/documentation/content/xdocs/devel/who.xml
AU        src/documentation/content/xdocs/download.xml
A         src/documentation/content/xdocs/help
AU        src/documentation/content/xdocs/help/faq.xml
AU        src/documentation/content/xdocs/help/index.xml
AU        src/documentation/content/xdocs/encryption.xml
AU        src/documentation/content/xdocs/related-projects.xml
A         src/documentation/content/xdocs/apidocs
A         src/documentation/content/xdocs/apidocs/index.xml
AU        src/documentation/content/xdocs/site.xml
AU        src/documentation/content/xdocs/index.xml
AU        src/documentation/content/xdocs/casestudies.xml
AU        src/documentation/content/xdocs/status.copy_module_from_bugzilla.py
A         src/documentation/content/xdocs/images
A         src/documentation/content/xdocs/images/poweredby-poi.svg
AU        src/documentation/content/xdocs/images/poweredby-poi-logo.png
AU        src/documentation/content/xdocs/images/project-header.png
A         src/documentation/content/xdocs/images/group.svg
AU        src/documentation/content/xdocs/images/add.png
AU        src/documentation/content/xdocs/images/favicon.ico
AU        src/documentation/content/xdocs/images/fix.png
AU        src/documentation/content/xdocs/images/group-logo.png
AU        src/documentation/content/xdocs/images/icon.png
AU        src/documentation/content/xdocs/images/remove.png
AU        src/documentation/content/xdocs/images/update.png
AU        src/documentation/content/xdocs/images/usemap.gif
AU        src/documentation/content/xdocs/legal.xml
AU        src/documentation/content/xdocs/news.xml
AU        src/documentation/content/xdocs/tabs.xml
AU        src/documentation/content/xdocs/text-extraction.xml
A         src/documentation/content/locationmap.xml
AU        src/documentation/release-guide.txt
A         src/documentation/resources
A         src/documentation/resources/schema
AU        src/documentation/resources/schema/changes-poi.mod
A         src/documentation/resources/schema/catalog.xcat
AU        src/documentation/resources/schema/changes-poi.dtd
A         src/documentation/resources/stylesheets
AU        src/documentation/resources/stylesheets/changes2document.xsl
AU        src/documentation/resources/stylesheets/snipplets2document.xsl
A         src/documentation/resources/images
A         src/documentation/resources/images/project-header.svg
AU        src/documentation/resources/images/support-asf.png
AU        src/documentation/resources/images/project-header.xcf
AU        src/documentation/resources/images/pb-poi.cdr
AU        src/documentation/resources/images/logoRussellBeattie4.png
AU        src/documentation/resources/images/logoAndrewClements.png
AU        src/documentation/resources/images/logoRussellBeattie5.png
AU        src/documentation/resources/images/logoGustafsson1.png
AU        src/documentation/resources/images/logoGustafsson2.png
AU        src/documentation/resources/images/logoKarmokar4s.png
AU        src/documentation/resources/images/old-project-logo.gif
AU        src/documentation/resources/images/logoLoicLefevre2.png
AU        src/documentation/resources/images/POIFSAddDocument.gif
AU        src/documentation/resources/images/utilClasses.gif
AU        src/documentation/resources/images/POIFSClassDiagram.gif
AU        src/documentation/resources/images/logoRandyStanard01.png
AU        src/documentation/resources/images/logoRandyStanard02.png
AU        src/documentation/resources/images/POIFSWriteArchive.gif
AU        src/documentation/resources/images/logoRandyStanard03.png
AU        src/documentation/resources/images/logoRandyStanard04.png
AU        src/documentation/resources/images/logoRandyStanard05.png
AU        src/documentation/resources/images/POIFSWriteFilesystem.gif
AU        src/documentation/resources/images/logoRandyStanard06.png
AU        src/documentation/resources/images/logoRandyStanard07.png
AU        src/documentation/resources/images/built-with-forrest-button.png
AU        src/documentation/resources/images/logoRandyStanard08.png
AU        src/documentation/resources/images/timesheet.jpg
AU        src/documentation/resources/images/poi-logo.png
AU        src/documentation/resources/images/unknown.jpg
AU        src/documentation/resources/images/logoKarmokar1s.png
AU        src/documentation/resources/images/POIFSRootPropertyPreWrite.gif
AU        src/documentation/resources/images/logoWendyWise.png
AU        src/documentation/resources/images/POIFSPropertyTablePreWrite.gif
AU        src/documentation/resources/images/logoKarmokar5s.png
AU        src/documentation/resources/images/ss-features.png
AU        src/documentation/resources/images/businessplan.jpg
AU        src/documentation/resources/images/logoJanssen1.png
AU        src/documentation/resources/images/logoJanssen2.png
AU        src/documentation/resources/images/calendar.jpg
AU        src/documentation/resources/images/loancalc.jpg
AU        src/documentation/resources/images/usermodel.gif
AU        src/documentation/resources/images/logoLoicLefevre.png
AU        src/documentation/resources/images/simple-xls-with-function.jpg
AU        src/documentation/resources/images/logoRaPiGmbH1.png
AU        src/documentation/resources/images/PropertySet.jpg
AU        src/documentation/resources/images/logoRaPiGmbH2.png
AU        src/documentation/resources/images/vba-example.jpg
AU        src/documentation/resources/images/logoKarmokar2s.png
AU        src/documentation/resources/images/logoRaPiGmbH5.png
AU        src/documentation/resources/images/logoRaPiGmbH6.png
AU        src/documentation/resources/images/logoKarmokar6s.png
AU        src/documentation/resources/images/logoRaPiGmbH7.png
AU        src/documentation/resources/images/logoRaPiGmbH8.png
AU        src/documentation/resources/images/logoRaPiGmbH9.png
AU        src/documentation/resources/images/logoDanielFernandez.png
AU        src/documentation/resources/images/logoAndrewClements2.png
AU        src/documentation/resources/images/hslf_shapes.gif
AU        src/documentation/resources/images/logoWendyWise2.png
AU        src/documentation/resources/images/POIFSLifeCycle.gif
AU        src/documentation/resources/images/logoAdria1.png
AU        src/documentation/resources/images/logoAdria2.png
AU        src/documentation/resources/images/logoAdria3.png
AU        src/documentation/resources/images/remove.jpg
AU        src/documentation/resources/images/logoKarmokar3s.png
AU        src/documentation/resources/images/logoGlenStampoutlzis.png
AU        src/documentation/resources/images/logoKarmokar1.png
AU        src/documentation/resources/images/POIFSInitialization.gif
AU        src/documentation/resources/images/logoKarmokar2.png
AU        src/documentation/resources/images/logoRaPiGmbH10.png
AU        src/documentation/resources/images/logoKarmokar3.png
AU        src/documentation/resources/images/logoRaPiGmbH11.png
AU        src/documentation/resources/images/logoMichaelMosmann.png
AU        src/documentation/resources/images/logoKarmokar4.png
AU        src/documentation/resources/images/logoRaPiGmbH12.png
AU        src/documentation/resources/images/logoKarmokar5.png
AU        src/documentation/resources/images/logoKarmokar6.png
AU        src/documentation/resources/images/ApacheConEu08.jpg
AU        src/documentation/resources/images/BlockClassDiagram.gif
AU        src/documentation/resources/images/calculatePayment.jpg
AU        src/documentation/resources/images/PropertyTableClassDiagram.gif
AU        src/documentation/resources/images/logoRussellBeattie1.png
AU        src/documentation/resources/images/logoRussellBeattie2.png
AU        src/documentation/resources/images/logoRussellBeattie3.png
A         src/documentation/sitemap.xmap
AU        src/documentation/skinconf.xml
A         src/documentation/cli.xconf
AU        src/documentation/RELEASE-NOTES.txt
AU        src/documentation/README.txt
A         src/documentation/classes
A         src/documentation/classes/CatalogManager.properties
At revision 1882085

At revision 1882085

No changes for https://svn.apache.org/repos/asf/poi/trunk since the previous build
No changes for https://svn.apache.org/repos/asf/poi/site/forrest.properties since the previous build
No changes for https://svn.apache.org/repos/asf/poi/site/src/documentation since the previous build
Injecting SonarQube environment variables using the configuration: sonarqube.io
WARN: Unable to locate 'report-task.txt' in the workspace. Did the SonarScanner succeeded?
ERROR: Could not find credentials entry with ID 'sonarcloud-poi'

---------------------------------------------------------------------
To unsubscribe, e-mail: [hidden email]
For additional commands, e-mail: [hidden email]

Reply | Threaded
Open this post in threaded view
|

Build failed in Jenkins: POI » POI-DSL-SonarQube-Gradle #3

Apache Jenkins Server
See <https://ci-builds.apache.org/job/POI/job/POI-DSL-SonarQube-Gradle/3/display/redirect>

Changes:


------------------------------------------
[...truncated 3.84 KB...]
-rwxr-xr-x 1 root root   9065 Apr  6  2020 javadoc
-rwxr-xr-x 1 root root   9057 Apr  6  2020 javah
-rwxr-xr-x 1 root root   9057 Apr  6  2020 javap
-rwxrwxr-x 1 root root   2806 Apr  6  2020 java-rmi.cgi
-rwxr-xr-x 1 root root   9057 Apr  6  2020 jcmd
-rwxr-xr-x 1 root root   9089 Apr  6  2020 jconsole
-rwxr-xr-x 1 root root   9065 Apr  6  2020 jdb
-rwxr-xr-x 1 root root   9057 Apr  6  2020 jdeps
-rwxr-xr-x 1 root root   9057 Apr  6  2020 jhat
-rwxr-xr-x 1 root root   9097 Apr  6  2020 jinfo
-rwxr-xr-x 1 root root   9057 Apr  6  2020 jjs
-rwxr-xr-x 1 root root   9097 Apr  6  2020 jmap
-rwxr-xr-x 1 root root   9057 Apr  6  2020 jps
-rwxr-xr-x 1 root root   9065 Apr  6  2020 jrunscript
-rwxr-xr-x 1 root root   9073 Apr  6  2020 jsadebugd
-rwxr-xr-x 1 root root   9105 Apr  6  2020 jstack
-rwxr-xr-x 1 root root   9057 Apr  6  2020 jstat
-rwxr-xr-x 1 root root   9065 Apr  6  2020 jstatd
-rwxr-xr-x 1 root root   9065 Apr  6  2020 keytool
-rwxr-xr-x 1 root root   9065 Apr  6  2020 native2ascii
-rwxr-xr-x 1 root root   9105 Apr  6  2020 orbd
-rwxr-xr-x 1 root root   9065 Apr  6  2020 pack200
-rwxr-xr-x 1 root root   9065 Apr  6  2020 policytool
-rwxr-xr-x 1 root root   9057 Apr  6  2020 rmic
-rwxr-xr-x 1 root root   9057 Apr  6  2020 rmid
-rwxr-xr-x 1 root root   9065 Apr  6  2020 rmiregistry
-rwxr-xr-x 1 root root   9065 Apr  6  2020 schemagen
-rwxr-xr-x 1 root root   9065 Apr  6  2020 serialver
-rwxr-xr-x 1 root root   9065 Apr  6  2020 servertool
-rwxr-xr-x 1 root root   9113 Apr  6  2020 tnameserv
-rwxr-xr-x 1 root root 245802 Apr  6  2020 unpack200
-rwxr-xr-x 1 root root   9057 Apr  6  2020 wsgen
-rwxr-xr-x 1 root root   9065 Apr  6  2020 wsimport
-rwxr-xr-x 1 root root   9057 Apr  6  2020 xjc
+ /home/jenkins/tools/java/latest1.8/bin/java -version
openjdk version "1.8.0_252"
OpenJDK Runtime Environment (build 1.8.0_252-b09)
OpenJDK 64-Bit Server VM (build 25.252-b09, mixed mode)
+ echo which java
which java
+ which java
/home/jenkins/tools/java/latest1.8/bin/java
+ java -version
openjdk version "1.8.0_252"
OpenJDK Runtime Environment (build 1.8.0_252-b09)
OpenJDK 64-Bit Server VM (build 25.252-b09, mixed mode)
+ echo which javac
which javac
+ which javac
/home/jenkins/tools/java/latest1.8/bin/javac
+ javac -version
javac 1.8.0_252
+ echo Ant-Home:
Ant-Home:
+ ls -al
total 448
drwxr-xr-x 12 jenkins jenkins   4096 Sep 28 16:32 .
drwxr-xr-x  4 jenkins jenkins   4096 Oct  2 19:09 ..
-rw-r--r--  1 jenkins jenkins  14131 Sep 28 16:31 build.gradle
-rw-r--r--  1 jenkins jenkins 149016 Sep 28 16:31 build.xml
-rw-r--r--  1 jenkins jenkins   3341 Sep 28 16:31 .classpath
-rw-r--r--  1 jenkins jenkins   6160 Sep 28 16:31 doap_POI.rdf
-rw-r--r--  1 jenkins jenkins   2847 Sep 28 16:31 file-leak-detector.exclude
-rw-r--r--  1 jenkins jenkins   6229 Sep 28 16:32 forrest.properties
-rw-r--r--  1 jenkins jenkins     53 Sep 28 16:31 .gitattributes
-rw-r--r--  1 jenkins jenkins    493 Sep 28 16:31 .gitignore
drwxr-xr-x  3 jenkins jenkins   4096 Sep 28 16:31 gradle
-rwxr-xr-x  1 jenkins jenkins   5917 Sep 28 16:31 gradlew
-rw-r--r--  1 jenkins jenkins   2842 Sep 28 16:31 gradlew.bat
drwxr-xr-x  2 jenkins jenkins   4096 Sep 28 16:31 jenkins
-rw-r--r--  1 jenkins jenkins 167284 Sep 28 16:31 KEYS
drwxr-xr-x  2 jenkins jenkins   4096 Sep 28 16:31 legal
drwxr-xr-x  2 jenkins jenkins   4096 Sep 28 16:31 maven
drwxr-xr-x  3 jenkins jenkins   4096 Sep 28 16:31 osgi
-rw-r--r--  1 jenkins jenkins   4813 Sep 28 16:31 patch.xml
-rw-r--r--  1 jenkins jenkins    426 Sep 28 16:31 .project
-rw-r--r--  1 jenkins jenkins   4266 Sep 28 16:31 README.rst
drwxr-xr-x  2 jenkins jenkins   4096 Sep 28 16:31 .settings
-rw-r--r--  1 jenkins jenkins    556 Sep 28 16:31 settings.gradle
drwxr-xr-x 11 jenkins jenkins   4096 Sep 28 16:31 sonar
drwxr-xr-x 16 jenkins jenkins   4096 Sep 28 16:32 src
drwxr-xr-x  4 jenkins jenkins   4096 Oct  7 19:24 .svn
drwxr-xr-x 14 jenkins jenkins   4096 Sep 28 16:31 test-data
-rw-r--r--  1 jenkins jenkins    136 Sep 28 16:31 .travis.yml
+ echo which ant
which ant
+ which ant
/usr/bin/ant
+ ant -version
Apache Ant(TM) version 1.10.5 compiled on March 28 2019
+ echo <project default="test"><target name="test"><echo>Java ${ant.java.version}/${java.version}</echo><exec executable="javac"><arg value="-version"/></exec></target></project>
+ ant -f build.javacheck.xml -v
Apache Ant(TM) version 1.10.5 compiled on March 28 2019
Buildfile: <https://ci-builds.apache.org/job/POI/job/POI-DSL-SonarQube-Gradle/ws/build.javacheck.xml>
Detected Java version: 1.8 in: /usr/local/asfpackages/java/openjdk-8u252-b09/jre
Detected OS: Linux
parsing buildfile <https://ci-builds.apache.org/job/POI/job/POI-DSL-SonarQube-Gradle/ws/build.javacheck.xml> with URI = <https://ci-builds.apache.org/job/POI/job/POI-DSL-SonarQube-Gradle/ws/build.javacheck.xml>
Project base dir set to: <https://ci-builds.apache.org/job/POI/job/POI-DSL-SonarQube-Gradle/ws/>
Build sequence for target(s) `test' is [test]
Complete build sequence is [test, ]

test:
parsing buildfile jar:file:/usr/share/ant/lib/ant.jar!/org/apache/tools/ant/antlib.xml with URI = jar:file:/usr/share/ant/lib/ant.jar!/org/apache/tools/ant/antlib.xml from a zip file
     [echo] Java 1.8/1.8.0_252
     [exec] Current OS is Linux
     [exec] Executing 'javac' with arguments:
     [exec] '-version'
     [exec]
     [exec] The ' characters around the executable and arguments are
     [exec] not part of the command.
     [exec] javac 1.8.0_252

BUILD SUCCESSFUL
Total time: 0 seconds
+ exit 0
[Gradle] - Launching build.
[POI-DSL-SonarQube-Gradle] $ gradle -PenableSonar -Dsonar.login=${POI_SONAR_TOKEN} sonarqube
To honour the JVM settings for this build a new JVM will be forked. Please consider using the daemon: https://docs.gradle.org/6.1/userguide/gradle_daemon.html.
Daemon will be stopped at the end of the build stopping after processing

> Configure project :
Enabling Sonar support
Trying to override old definition of datatype junit
[ant:javac] : warning: 'includeantruntime' was not set, defaulting to build.sysclasspath=last; set to false for repeatable builds

> Task :main:compileJava
Note: Some input files use or override a deprecated API.
Note: Recompile with -Xlint:deprecation for details.
Note: Some input files use unchecked or unsafe operations.
Note: Recompile with -Xlint:unchecked for details.

> Task :main:processResources
> Task :main:classes
> Task :main:jar
> Task :ooxml:ant-check-jars
> Task :ooxml:ant-fetch-jars
> Task :ooxml:ant-check-ooxml-jars
> Task :ooxml:ant-fetch-ooxml-jars

> Task :ooxml:ant-init
[ant:echo] Using Ant: Apache Ant(TM) version 1.10.7 compiled on September 1 2019 from ${ant.home}, Ant detected Java 1.8 (may be different than actual Java sometimes...)
[ant:echo] Using Java: 1.8.0_252/1.8.0_252-b09/25.252-b09/OpenJDK 64-Bit Server VM from Oracle Corporation on Linux: 4.15.0-76-generic
[ant:echo] Building Apache POI version 5.0.0-SNAPSHOT and RC: RC1

> Task :ooxml:ant-check-compiled-ooxml-xsds

> Task :ooxml:ant-compile-ooxml-xsds
SchemaCompiler  Metadata LOAD:org/apache/xmlbeans/metadata GEN:org/apache/poi/schemas/ooxml
Time to build schema type system: 3.395 seconds
Time to generate code: 9.878 seconds

> Task :scratchpad:compileJava
Note: Some input files use or override a deprecated API.
Note: Recompile with -Xlint:deprecation for details.
Note: Some input files use unchecked or unsafe operations.
Note: Recompile with -Xlint:unchecked for details.

> Task :scratchpad:processResources
> Task :scratchpad:classes
> Task :scratchpad:jar

> Task :ooxml:compileJava
Note: Some input files use or override a deprecated API.
Note: Recompile with -Xlint:deprecation for details.
Note: <https://ci-builds.apache.org/job/POI/job/POI-DSL-SonarQube-Gradle/ws/src/ooxml/java/org/apache/poi/xslf/draw/SVGImageRenderer.java> uses unchecked or unsafe operations.
Note: Recompile with -Xlint:unchecked for details.

> Task :ooxml:processResources
> Task :ooxml:classes
> Task :ooxml:jar

> Task :examples:compileJava
Note: Some input files use or override a deprecated API.
Note: Recompile with -Xlint:deprecation for details.

> Task :examples:processResources NO-SOURCE
> Task :examples:classes
> Task :examples:compileTestJava NO-SOURCE
> Task :examples:processTestResources NO-SOURCE
> Task :examples:testClasses UP-TO-DATE
> Task :examples:test NO-SOURCE
> Task :excelant:compileJava
> Task :excelant:processResources
> Task :excelant:classes

> Task :main:compileTestJava
Note: Some input files use or override a deprecated API.
Note: Recompile with -Xlint:deprecation for details.
Note: <https://ci-builds.apache.org/job/POI/job/POI-DSL-SonarQube-Gradle/ws/src/testcases/org/apache/poi/sl/usermodel/BaseTestSlideShow.java> uses unchecked or unsafe operations.
Note: Recompile with -Xlint:unchecked for details.

> Task :main:processTestResources NO-SOURCE
> Task :main:testClasses
> Task :main:testJar
> Task :excelant:compileTestJava
> Task :excelant:processTestResources NO-SOURCE
> Task :excelant:testClasses
> Task :excelant:test
> Task :examples:jar
> Task :integrationtest:compileJava NO-SOURCE
> Task :integrationtest:processResources NO-SOURCE
> Task :integrationtest:classes UP-TO-DATE

> Task :ooxml:compileTestJava
Note: Some input files use or override a deprecated API.
Note: Recompile with -Xlint:deprecation for details.
Note: <https://ci-builds.apache.org/job/POI/job/POI-DSL-SonarQube-Gradle/ws/src/ooxml/testcases/org/apache/poi/ss/tests/TestWorkbookFactory.java> uses unchecked or unsafe operations.
Note: Recompile with -Xlint:unchecked for details.

> Task :ooxml:processTestResources NO-SOURCE
> Task :ooxml:testClasses
> Task :integrationtest:compileTestJava
> Task :integrationtest:processTestResources NO-SOURCE
> Task :integrationtest:testClasses
> Task :integrationtest:test
> Task :main:test
> Task :ooxml:test

> Task :scratchpad:compileTestJava
Note: Some input files use or override a deprecated API.
Note: Recompile with -Xlint:deprecation for details.
Note: <https://ci-builds.apache.org/job/POI/job/POI-DSL-SonarQube-Gradle/ws/src/scratchpad/testcases/org/apache/poi/hslf/usermodel/TestBugs.java> uses unchecked or unsafe operations.
Note: Recompile with -Xlint:unchecked for details.

> Task :scratchpad:processTestResources NO-SOURCE
> Task :scratchpad:testClasses
> Task :scratchpad:test
> Task :sonarqube FAILED

FAILURE: Build failed with an exception.

* What went wrong:
Execution failed for task ':sonarqube'.
> Not authorized. Please check the properties sonar.login and sonar.password.

* Try:
Run with --stacktrace option to get the stack trace. Run with --info or --debug option to get more log output. Run with --scan to get full insights.

* Get more help at https://help.gradle.org

Deprecated Gradle features were used in this build, making it incompatible with Gradle 7.0.
Use '--warning-mode all' to show the individual deprecation warnings.
See https://docs.gradle.org/6.1/userguide/command_line_interface.html#sec:command_line_warnings

BUILD FAILED in 16m 57s
32 actionable tasks: 32 executed
Build step 'Invoke Gradle script' changed build result to FAILURE
Build step 'Invoke Gradle script' marked build as failure
WARN: Unable to locate 'report-task.txt' in the workspace. Did the SonarScanner succeeded?

---------------------------------------------------------------------
To unsubscribe, e-mail: [hidden email]
For additional commands, e-mail: [hidden email]

Reply | Threaded
Open this post in threaded view
|

Build failed in Jenkins: POI » POI-DSL-SonarQube-Gradle #4

Apache Jenkins Server
See <https://ci-builds.apache.org/job/POI/job/POI-DSL-SonarQube-Gradle/4/display/redirect?page=changes>

Changes:

[Dominik Stadler] Add mising path to ooxml-schemas which is necessary for building with latest JDK 16 ea-builds

[Dominik Stadler] Apply patch for bug 64791 to use proper position for the WriteAccessRecord

[Dominik Stadler] Apply some IDE suggestions

[Dominik Stadler] Fix bug 64238: Make LOOKUP functions deal with empty last arg correctly

[Dominik Stadler] Update tests for bug 63845 some more

[Dominik Stadler] Prevent some unit-tests from failing when non-English local is used in Maven run

Also improve the error message when parsing the date fails.

[Andreas Beeker] Sonar fixes - a few "Try-with-resources should be used"

[Andreas Beeker] Sonar fixes - a few "String literals should not be duplicated"

[Andreas Beeker] create "build" directory - necessary when running in maven directory structure / build

[Andreas Beeker] add more nodes to Test-Environment job

[Andreas Beeker] try to fix sonar build

[PJ Fanning] update commons-codec

[PJ Fanning] update commons-codec

[Andreas Beeker] add info about marlin rendering engine solving busy loop hangs

[Andreas Beeker] Handle errors from GraalVM native mode runs - UnsupportedFeature on setting Sax features together with missing ErrorMessages from the java.xml module

[PJ Fanning] update change docs

[PJ Fanning] reformat

[PJ Fanning] [github-193] Change TRUNC implementation to use MathX. Thanks to Jacob Harris. This closes #193

[PJ Fanning] xmlbeans jar location

[Andreas Beeker] update ant/maven values, builds@ decided to rename those

[Andreas Beeker] update jdk values, remove jdk 1.6

[Andreas Beeker] Ignore test on no-scratchpad run

[Andreas Beeker] #64817 - Fix issue in testXLSXinPPT

[PJ Fanning] disable broken test

[PJ Fanning] use xmlbeans official 4.0.0 release

[PJ Fanning] doc build fails if context has more than one value

[PJ Fanning] fix xslf urls

[Nick Burch] Test PPT file containing a XLSX via an OLE2 intermediate layer, from Apache Tika

[Nick Burch] Add unit test for XLSX embedded in PPT and WorkbookFactory, was already fixed

[Andreas Beeker] Add license header

[Andreas Beeker] #64773 - Visual signatures for .xlsx/.docx


------------------------------------------
[...truncated 1.24 MB...]
                 .fPersonalCompose         = false
                 .fPersonalReply           = false
                 .fPersonal                = false
                 .fNoHtmlExport            = false
                 .fSemiHidden              = true
                 .fLocked                  = false
                 .fInternalUse             = true
                 .fUnhideWhenUsed          = true
                 .fQFormat                 = true
                 .fReserved                = 0
        [/StdfBase]
   
        StdfPost2000: [StdfPost2000]
            .info1                =  (0 )
                 .istdLink                 = 0
                 .fHasOriginalStyle        = false
                 .fSpare                   = 0
            .rsid                 =  (0 )
            .info3                =  (0 )
                 .iftcHtml                 = 0
                 .unused                   = false
                 .iPriority                = 0
        [/StdfPost2000]
   
        UPX: [UPX] [23, -10, 3, 0, 0, 52, -42, 6, 0, 1, 10, 3, 108, 0, 52, -42, 6, 0, 1, 5, 3, 0, 0, 97, -10, 3, 0, 0]
        UPX: [UPX] [11, 0]
        UPX: [UPX] []
    === Style #12 'No List' ===
    [STD]: 'No List'
        StdfBase: [StdfBase]
            .info1                =  (8299 )
                 .sti                      = 107
                 .fScratch                 = false
                 .fInvalHeight             = true
                 .fHasUpe                  = false
                 .fMassCopy                = false
            .info2                =  (-12 )
                 .stk                      = 4
                 .istdBase                 = 4095
            .info3                =  (193 )
                 .cupx                     = 1
                 .istdNext                 = 12
            .bchUpe               =  (40 )
            .grfstd               =  (3328 )
                 .fAutoRedef               = false
                 .fHidden                  = false
                 .f97LidsSet               = false
                 .fCopyLang                = false
                 .fPersonalCompose         = false
                 .fPersonalReply           = false
                 .fPersonal                = false
                 .fNoHtmlExport            = false
                 .fSemiHidden              = true
                 .fLocked                  = false
                 .fInternalUse             = true
                 .fUnhideWhenUsed          = true
                 .fQFormat                 = false
                 .fReserved                = 0
        [/StdfBase]
   
        StdfPost2000: [StdfPost2000]
            .info1                =  (0 )
                 .istdLink                 = 0
                 .fHasOriginalStyle        = false
                 .fSpare                   = 0
            .rsid                 =  (0 )
            .info3                =  (0 )
                 .iftcHtml                 = 0
                 .unused                   = false
                 .iPriority                = 0
        [/StdfPost2000]
   
        UPX: [UPX] [12, 0]

org.apache.poi.hwpf.converter.TestWordToConverterSuite > testText[126: <https://ci-builds.apache.org/job/POI/job/POI-DSL-SonarQube-Gradle/ws/test-data/document/../document/Bug61268.doc]> STANDARD_ERROR
    Attempt to output character of integral value 0 that is not represented in specified output encoding of UTF-8.

org.apache.poi.hwpf.usermodel.TestBug47563 > test[rows: 1, columns: 5] STANDARD_OUT

    Testing with rows: 1, columns: 5
    row 0
    column 0, num paragraphs 1
    column 1, num paragraphs 1
    column 2, num paragraphs 1
    column 3, num paragraphs 1
    column 4, num paragraphs 1

org.apache.poi.hwpf.usermodel.TestBug47563 > test[rows: 1, columns: 6] STANDARD_OUT

    Testing with rows: 1, columns: 6
    row 0
    column 0, num paragraphs 1
    column 1, num paragraphs 1
    column 2, num paragraphs 1
    column 3, num paragraphs 1
    column 4, num paragraphs 1
    column 5, num paragraphs 1

org.apache.poi.hwpf.usermodel.TestBug47563 > test[rows: 5, columns: 1] STANDARD_OUT

    Testing with rows: 5, columns: 1
    row 0
    column 0, num paragraphs 1
    row 1
    column 0, num paragraphs 1
    row 2
    column 0, num paragraphs 1
    row 3
    column 0, num paragraphs 1
    row 4
    column 0, num paragraphs 1

org.apache.poi.hwpf.usermodel.TestBug47563 > test[rows: 6, columns: 1] STANDARD_OUT

    Testing with rows: 6, columns: 1
    row 0
    column 0, num paragraphs 1
    row 1
    column 0, num paragraphs 1
    row 2
    column 0, num paragraphs 1
    row 3
    column 0, num paragraphs 1
    row 4
    column 0, num paragraphs 1
    row 5
    column 0, num paragraphs 1

org.apache.poi.hwpf.usermodel.TestBug47563 > test[rows: 2, columns: 2] STANDARD_OUT

    Testing with rows: 2, columns: 2
    row 0
    column 0, num paragraphs 1
    column 1, num paragraphs 1
    row 1
    column 0, num paragraphs 1
    column 1, num paragraphs 1

org.apache.poi.hwpf.usermodel.TestBug47563 > test[rows: 3, columns: 2] STANDARD_OUT

    Testing with rows: 3, columns: 2
    row 0
    column 0, num paragraphs 1
    column 1, num paragraphs 1
    row 1
    column 0, num paragraphs 1
    column 1, num paragraphs 1
    row 2
    column 0, num paragraphs 1
    column 1, num paragraphs 1

org.apache.poi.hwpf.usermodel.TestBug47563 > test[rows: 2, columns: 3] STANDARD_OUT

    Testing with rows: 2, columns: 3
    row 0
    column 0, num paragraphs 1
    column 1, num paragraphs 1
    column 2, num paragraphs 1
    row 1
    column 0, num paragraphs 1
    column 1, num paragraphs 1
    column 2, num paragraphs 1

org.apache.poi.hwpf.usermodel.TestBug47563 > test[rows: 3, columns: 3] STANDARD_OUT

    Testing with rows: 3, columns: 3
    row 0
    column 0, num paragraphs 1
    column 1, num paragraphs 1
    column 2, num paragraphs 1
    row 1
    column 0, num paragraphs 1
    column 1, num paragraphs 1
    column 2, num paragraphs 1
    row 2
    column 0, num paragraphs 1
    column 1, num paragraphs 1
    column 2, num paragraphs 1

org.apache.poi.hwpf.usermodel.TestBugs > testBug61268 STANDARD_ERROR
    Attempt to output character of integral value 0 that is not represented in specified output encoding of UTF-8.

org.apache.poi.hwpf.usermodel.TestBugs > test61490CellCountInTable STANDARD_OUT
    print table

org.apache.poi.hwpf.usermodel.TestPictures > test58804 SKIPPED

org.apache.poi.hwpf.usermodel.TestPictures > test58804_1 SKIPPED

Gradle Test Executor 5 finished executing tests.

> Task :scratchpad:test
Finished generating test XML results (0.061 secs) into: <https://ci-builds.apache.org/job/POI/job/POI-DSL-SonarQube-Gradle/ws/build/scratchpad/build/test-results/test>
Generating HTML test report...
Finished generating test html results (0.061 secs) into: <https://ci-builds.apache.org/job/POI/job/POI-DSL-SonarQube-Gradle/ws/build/scratchpad/build/reports/tests/test>
:scratchpad:test (Thread[Execution worker for ':' Thread 10,5,main]) completed. Took 36.404 secs.
:sonarqube (Thread[Execution worker for ':' Thread 10,5,main]) started.

> Task :sonarqube
JaCoCo report task detected, but XML report is not enabled or it was not produced. Coverage for this task will not be reported.
JaCoCo report task detected, but XML report is not enabled or it was not produced. Coverage for this task will not be reported.
JaCoCo report task detected, but XML report is not enabled or it was not produced. Coverage for this task will not be reported.
JaCoCo report task detected, but XML report is not enabled or it was not produced. Coverage for this task will not be reported.
JaCoCo report task detected, but XML report is not enabled or it was not produced. Coverage for this task will not be reported.
JaCoCo report task detected, but XML report is not enabled or it was not produced. Coverage for this task will not be reported.
Caching disabled for task ':sonarqube' because:
  Build cache is disabled
Task ':sonarqube' is not up-to-date because:
  Task has not declared any outputs despite executing actions.
JaCoCo report task detected, but XML report is not enabled or it was not produced. Coverage for this task will not be reported.
JaCoCo report task detected, but XML report is not enabled or it was not produced. Coverage for this task will not be reported.
JaCoCo report task detected, but XML report is not enabled or it was not produced. Coverage for this task will not be reported.
JaCoCo report task detected, but XML report is not enabled or it was not produced. Coverage for this task will not be reported.
JaCoCo report task detected, but XML report is not enabled or it was not produced. Coverage for this task will not be reported.
JaCoCo report task detected, but XML report is not enabled or it was not produced. Coverage for this task will not be reported.
User cache: /home/jenkins/.sonar/cache
Default locale: "en_US", source code encoding: "UTF-8" (analysis is platform dependent)
Load global settings
Load global settings (done) | time=954ms
Server id: 1BD809FA-AWHW8ct9-T_TB3XqouNu
User cache: /home/jenkins/.sonar/cache
Load/download plugins
Load plugins index
Load plugins index (done) | time=234ms
Load/download plugins (done) | time=359ms
Loaded core extensions: developer-scanner
JavaScript/TypeScript frontend is enabled
The version of Java (1.8.0_252) you have used to run this analysis is deprecated and we will stop accepting it from October 2020. Please update to at least Java 11.
Process project properties

> Task :sonarqube FAILED
:sonarqube (Thread[Execution worker for ':' Thread 10,5,main]) completed. Took 4.195 secs.

FAILURE: Build failed with an exception.

* What went wrong:
Execution failed for task ':sonarqube'.
> You must define the following mandatory properties for 'poi': sonar.organization

* Try:
Run with --stacktrace option to get the stack trace. Run with --debug option to get more log output. Run with --scan to get full insights.

* Get more help at https://help.gradle.org

BUILD FAILED in 10m 2s
32 actionable tasks: 32 executed
Build step 'Invoke Gradle script' changed build result to FAILURE
Build step 'Invoke Gradle script' marked build as failure
WARN: Unable to locate 'report-task.txt' in the workspace. Did the SonarScanner succeed?

---------------------------------------------------------------------
To unsubscribe, e-mail: [hidden email]
For additional commands, e-mail: [hidden email]

Reply | Threaded
Open this post in threaded view
|

Build failed in Jenkins: POI » POI-DSL-SonarQube-Gradle #5

Apache Jenkins Server
See <https://ci-builds.apache.org/job/POI/job/POI-DSL-SonarQube-Gradle/5/display/redirect?page=changes>

Changes:

[Dominik Stadler] Jenkins-DSL: Add JDK 16, disable POI-JDK-14 to only the latest 2 JDK releases

Also update the list of JDKs and Nodes for the TestEnvironment job


------------------------------------------
[...truncated 35.83 KB...]

> Task :examples:compileTestJava NO-SOURCE
file or directory '<https://ci-builds.apache.org/job/POI/job/POI-DSL-SonarQube-Gradle/ws/build/examples/src/test/java',> not found
Skipping task ':examples:compileTestJava' as it has no source files and no previous output files.
:examples:compileTestJava (Thread[Execution worker for ':' Thread 6,5,main]) completed. Took 0.001 secs.
:examples:processTestResources (Thread[Execution worker for ':' Thread 6,5,main]) started.

> Task :examples:processTestResources NO-SOURCE
file or directory '<https://ci-builds.apache.org/job/POI/job/POI-DSL-SonarQube-Gradle/ws/build/examples/src/test/resources',> not found
Skipping task ':examples:processTestResources' as it has no source files and no previous output files.
:examples:processTestResources (Thread[Execution worker for ':' Thread 6,5,main]) completed. Took 0.0 secs.
:examples:testClasses (Thread[Execution worker for ':' Thread 6,5,main]) started.

> Task :examples:testClasses UP-TO-DATE
Skipping task ':examples:testClasses' as it has no actions.
:examples:testClasses (Thread[Execution worker for ':' Thread 6,5,main]) completed. Took 0.0 secs.
:examples:test (Thread[Execution worker for ':' Thread 6,5,main]) started.

> Task :examples:test NO-SOURCE
Skipping task ':examples:test' as it has no source files and no previous output files.
:examples:test (Thread[Execution worker for ':' Thread 6,5,main]) completed. Took 0.002 secs.
:excelant:compileJava (Thread[Execution worker for ':' Thread 6,5,main]) started.

> Task :excelant:compileJava UP-TO-DATE
Caching disabled for task ':excelant:compileJava' because:
  Build cache is disabled
Skipping task ':excelant:compileJava' as it is up-to-date.
:excelant:compileJava (Thread[Execution worker for ':' Thread 6,5,main]) completed. Took 0.041 secs.
:excelant:processResources (Thread[Execution worker for ':' Thread 6,5,main]) started.

> Task :excelant:processResources UP-TO-DATE
Caching disabled for task ':excelant:processResources' because:
  Build cache is disabled
Skipping task ':excelant:processResources' as it is up-to-date.
:excelant:processResources (Thread[Execution worker for ':' Thread 6,5,main]) completed. Took 0.005 secs.
:excelant:classes (Thread[Execution worker for ':' Thread 6,5,main]) started.

> Task :excelant:classes UP-TO-DATE
Skipping task ':excelant:classes' as it has no actions.
:excelant:classes (Thread[Execution worker for ':' Thread 6,5,main]) completed. Took 0.0 secs.
:main:compileTestJava (Thread[Execution worker for ':' Thread 6,5,main]) started.

> Task :main:compileTestJava UP-TO-DATE
Caching disabled for task ':main:compileTestJava' because:
  Build cache is disabled
Skipping task ':main:compileTestJava' as it is up-to-date.
:main:compileTestJava (Thread[Execution worker for ':' Thread 6,5,main]) completed. Took 0.232 secs.
:main:processTestResources (Thread[Execution worker for ':' Thread 6,5,main]) started.

> Task :main:processTestResources NO-SOURCE
file or directory '<https://ci-builds.apache.org/job/POI/job/POI-DSL-SonarQube-Gradle/ws/build/main/src/test/resources',> not found
Skipping task ':main:processTestResources' as it has no source files and no previous output files.
:main:processTestResources (Thread[Execution worker for ':' Thread 6,5,main]) completed. Took 0.001 secs.
:main:testClasses (Thread[Execution worker for ':' Thread 6,5,main]) started.

> Task :main:testClasses UP-TO-DATE
Skipping task ':main:testClasses' as it has no actions.
:main:testClasses (Thread[Execution worker for ':' Thread 6,5,main]) completed. Took 0.0 secs.
:main:testJar (Thread[Execution worker for ':' Thread 6,5,main]) started.

> Task :main:testJar UP-TO-DATE
Caching disabled for task ':main:testJar' because:
  Build cache is disabled
Skipping task ':main:testJar' as it is up-to-date.
:main:testJar (Thread[Execution worker for ':' Thread 6,5,main]) completed. Took 0.005 secs.
:excelant:compileTestJava (Thread[Execution worker for ':' Thread 6,5,main]) started.

> Task :excelant:compileTestJava UP-TO-DATE
Caching disabled for task ':excelant:compileTestJava' because:
  Build cache is disabled
Skipping task ':excelant:compileTestJava' as it is up-to-date.
:excelant:compileTestJava (Thread[Execution worker for ':' Thread 6,5,main]) completed. Took 0.035 secs.
:excelant:processTestResources (Thread[Execution worker for ':' Thread 6,5,main]) started.

> Task :excelant:processTestResources NO-SOURCE
file or directory '<https://ci-builds.apache.org/job/POI/job/POI-DSL-SonarQube-Gradle/ws/build/excelant/src/test/resources',> not found
Skipping task ':excelant:processTestResources' as it has no source files and no previous output files.
:excelant:processTestResources (Thread[Execution worker for ':' Thread 6,5,main]) completed. Took 0.001 secs.
:excelant:testClasses (Thread[Execution worker for ':' Thread 6,5,main]) started.

> Task :excelant:testClasses UP-TO-DATE
Skipping task ':excelant:testClasses' as it has no actions.
:excelant:testClasses (Thread[Execution worker for ':' Thread 6,5,main]) completed. Took 0.0 secs.
:excelant:test (Thread[Execution worker for ':' Thread 6,5,main]) started.

> Task :excelant:test UP-TO-DATE
Caching disabled for task ':excelant:test' because:
  Build cache is disabled
Skipping task ':excelant:test' as it is up-to-date.
:excelant:test (Thread[Execution worker for ':' Thread 6,5,main]) completed. Took 0.056 secs.
:examples:jar (Thread[Execution worker for ':' Thread 6,5,main]) started.

> Task :examples:jar UP-TO-DATE
Caching disabled for task ':examples:jar' because:
  Build cache is disabled
Skipping task ':examples:jar' as it is up-to-date.
:examples:jar (Thread[Execution worker for ':' Thread 6,5,main]) completed. Took 0.004 secs.
:integrationtest:compileJava (Thread[Execution worker for ':' Thread 6,5,main]) started.

> Task :integrationtest:compileJava NO-SOURCE
file or directory '<https://ci-builds.apache.org/job/POI/job/POI-DSL-SonarQube-Gradle/ws/build/integrationtest/src/main/java',> not found
Skipping task ':integrationtest:compileJava' as it has no source files and no previous output files.
:integrationtest:compileJava (Thread[Execution worker for ':' Thread 6,5,main]) completed. Took 0.002 secs.
:integrationtest:processResources (Thread[Execution worker for ':' Thread 6,5,main]) started.

> Task :integrationtest:processResources NO-SOURCE
file or directory '<https://ci-builds.apache.org/job/POI/job/POI-DSL-SonarQube-Gradle/ws/build/integrationtest/src/main/resources',> not found
Skipping task ':integrationtest:processResources' as it has no source files and no previous output files.
:integrationtest:processResources (Thread[Execution worker for ':' Thread 6,5,main]) completed. Took 0.0 secs.
:integrationtest:classes (Thread[Execution worker for ':' Thread 6,5,main]) started.

> Task :integrationtest:classes UP-TO-DATE
Skipping task ':integrationtest:classes' as it has no actions.
:integrationtest:classes (Thread[Execution worker for ':' Thread 6,5,main]) completed. Took 0.0 secs.
:ooxml:compileTestJava (Thread[Execution worker for ':' Thread 6,5,main]) started.

> Task :ooxml:compileTestJava UP-TO-DATE
Caching disabled for task ':ooxml:compileTestJava' because:
  Build cache is disabled
Skipping task ':ooxml:compileTestJava' as it is up-to-date.
:ooxml:compileTestJava (Thread[Execution worker for ':' Thread 6,5,main]) completed. Took 0.137 secs.
:ooxml:processTestResources (Thread[Execution worker for ':' Thread 6,5,main]) started.

> Task :ooxml:processTestResources NO-SOURCE
file or directory '<https://ci-builds.apache.org/job/POI/job/POI-DSL-SonarQube-Gradle/ws/build/ooxml/src/test/resources',> not found
Skipping task ':ooxml:processTestResources' as it has no source files and no previous output files.
:ooxml:processTestResources (Thread[Execution worker for ':' Thread 6,5,main]) completed. Took 0.001 secs.
:ooxml:testClasses (Thread[Execution worker for ':' Thread 6,5,main]) started.

> Task :ooxml:testClasses UP-TO-DATE
Skipping task ':ooxml:testClasses' as it has no actions.
:ooxml:testClasses (Thread[Execution worker for ':' Thread 6,5,main]) completed. Took 0.0 secs.
:integrationtest:compileTestJava (Thread[Execution worker for ':' Thread 6,5,main]) started.

> Task :integrationtest:compileTestJava UP-TO-DATE
Caching disabled for task ':integrationtest:compileTestJava' because:
  Build cache is disabled
Skipping task ':integrationtest:compileTestJava' as it is up-to-date.
:integrationtest:compileTestJava (Thread[Execution worker for ':' Thread 6,5,main]) completed. Took 0.104 secs.
:integrationtest:processTestResources (Thread[Execution worker for ':' Thread 6,5,main]) started.

> Task :integrationtest:processTestResources NO-SOURCE
file or directory '<https://ci-builds.apache.org/job/POI/job/POI-DSL-SonarQube-Gradle/ws/build/integrationtest/src/test/resources',> not found
Skipping task ':integrationtest:processTestResources' as it has no source files and no previous output files.
:integrationtest:processTestResources (Thread[Execution worker for ':' Thread 6,5,main]) completed. Took 0.001 secs.
:integrationtest:testClasses (Thread[Execution worker for ':' Thread 6,5,main]) started.

> Task :integrationtest:testClasses UP-TO-DATE
Skipping task ':integrationtest:testClasses' as it has no actions.
:integrationtest:testClasses (Thread[Execution worker for ':' Thread 6,5,main]) completed. Took 0.0 secs.
:integrationtest:test (Thread[Execution worker for ':' Thread 6,5,main]) started.

> Task :integrationtest:test UP-TO-DATE
Caching disabled for task ':integrationtest:test' because:
  Build cache is disabled
Skipping task ':integrationtest:test' as it is up-to-date.
:integrationtest:test (Thread[Execution worker for ':' Thread 6,5,main]) completed. Took 0.038 secs.
:main:test (Thread[Execution worker for ':' Thread 6,5,main]) started.

> Task :main:test UP-TO-DATE
Caching disabled for task ':main:test' because:
  Build cache is disabled
Skipping task ':main:test' as it is up-to-date.
:main:test (Thread[Execution worker for ':' Thread 6,5,main]) completed. Took 0.088 secs.
:ooxml:test (Thread[Execution worker for ':' Thread 6,5,main]) started.

> Task :ooxml:test UP-TO-DATE
Caching disabled for task ':ooxml:test' because:
  Build cache is disabled
Skipping task ':ooxml:test' as it is up-to-date.
:ooxml:test (Thread[Execution worker for ':' Thread 6,5,main]) completed. Took 0.051 secs.
:scratchpad:compileTestJava (Thread[Execution worker for ':' Thread 6,5,main]) started.

> Task :scratchpad:compileTestJava UP-TO-DATE
Caching disabled for task ':scratchpad:compileTestJava' because:
  Build cache is disabled
Skipping task ':scratchpad:compileTestJava' as it is up-to-date.
:scratchpad:compileTestJava (Thread[Execution worker for ':' Thread 6,5,main]) completed. Took 0.083 secs.
:scratchpad:processTestResources (Thread[Execution worker for ':' Thread 6,5,main]) started.

> Task :scratchpad:processTestResources NO-SOURCE
file or directory '<https://ci-builds.apache.org/job/POI/job/POI-DSL-SonarQube-Gradle/ws/build/scratchpad/src/test/resources',> not found
Skipping task ':scratchpad:processTestResources' as it has no source files and no previous output files.
:scratchpad:processTestResources (Thread[Execution worker for ':' Thread 6,5,main]) completed. Took 0.001 secs.
:scratchpad:testClasses (Thread[Execution worker for ':' Thread 6,5,main]) started.

> Task :scratchpad:testClasses UP-TO-DATE
Skipping task ':scratchpad:testClasses' as it has no actions.
:scratchpad:testClasses (Thread[Execution worker for ':' Thread 6,5,main]) completed. Took 0.0 secs.
:scratchpad:test (Thread[Execution worker for ':' Thread 6,5,main]) started.

> Task :scratchpad:test UP-TO-DATE
Caching disabled for task ':scratchpad:test' because:
  Build cache is disabled
Skipping task ':scratchpad:test' as it is up-to-date.
:scratchpad:test (Thread[Execution worker for ':' Thread 6,5,main]) completed. Took 0.045 secs.
:sonarqube (Thread[Execution worker for ':' Thread 6,5,main]) started.

> Task :sonarqube
JaCoCo report task detected, but XML report is not enabled or it was not produced. Coverage for this task will not be reported.
JaCoCo report task detected, but XML report is not enabled or it was not produced. Coverage for this task will not be reported.
JaCoCo report task detected, but XML report is not enabled or it was not produced. Coverage for this task will not be reported.
JaCoCo report task detected, but XML report is not enabled or it was not produced. Coverage for this task will not be reported.
JaCoCo report task detected, but XML report is not enabled or it was not produced. Coverage for this task will not be reported.
JaCoCo report task detected, but XML report is not enabled or it was not produced. Coverage for this task will not be reported.
Caching disabled for task ':sonarqube' because:
  Build cache is disabled
Task ':sonarqube' is not up-to-date because:
  Task has not declared any outputs despite executing actions.
JaCoCo report task detected, but XML report is not enabled or it was not produced. Coverage for this task will not be reported.
JaCoCo report task detected, but XML report is not enabled or it was not produced. Coverage for this task will not be reported.
JaCoCo report task detected, but XML report is not enabled or it was not produced. Coverage for this task will not be reported.
JaCoCo report task detected, but XML report is not enabled or it was not produced. Coverage for this task will not be reported.
JaCoCo report task detected, but XML report is not enabled or it was not produced. Coverage for this task will not be reported.
JaCoCo report task detected, but XML report is not enabled or it was not produced. Coverage for this task will not be reported.
User cache: /home/jenkins/.sonar/cache
Default locale: "en_US", source code encoding: "UTF-8" (analysis is platform dependent)
Load global settings
Load global settings (done) | time=1212ms
Server id: 1BD809FA-AWHW8ct9-T_TB3XqouNu
User cache: /home/jenkins/.sonar/cache
Load/download plugins
Load plugins index
Load plugins index (done) | time=224ms
Load/download plugins (done) | time=367ms
Loaded core extensions: developer-scanner
JavaScript/TypeScript frontend is enabled
The version of Java (1.8.0_252) you have used to run this analysis is deprecated and we will stop accepting it from October 2020. Please update to at least Java 11.
Process project properties

> Task :sonarqube FAILED
:sonarqube (Thread[Execution worker for ':' Thread 6,5,main]) completed. Took 4.625 secs.

FAILURE: Build failed with an exception.

* What went wrong:
Execution failed for task ':sonarqube'.
> You must define the following mandatory properties for 'poi': sonar.organization

* Try:
Run with --stacktrace option to get the stack trace. Run with --debug option to get more log output. Run with --scan to get full insights.

* Get more help at https://help.gradle.org

BUILD FAILED in 15s
32 actionable tasks: 8 executed, 24 up-to-date
Build step 'Invoke Gradle script' changed build result to FAILURE
Build step 'Invoke Gradle script' marked build as failure
WARN: Unable to locate 'report-task.txt' in the workspace. Did the SonarScanner succeed?

---------------------------------------------------------------------
To unsubscribe, e-mail: [hidden email]
For additional commands, e-mail: [hidden email]

Reply | Threaded
Open this post in threaded view
|

Build failed in Jenkins: POI » POI-DSL-SonarQube-Gradle #6

Apache Jenkins Server
See <https://ci-builds.apache.org/job/POI/job/POI-DSL-SonarQube-Gradle/6/display/redirect>

Changes:


------------------------------------------
[...truncated 36.17 KB...]

> Task :examples:compileTestJava NO-SOURCE
file or directory '<https://ci-builds.apache.org/job/POI/job/POI-DSL-SonarQube-Gradle/ws/build/examples/src/test/java',> not found
Skipping task ':examples:compileTestJava' as it has no source files and no previous output files.
:examples:compileTestJava (Thread[Execution worker for ':',5,main]) completed. Took 0.001 secs.
:examples:processTestResources (Thread[Execution worker for ':',5,main]) started.

> Task :examples:processTestResources NO-SOURCE
file or directory '<https://ci-builds.apache.org/job/POI/job/POI-DSL-SonarQube-Gradle/ws/build/examples/src/test/resources',> not found
Skipping task ':examples:processTestResources' as it has no source files and no previous output files.
:examples:processTestResources (Thread[Execution worker for ':',5,main]) completed. Took 0.001 secs.
:examples:testClasses (Thread[Execution worker for ':',5,main]) started.

> Task :examples:testClasses UP-TO-DATE
Skipping task ':examples:testClasses' as it has no actions.
:examples:testClasses (Thread[Execution worker for ':',5,main]) completed. Took 0.0 secs.
:examples:test (Thread[Execution worker for ':',5,main]) started.

> Task :examples:test NO-SOURCE
Skipping task ':examples:test' as it has no source files and no previous output files.
:examples:test (Thread[Execution worker for ':',5,main]) completed. Took 0.002 secs.
:excelant:compileJava (Thread[Execution worker for ':',5,main]) started.

> Task :excelant:compileJava UP-TO-DATE
Caching disabled for task ':excelant:compileJava' because:
  Build cache is disabled
Skipping task ':excelant:compileJava' as it is up-to-date.
:excelant:compileJava (Thread[Execution worker for ':',5,main]) completed. Took 0.039 secs.
:excelant:processResources (Thread[Execution worker for ':',5,main]) started.

> Task :excelant:processResources UP-TO-DATE
Caching disabled for task ':excelant:processResources' because:
  Build cache is disabled
Skipping task ':excelant:processResources' as it is up-to-date.
:excelant:processResources (Thread[Execution worker for ':',5,main]) completed. Took 0.005 secs.
:excelant:classes (Thread[Execution worker for ':',5,main]) started.

> Task :excelant:classes UP-TO-DATE
Skipping task ':excelant:classes' as it has no actions.
:excelant:classes (Thread[Execution worker for ':',5,main]) completed. Took 0.0 secs.
:main:compileTestJava (Thread[Execution worker for ':',5,main]) started.

> Task :main:compileTestJava UP-TO-DATE
Caching disabled for task ':main:compileTestJava' because:
  Build cache is disabled
Skipping task ':main:compileTestJava' as it is up-to-date.
:main:compileTestJava (Thread[Execution worker for ':',5,main]) completed. Took 0.226 secs.
:main:processTestResources (Thread[Execution worker for ':',5,main]) started.

> Task :main:processTestResources NO-SOURCE
file or directory '<https://ci-builds.apache.org/job/POI/job/POI-DSL-SonarQube-Gradle/ws/build/main/src/test/resources',> not found
Skipping task ':main:processTestResources' as it has no source files and no previous output files.
:main:processTestResources (Thread[Execution worker for ':',5,main]) completed. Took 0.001 secs.
:main:testClasses (Thread[Execution worker for ':',5,main]) started.

> Task :main:testClasses UP-TO-DATE
Skipping task ':main:testClasses' as it has no actions.
:main:testClasses (Thread[Execution worker for ':',5,main]) completed. Took 0.0 secs.
:main:testJar (Thread[Execution worker for ':',5,main]) started.

> Task :main:testJar UP-TO-DATE
Caching disabled for task ':main:testJar' because:
  Build cache is disabled
Skipping task ':main:testJar' as it is up-to-date.
:main:testJar (Thread[Execution worker for ':',5,main]) completed. Took 0.006 secs.
:excelant:compileTestJava (Thread[Execution worker for ':',5,main]) started.

> Task :excelant:compileTestJava UP-TO-DATE
Caching disabled for task ':excelant:compileTestJava' because:
  Build cache is disabled
Skipping task ':excelant:compileTestJava' as it is up-to-date.
:excelant:compileTestJava (Thread[Execution worker for ':',5,main]) completed. Took 0.039 secs.
:excelant:processTestResources (Thread[Execution worker for ':',5,main]) started.

> Task :excelant:processTestResources NO-SOURCE
file or directory '<https://ci-builds.apache.org/job/POI/job/POI-DSL-SonarQube-Gradle/ws/build/excelant/src/test/resources',> not found
Skipping task ':excelant:processTestResources' as it has no source files and no previous output files.
:excelant:processTestResources (Thread[Execution worker for ':',5,main]) completed. Took 0.001 secs.
:excelant:testClasses (Thread[Execution worker for ':',5,main]) started.

> Task :excelant:testClasses UP-TO-DATE
Skipping task ':excelant:testClasses' as it has no actions.
:excelant:testClasses (Thread[Execution worker for ':',5,main]) completed. Took 0.0 secs.
:excelant:test (Thread[Execution worker for ':',5,main]) started.

> Task :excelant:test UP-TO-DATE
Caching disabled for task ':excelant:test' because:
  Build cache is disabled
Skipping task ':excelant:test' as it is up-to-date.
:excelant:test (Thread[Execution worker for ':',5,main]) completed. Took 0.059 secs.
:examples:jar (Thread[Execution worker for ':',5,main]) started.

> Task :examples:jar UP-TO-DATE
Caching disabled for task ':examples:jar' because:
  Build cache is disabled
Skipping task ':examples:jar' as it is up-to-date.
:examples:jar (Thread[Execution worker for ':',5,main]) completed. Took 0.005 secs.
:integrationtest:compileJava (Thread[Execution worker for ':',5,main]) started.

> Task :integrationtest:compileJava NO-SOURCE
file or directory '<https://ci-builds.apache.org/job/POI/job/POI-DSL-SonarQube-Gradle/ws/build/integrationtest/src/main/java',> not found
Skipping task ':integrationtest:compileJava' as it has no source files and no previous output files.
:integrationtest:compileJava (Thread[Execution worker for ':',5,main]) completed. Took 0.002 secs.
:integrationtest:processResources (Thread[Execution worker for ':',5,main]) started.

> Task :integrationtest:processResources NO-SOURCE
file or directory '<https://ci-builds.apache.org/job/POI/job/POI-DSL-SonarQube-Gradle/ws/build/integrationtest/src/main/resources',> not found
Skipping task ':integrationtest:processResources' as it has no source files and no previous output files.
:integrationtest:processResources (Thread[Execution worker for ':',5,main]) completed. Took 0.0 secs.
:integrationtest:classes (Thread[Execution worker for ':',5,main]) started.

> Task :integrationtest:classes UP-TO-DATE
Skipping task ':integrationtest:classes' as it has no actions.
:integrationtest:classes (Thread[Execution worker for ':',5,main]) completed. Took 0.0 secs.
:ooxml:compileTestJava (Thread[Execution worker for ':',5,main]) started.

> Task :ooxml:compileTestJava UP-TO-DATE
Caching disabled for task ':ooxml:compileTestJava' because:
  Build cache is disabled
Skipping task ':ooxml:compileTestJava' as it is up-to-date.
:ooxml:compileTestJava (Thread[Execution worker for ':',5,main]) completed. Took 0.143 secs.
:ooxml:processTestResources (Thread[Execution worker for ':',5,main]) started.

> Task :ooxml:processTestResources NO-SOURCE
file or directory '<https://ci-builds.apache.org/job/POI/job/POI-DSL-SonarQube-Gradle/ws/build/ooxml/src/test/resources',> not found
Skipping task ':ooxml:processTestResources' as it has no source files and no previous output files.
:ooxml:processTestResources (Thread[Execution worker for ':',5,main]) completed. Took 0.002 secs.
:ooxml:testClasses (Thread[Execution worker for ':',5,main]) started.

> Task :ooxml:testClasses UP-TO-DATE
Skipping task ':ooxml:testClasses' as it has no actions.
:ooxml:testClasses (Thread[Execution worker for ':',5,main]) completed. Took 0.0 secs.
:integrationtest:compileTestJava (Thread[Execution worker for ':',5,main]) started.

> Task :integrationtest:compileTestJava UP-TO-DATE
Caching disabled for task ':integrationtest:compileTestJava' because:
  Build cache is disabled
Skipping task ':integrationtest:compileTestJava' as it is up-to-date.
:integrationtest:compileTestJava (Thread[Execution worker for ':',5,main]) completed. Took 0.104 secs.
:integrationtest:processTestResources (Thread[Execution worker for ':',5,main]) started.

> Task :integrationtest:processTestResources NO-SOURCE
file or directory '<https://ci-builds.apache.org/job/POI/job/POI-DSL-SonarQube-Gradle/ws/build/integrationtest/src/test/resources',> not found
Skipping task ':integrationtest:processTestResources' as it has no source files and no previous output files.
:integrationtest:processTestResources (Thread[Execution worker for ':',5,main]) completed. Took 0.001 secs.
:integrationtest:testClasses (Thread[Execution worker for ':',5,main]) started.

> Task :integrationtest:testClasses UP-TO-DATE
Skipping task ':integrationtest:testClasses' as it has no actions.
:integrationtest:testClasses (Thread[Execution worker for ':',5,main]) completed. Took 0.0 secs.
:integrationtest:test (Thread[Execution worker for ':',5,main]) started.

> Task :integrationtest:test UP-TO-DATE
Caching disabled for task ':integrationtest:test' because:
  Build cache is disabled
Skipping task ':integrationtest:test' as it is up-to-date.
:integrationtest:test (Thread[Execution worker for ':',5,main]) completed. Took 0.039 secs.
:main:test (Thread[Execution worker for ':',5,main]) started.

> Task :main:test UP-TO-DATE
Caching disabled for task ':main:test' because:
  Build cache is disabled
Skipping task ':main:test' as it is up-to-date.
:main:test (Thread[Execution worker for ':',5,main]) completed. Took 0.099 secs.
:ooxml:test (Thread[Execution worker for ':',5,main]) started.

> Task :ooxml:test UP-TO-DATE
Caching disabled for task ':ooxml:test' because:
  Build cache is disabled
Skipping task ':ooxml:test' as it is up-to-date.
:ooxml:test (Thread[Execution worker for ':',5,main]) completed. Took 0.061 secs.
:scratchpad:compileTestJava (Thread[Execution worker for ':',5,main]) started.

> Task :scratchpad:compileTestJava UP-TO-DATE
Caching disabled for task ':scratchpad:compileTestJava' because:
  Build cache is disabled
Skipping task ':scratchpad:compileTestJava' as it is up-to-date.
:scratchpad:compileTestJava (Thread[Execution worker for ':',5,main]) completed. Took 0.09 secs.
:scratchpad:processTestResources (Thread[Execution worker for ':',5,main]) started.

> Task :scratchpad:processTestResources NO-SOURCE
file or directory '<https://ci-builds.apache.org/job/POI/job/POI-DSL-SonarQube-Gradle/ws/build/scratchpad/src/test/resources',> not found
Skipping task ':scratchpad:processTestResources' as it has no source files and no previous output files.
:scratchpad:processTestResources (Thread[Execution worker for ':',5,main]) completed. Took 0.001 secs.
:scratchpad:testClasses (Thread[Execution worker for ':',5,main]) started.

> Task :scratchpad:testClasses UP-TO-DATE
Skipping task ':scratchpad:testClasses' as it has no actions.
:scratchpad:testClasses (Thread[Execution worker for ':',5,main]) completed. Took 0.0 secs.
:scratchpad:test (Thread[Execution worker for ':',5,main]) started.

> Task :scratchpad:test UP-TO-DATE
Caching disabled for task ':scratchpad:test' because:
  Build cache is disabled
Skipping task ':scratchpad:test' as it is up-to-date.
:scratchpad:test (Thread[Execution worker for ':',5,main]) completed. Took 0.047 secs.
:sonarqube (Thread[Execution worker for ':',5,main]) started.

> Task :sonarqube
JaCoCo report task detected, but XML report is not enabled or it was not produced. Coverage for this task will not be reported.
JaCoCo report task detected, but XML report is not enabled or it was not produced. Coverage for this task will not be reported.
JaCoCo report task detected, but XML report is not enabled or it was not produced. Coverage for this task will not be reported.
JaCoCo report task detected, but XML report is not enabled or it was not produced. Coverage for this task will not be reported.
JaCoCo report task detected, but XML report is not enabled or it was not produced. Coverage for this task will not be reported.
JaCoCo report task detected, but XML report is not enabled or it was not produced. Coverage for this task will not be reported.
Caching disabled for task ':sonarqube' because:
  Build cache is disabled
Task ':sonarqube' is not up-to-date because:
  Task has not declared any outputs despite executing actions.
JaCoCo report task detected, but XML report is not enabled or it was not produced. Coverage for this task will not be reported.
JaCoCo report task detected, but XML report is not enabled or it was not produced. Coverage for this task will not be reported.
JaCoCo report task detected, but XML report is not enabled or it was not produced. Coverage for this task will not be reported.
JaCoCo report task detected, but XML report is not enabled or it was not produced. Coverage for this task will not be reported.
JaCoCo report task detected, but XML report is not enabled or it was not produced. Coverage for this task will not be reported.
JaCoCo report task detected, but XML report is not enabled or it was not produced. Coverage for this task will not be reported.
User cache: /home/jenkins/.sonar/cache
Default locale: "en_US", source code encoding: "UTF-8" (analysis is platform dependent)
Load global settings
Load global settings (done) | time=1230ms
Server id: 1BD809FA-AWHW8ct9-T_TB3XqouNu
User cache: /home/jenkins/.sonar/cache
Load/download plugins
Load plugins index
Load plugins index (done) | time=227ms
Load/download plugins (done) | time=358ms
Loaded core extensions: developer-scanner
JavaScript/TypeScript frontend is enabled
The version of Java (1.8.0_252) you have used to run this analysis is deprecated and we will stop accepting it from October 2020. Please update to at least Java 11.
Process project properties

> Task :sonarqube FAILED
:sonarqube (Thread[Execution worker for ':',5,main]) completed. Took 4.581 secs.

FAILURE: Build failed with an exception.

* What went wrong:
Execution failed for task ':sonarqube'.
> You must define the following mandatory properties for 'poi': sonar.organization

* Try:
Run with --stacktrace option to get the stack trace. Run with --debug option to get more log output. Run with --scan to get full insights.

* Get more help at https://help.gradle.org

BUILD FAILED in 15s
32 actionable tasks: 8 executed, 24 up-to-date
Build step 'Invoke Gradle script' changed build result to FAILURE
Build step 'Invoke Gradle script' marked build as failure
WARN: Unable to locate 'report-task.txt' in the workspace. Did the SonarScanner succeed?

---------------------------------------------------------------------
To unsubscribe, e-mail: [hidden email]
For additional commands, e-mail: [hidden email]

Reply | Threaded
Open this post in threaded view
|

Jenkins build is back to normal : POI » POI-DSL-SonarQube-Gradle #7

Apache Jenkins Server
See <https://ci-builds.apache.org/job/POI/job/POI-DSL-SonarQube-Gradle/7/display/redirect>


---------------------------------------------------------------------
To unsubscribe, e-mail: [hidden email]
For additional commands, e-mail: [hidden email]