Build failed in Jenkins: POI » POI-DSL-OpenJDK #27

classic Classic list List threaded Threaded
3 messages Options
Reply | Threaded
Open this post in threaded view
|

Build failed in Jenkins: POI » POI-DSL-OpenJDK #27

Apache Jenkins Server
See <https://ci-builds.apache.org/job/POI/job/POI-DSL-OpenJDK/27/display/redirect?page=changes>

Changes:

[Nick Burch] Test PPT file containing a XLSX via an OLE2 intermediate layer, from Apache Tika

[Nick Burch] Add unit test for XLSX embedded in PPT and WorkbookFactory, was already fixed


------------------------------------------
[...truncated 514.11 KB...]
    [junit] Running org.apache.poi.poifs.crypt.dsig.TestSignatureInfo
    [junit] Tests run: 15, Failures: 0, Errors: 0, Skipped: 1, Time elapsed: 9.035 sec
    [junit] Running org.apache.poi.poifs.crypt.tests.TestAgileEncryptionParameters
    [junit] Tests run: 60, Failures: 0, Errors: 0, Skipped: 0, Time elapsed: 12.112 sec
    [junit] Running org.apache.poi.poifs.crypt.tests.TestDecryptor
    [junit] Tests run: 7, Failures: 0, Errors: 0, Skipped: 0, Time elapsed: 0.368 sec
    [junit] Running org.apache.poi.poifs.crypt.tests.TestEncryptionInfo
    [junit] Tests run: 2, Failures: 0, Errors: 0, Skipped: 0, Time elapsed: 0.004 sec
    [junit] Running org.apache.poi.poifs.crypt.tests.TestEncryptor
    [junit] Tests run: 8, Failures: 0, Errors: 0, Skipped: 1, Time elapsed: 14.203 sec
    [junit] Running org.apache.poi.poifs.crypt.tests.TestHxxFEncryption
    [junit] Tests run: 20, Failures: 0, Errors: 0, Skipped: 0, Time elapsed: 0.739 sec
    [junit] Running org.apache.poi.poifs.crypt.tests.TestSecureTempZip
    [junit] Tests run: 2, Failures: 0, Errors: 0, Skipped: 0, Time elapsed: 0.219 sec
    [junit] Running org.apache.poi.sl.tests.TestFonts
    [junit] Tests run: 2, Failures: 0, Errors: 0, Skipped: 0, Time elapsed: 0.378 sec
    [junit] Running org.apache.poi.sl.tests.TestHeadersFooters
    [junit] Tests run: 1, Failures: 0, Errors: 0, Skipped: 0, Time elapsed: 0.025 sec
    [junit] Running org.apache.poi.sl.tests.TestOleShape
    [junit] Tests run: 6, Failures: 0, Errors: 0, Skipped: 0, Time elapsed: 0.273 sec
    [junit] Running org.apache.poi.sl.tests.TestSlide
    [junit] Tests run: 2, Failures: 0, Errors: 0, Skipped: 0, Time elapsed: 0.07 sec
    [junit] Running org.apache.poi.sl.tests.TestTable
    [junit] Tests run: 4, Failures: 0, Errors: 0, Skipped: 0, Time elapsed: 0.141 sec
    [junit] Running org.apache.poi.sl.tests.draw.TestDrawPictureShape
    [junit] Tests run: 2, Failures: 0, Errors: 0, Skipped: 0, Time elapsed: 0.063 sec
    [junit] Running org.apache.poi.ss.tests.TestWorkbookFactory
    [junit] Tests run: 12, Failures: 0, Errors: 0, Skipped: 0, Time elapsed: 0.966 sec
    [junit] Running org.apache.poi.ss.tests.extractor.TestEmbeddedExtractor
    [junit] Tests run: 3, Failures: 0, Errors: 0, Skipped: 0, Time elapsed: 0.257 sec
    [junit] Running org.apache.poi.ss.tests.format.TestCellFormatPart
    [junit] Tests run: 7, Failures: 0, Errors: 0, Skipped: 0, Time elapsed: 0.5 sec
    [junit] Running org.apache.poi.ss.tests.formula.TestFormulaParser
    [junit] Tests run: 9, Failures: 0, Errors: 0, Skipped: 0, Time elapsed: 0.134 sec
    [junit] Running org.apache.poi.ss.tests.formula.TestStructuredReferences
    [junit] Tests run: 2, Failures: 0, Errors: 0, Skipped: 0, Time elapsed: 0.199 sec
    [junit] Running org.apache.poi.ss.tests.formula.eval.TestXSSFCircularReferences
    [junit] Tests run: 4, Failures: 0, Errors: 0, Skipped: 0, Time elapsed: 0.04 sec
    [junit] Running org.apache.poi.ss.tests.formula.functions.TestProper
    [junit] Tests run: 4, Failures: 0, Errors: 0, Skipped: 0, Time elapsed: 1.584 sec
    [junit] Running org.apache.poi.ss.tests.formula.functions.TestSumifsXSSF
    [junit] Tests run: 1, Failures: 0, Errors: 0, Skipped: 0, Time elapsed: 0.023 sec
    [junit] Running org.apache.poi.ss.tests.formula.functions.TestVlookup
    [junit] Tests run: 6, Failures: 0, Errors: 0, Skipped: 0, Time elapsed: 37.24 sec
    [junit] Running org.apache.poi.ss.tests.usermodel.TestEmbedOLEPackage
    [junit] Tests run: 3, Failures: 0, Errors: 0, Skipped: 0, Time elapsed: 0.14 sec
    [junit] Running org.apache.poi.ss.tests.usermodel.TestXSSFBorderStyle
    [junit] Tests run: 1, Failures: 0, Errors: 0, Skipped: 0, Time elapsed: 0.01 sec
    [junit] Running org.apache.poi.ss.tests.usermodel.TestXSSFRangeCopier
    [junit] Tests run: 9, Failures: 0, Errors: 0, Skipped: 0, Time elapsed: 0.119 sec
    [junit] Running org.apache.poi.ss.tests.util.TestSXSSFCellUtil
    [junit] Tests run: 14, Failures: 0, Errors: 0, Skipped: 0, Time elapsed: 0.15 sec
    [junit] Running org.apache.poi.ss.tests.util.TestXSSFCellUtil
    [junit] Tests run: 14, Failures: 0, Errors: 0, Skipped: 0, Time elapsed: 0.114 sec
    [junit] Running org.apache.poi.ss.tests.util.TestXSSFPropertyTemplate
    [junit] Tests run: 2, Failures: 0, Errors: 0, Skipped: 0, Time elapsed: 0.031 sec
    [junit] Running org.apache.poi.util.tests.TestIdentifierManager
    [junit] Tests run: 5, Failures: 0, Errors: 0, Skipped: 0, Time elapsed: 0.029 sec
    [junit] Running org.apache.poi.util.tests.TestTempFileThreaded
    [junit] Tests run: 1, Failures: 0, Errors: 0, Skipped: 0, Time elapsed: 9.094 sec
    [junit] Running org.apache.poi.xddf.usermodel.TestNecessaryOOXMLClasses
    [junit] Tests run: 1, Failures: 0, Errors: 0, Skipped: 0, Time elapsed: 0.141 sec
    [junit] Running org.apache.poi.xddf.usermodel.TestXDDFColor
    [junit] Tests run: 5, Failures: 0, Errors: 0, Skipped: 0, Time elapsed: 0.081 sec
    [junit] Running org.apache.poi.xddf.usermodel.chart.TestXDDFChart
    [junit] Tests run: 2, Failures: 0, Errors: 0, Skipped: 0, Time elapsed: 0.034 sec
    [junit] Running org.apache.poi.xddf.usermodel.chart.TestXDDFChartExtensionList
    [junit] Tests run: 1, Failures: 0, Errors: 0, Skipped: 0, Time elapsed: 0.005 sec
    [junit] Running org.apache.poi.xddf.usermodel.chart.TestXDDFChartRemoveSeries
    [junit] Tests run: 4, Failures: 0, Errors: 0, Skipped: 0, Time elapsed: 0.107 sec
    [junit] Running org.apache.poi.xddf.usermodel.chart.TestXDDFDataSourcesFactory
    [junit] Tests run: 6, Failures: 0, Errors: 0, Skipped: 0, Time elapsed: 0.045 sec
    [junit] Running org.apache.poi.xddf.usermodel.text.TestXDDFTextBodyProperties
    [junit] Tests run: 1, Failures: 0, Errors: 0, Skipped: 0, Time elapsed: 0.011 sec
    [junit] Running org.apache.poi.xddf.usermodel.text.TestXDDFTextRun
    [junit] Tests run: 3, Failures: 0, Errors: 0, Skipped: 0, Time elapsed: 0.086 sec
    [junit] Running org.apache.poi.xdgf.extractor.TestXDGFVisioExtractor
    [junit] Tests run: 3, Failures: 0, Errors: 0, Skipped: 0, Time elapsed: 0.265 sec
    [junit] Running org.apache.poi.xslf.TestNecessaryOOXMLClasses
    [junit] Tests run: 1, Failures: 0, Errors: 0, Skipped: 0, Time elapsed: 0.005 sec
    [junit] Running org.apache.poi.xslf.TestXSLFBugs
    [junit] Tests run: 31, Failures: 0, Errors: 0, Skipped: 2, Time elapsed: 2.001 sec
    [junit] Running org.apache.poi.xslf.TestXSLFSlideShow
    [junit] Tests run: 5, Failures: 0, Errors: 0, Skipped: 0, Time elapsed: 0.081 sec
    [junit] Running org.apache.poi.xslf.extractor.TestXSLFPowerPointExtractor
    [junit] Tests run: 8, Failures: 0, Errors: 0, Skipped: 0, Time elapsed: 0.545 sec
    [junit] Running org.apache.poi.xslf.usermodel.TestPPTX2PNG
    [junit] Tests run: 20, Failures: 0, Errors: 0, Skipped: 0, Time elapsed: 23.841 sec
    [junit] Running org.apache.poi.xslf.usermodel.TestXMLSlideShow
    [junit] Tests run: 12, Failures: 0, Errors: 0, Skipped: 0, Time elapsed: 0.378 sec
    [junit] Running org.apache.poi.xslf.usermodel.TestXSLFAutoShape
    [junit] Tests run: 4, Failures: 0, Errors: 0, Skipped: 0, Time elapsed: 0.08 sec
    [junit] Running org.apache.poi.xslf.usermodel.TestXSLFBackground
    [junit] Tests run: 4, Failures: 0, Errors: 0, Skipped: 0, Time elapsed: 0.168 sec
    [junit] Running org.apache.poi.xslf.usermodel.TestXSLFChart
    [junit] Tests run: 5, Failures: 0, Errors: 0, Skipped: 0, Time elapsed: 0.213 sec
    [junit] Running org.apache.poi.xslf.usermodel.TestXSLFColor
    [junit] Tests run: 6, Failures: 0, Errors: 0, Skipped: 0, Time elapsed: 0.074 sec
    [junit] Running org.apache.poi.xslf.usermodel.TestXSLFConnectorShape
    [junit] Tests run: 2, Failures: 0, Errors: 0, Skipped: 0, Time elapsed: 0.042 sec
    [junit] Running org.apache.poi.xslf.usermodel.TestXSLFFreeformShape
    [junit] Tests run: 2, Failures: 0, Errors: 0, Skipped: 0, Time elapsed: 0.072 sec
    [junit] Running org.apache.poi.xslf.usermodel.TestXSLFGroupShape
    [junit] Tests run: 2, Failures: 0, Errors: 0, Skipped: 0, Time elapsed: 0.039 sec
    [junit] Running org.apache.poi.xslf.usermodel.TestXSLFHyperlink
    [junit] Tests run: 3, Failures: 0, Errors: 0, Skipped: 0, Time elapsed: 0.091 sec
    [junit] Running org.apache.poi.xslf.usermodel.TestXSLFNotes
    [junit] Tests run: 3, Failures: 0, Errors: 0, Skipped: 0, Time elapsed: 0.077 sec
    [junit] Running org.apache.poi.xslf.usermodel.TestXSLFPictureShape
    [junit] Tests run: 7, Failures: 0, Errors: 0, Skipped: 0, Time elapsed: 1.256 sec
    [junit] Running org.apache.poi.xslf.usermodel.TestXSLFShape
    [junit] Tests run: 3, Failures: 0, Errors: 0, Skipped: 0, Time elapsed: 0.087 sec
    [junit] Running org.apache.poi.xslf.usermodel.TestXSLFShapeContainer
    [junit] Tests run: 1, Failures: 0, Errors: 0, Skipped: 0, Time elapsed: 0.02 sec
    [junit] Running org.apache.poi.xslf.usermodel.TestXSLFSheet
    [junit] Tests run: 1, Failures: 0, Errors: 0, Skipped: 0, Time elapsed: 0.055 sec
    [junit] Running org.apache.poi.xslf.usermodel.TestXSLFSimpleShape
    [junit] Tests run: 7, Failures: 0, Errors: 0, Skipped: 0, Time elapsed: 1.73 sec
    [junit] Running org.apache.poi.xslf.usermodel.TestXSLFSlide
    [junit] Tests run: 5, Failures: 0, Errors: 0, Skipped: 0, Time elapsed: 0.594 sec
    [junit] Running org.apache.poi.xslf.usermodel.TestXSLFSlideShow
    [junit] Tests run: 6, Failures: 0, Errors: 0, Skipped: 0, Time elapsed: 0.157 sec
    [junit] Running org.apache.poi.xslf.usermodel.TestXSLFSlideShowFactory
    [junit] Tests run: 6, Failures: 0, Errors: 0, Skipped: 0, Time elapsed: 0.509 sec
    [junit] Running org.apache.poi.xslf.usermodel.TestXSLFTable
    [junit] Tests run: 6, Failures: 0, Errors: 0, Skipped: 0, Time elapsed: 1.791 sec
    [junit] Running org.apache.poi.xslf.usermodel.TestXSLFTableRow
    [junit] Tests run: 8, Failures: 0, Errors: 0, Skipped: 0, Time elapsed: 0.179 sec
    [junit] Running org.apache.poi.xslf.usermodel.TestXSLFTableStyles
    [junit] Tests run: 1, Failures: 0, Errors: 0, Skipped: 0, Time elapsed: 0.015 sec
    [junit] Running org.apache.poi.xslf.usermodel.TestXSLFTextBox
    [junit] Tests run: 2, Failures: 0, Errors: 0, Skipped: 0, Time elapsed: 0.041 sec
    [junit] Running org.apache.poi.xslf.usermodel.TestXSLFTextParagraph
    [junit] Tests run: 5, Failures: 0, Errors: 0, Skipped: 1, Time elapsed: 0.078 sec
    [junit] Running org.apache.poi.xslf.usermodel.TestXSLFTextRun
    [junit] Tests run: 4, Failures: 0, Errors: 0, Skipped: 0, Time elapsed: 0.068 sec
    [junit] Running org.apache.poi.xslf.usermodel.TestXSLFTextShape
    [junit] Tests run: 4, Failures: 0, Errors: 0, Skipped: 0, Time elapsed: 0.08 sec
    [junit] Running org.apache.poi.xslf.usermodel.TestXSLFTheme
    [junit] Tests run: 1, Failures: 0, Errors: 0, Skipped: 0, Time elapsed: 0.114 sec
    [junit] Running org.apache.poi.xssf.TestNecessaryOOXMLClasses
    [junit] Tests run: 1, Failures: 0, Errors: 0, Skipped: 0, Time elapsed: 0.002 sec
    [junit] Running org.apache.poi.xssf.TestSheetProtection
    [junit] Tests run: 17, Failures: 0, Errors: 0, Skipped: 0, Time elapsed: 0.139 sec
    [junit] Running org.apache.poi.xssf.TestWorkbookProtection
    [junit] Tests run: 8, Failures: 0, Errors: 0, Skipped: 0, Time elapsed: 0.444 sec
    [junit] Running org.apache.poi.xssf.TestXSSFCloneSheet
    [junit] Tests run: 8, Failures: 0, Errors: 0, Skipped: 0, Time elapsed: 0.179 sec
    [junit] Running org.apache.poi.xssf.TestXSSFOffset
    [junit] Tests run: 1, Failures: 0, Errors: 0, Skipped: 0, Time elapsed: 0.007 sec
    [junit] Running org.apache.poi.xssf.binary.TestXSSFBSharedStringsTable
    [junit] Tests run: 1, Failures: 0, Errors: 0, Skipped: 0, Time elapsed: 0.003 sec
    [junit] Running org.apache.poi.xssf.binary.TestXSSFBSheetHyperlinkManager
    [junit] Tests run: 1, Failures: 0, Errors: 0, Skipped: 0, Time elapsed: 0.015 sec
    [junit] Running org.apache.poi.xssf.eventusermodel.TestReadOnlySharedStringsTable
    [junit] Tests run: 4, Failures: 0, Errors: 0, Skipped: 0, Time elapsed: 0.03 sec
    [junit] Running org.apache.poi.xssf.eventusermodel.TestXSSFBReader
    [junit] Tests run: 4, Failures: 0, Errors: 0, Skipped: 0, Time elapsed: 0.033 sec
    [junit] Running org.apache.poi.xssf.eventusermodel.TestXSSFReader
    [junit] Tests run: 14, Failures: 0, Errors: 0, Skipped: 1, Time elapsed: 0.106 sec
    [junit] Running org.apache.poi.xssf.extractor.TestXSSFBEventBasedExcelExtractor
    [junit] Tests run: 4, Failures: 0, Errors: 0, Skipped: 0, Time elapsed: 0.047 sec
    [junit] Running org.apache.poi.xssf.extractor.TestXSSFEventBasedExcelExtractor
    [junit] Tests run: 12, Failures: 0, Errors: 0, Skipped: 0, Time elapsed: 0.265 sec
    [junit] Running org.apache.poi.xssf.extractor.TestXSSFEventBasedExcelExtractorUsingFactory
    [junit] Tests run: 12, Failures: 0, Errors: 0, Skipped: 0, Time elapsed: 0.279 sec
    [junit] Running org.apache.poi.xssf.extractor.TestXSSFExcelExtractor
    [junit] Tests run: 8, Failures: 0, Errors: 0, Skipped: 0, Time elapsed: 0.329 sec
    [junit] Running org.apache.poi.xssf.extractor.TestXSSFExcelExtractorUsingFactory
    [junit] Tests run: 8, Failures: 0, Errors: 0, Skipped: 0, Time elapsed: 0.271 sec
    [junit] Running org.apache.poi.xssf.extractor.TestXSSFExportToXML
    [junit] Tests run: 18, Failures: 0, Errors: 0, Skipped: 1, Time elapsed: 0.467 sec
    [junit] Running org.apache.poi.xssf.extractor.TestXSSFImportFromXML
    [junit] Tests run: 5, Failures: 0, Errors: 0, Skipped: 0, Time elapsed: 4.656 sec
    [junit] Running org.apache.poi.xssf.io.TestLoadSaveXSSF
    [junit] Tests run: 3, Failures: 0, Errors: 0, Skipped: 0, Time elapsed: 0.035 sec
    [junit] Running org.apache.poi.xssf.model.TestCalculationChain
    [junit] Tests run: 1, Failures: 0, Errors: 0, Skipped: 0, Time elapsed: 0.216 sec
    [junit] Running org.apache.poi.xssf.model.TestCommentsTable
    [junit] Tests run: 7, Failures: 0, Errors: 0, Skipped: 0, Time elapsed: 0.095 sec
    [junit] Running org.apache.poi.xssf.model.TestExternalLinksTable
    [junit] Tests run: 4, Failures: 0, Errors: 0, Skipped: 0, Time elapsed: 0.064 sec
    [junit] Running org.apache.poi.xssf.model.TestMapInfo
    [junit] Tests run: 1, Failures: 0, Errors: 0, Skipped: 0, Time elapsed: 0.008 sec
    [junit] Running org.apache.poi.xssf.model.TestSharedStringsTable
    [junit] Tests run: 4, Failures: 0, Errors: 0, Skipped: 0, Time elapsed: 0.074 sec
    [junit] Running org.apache.poi.xssf.model.TestStylesTable
    [junit] Tests run: 13, Failures: 0, Errors: 0, Skipped: 0, Time elapsed: 0.213 sec
    [junit] Running org.apache.poi.xssf.model.TestThemesTable
    [junit] Tests run: 3, Failures: 0, Errors: 0, Skipped: 0, Time elapsed: 0.064 sec
    [junit] Running org.apache.poi.xssf.streaming.TestAutoSizeColumnTracker
    [junit] Tests run: 8, Failures: 0, Errors: 0, Skipped: 0, Time elapsed: 0.069 sec
    [junit] Running org.apache.poi.xssf.streaming.TestDeferredSXSSFWorkbook
    [junit] Tests run: 31, Failures: 0, Errors: 0, Skipped: 3, Time elapsed: 0.717 sec
    [junit] Running org.apache.poi.xssf.streaming.TestOutlining
    [junit] Tests run: 6, Failures: 0, Errors: 0, Skipped: 0, Time elapsed: 0.05 sec
    [junit] Running org.apache.poi.xssf.streaming.TestSXSSFCell
    [junit] Tests run: 60, Failures: 0, Errors: 0, Skipped: 4, Time elapsed: 1.778 sec
    [junit] Running org.apache.poi.xssf.streaming.TestSXSSFDataValidation
    [junit] Tests run: 2, Failures: 0, Errors: 0, Skipped: 0, Time elapsed: 0.102 sec
    [junit] Running org.apache.poi.xssf.streaming.TestSXSSFEvaluationSheet
    [junit] Tests run: 1, Failures: 0, Errors: 0, Skipped: 0, Time elapsed: 0.004 sec
    [junit] Running org.apache.poi.xssf.streaming.TestSXSSFFormulaEvaluation
    [junit] Tests run: 29, Failures: 0, Errors: 0, Skipped: 1, Time elapsed: 0.956 sec
    [junit] Running org.apache.poi.xssf.streaming.TestSXSSFHyperlink
    [junit] Tests run: 2, Failures: 0, Errors: 0, Skipped: 0, Time elapsed: 0.018 sec
    [junit] Running org.apache.poi.xssf.streaming.TestSXSSFRow
    [junit] Tests run: 14, Failures: 0, Errors: 0, Skipped: 2, Time elapsed: 0.201 sec
    [junit] Running org.apache.poi.xssf.streaming.TestSXSSFSheet
    [junit] Tests run: 50, Failures: 0, Errors: 0, Skipped: 0, Time elapsed: 0.789 sec
    [junit] Running org.apache.poi.xssf.streaming.TestSXSSFSheetAutoSizeColumn
    [junit] Tests run: 26, Failures: 0, Errors: 0, Skipped: 0, Time elapsed: 0.236 sec
    [junit] Running org.apache.poi.xssf.streaming.TestSXSSFUnicodeSurrogates
    [junit] Tests run: 1, Failures: 0, Errors: 0, Skipped: 0, Time elapsed: 0.018 sec
    [junit] Running org.apache.poi.xssf.streaming.TestSXSSFWorkbook
    [junit] Tests run: 37, Failures: 0, Errors: 0, Skipped: 4, Time elapsed: 0.947 sec
    [junit] Running org.apache.poi.xssf.streaming.TestSXSSFWorkbookWithCustomZipEntrySource
    [junit] Tests run: 3, Failures: 0, Errors: 0, Skipped: 0, Time elapsed: 0.063 sec
    [junit] Running org.apache.poi.xssf.streaming.TestSheetDataWriter
    [junit] Tests run: 3, Failures: 0, Errors: 0, Skipped: 0, Time elapsed: 0.015 sec
    [junit] Running org.apache.poi.xssf.usermodel.TestFormulaEvaluatorOnXSSF
    [junit] Tests run: 369, Failures: 0, Errors: 0, Skipped: 90, Time elapsed: 3.232 sec
    [junit] Running org.apache.poi.xssf.usermodel.TestMatrixFormulasFromXMLSpreadsheet
    [junit] Tests run: 34, Failures: 0, Errors: 0, Skipped: 0, Time elapsed: 0.309 sec
    [junit] Running org.apache.poi.xssf.usermodel.TestMissingWorkbookOnXSSF
    [junit] Tests run: 3, Failures: 0, Errors: 0, Skipped: 0, Time elapsed: 0.03 sec
    [junit] Running org.apache.poi.xssf.usermodel.TestMultiSheetFormulaEvaluatorOnXSSF
    [junit] Tests run: 2, Failures: 0, Errors: 0, Skipped: 0, Time elapsed: 0.009 sec
    [junit] Running org.apache.poi.xssf.usermodel.TestSXSSFBugs
    [junit] Tests run: 43, Failures: 0, Errors: 0, Skipped: 9, Time elapsed: 5.173 sec
    [junit] Running org.apache.poi.xssf.usermodel.TestSheetHiding
    [junit] Tests run: 5, Failures: 0, Errors: 0, Skipped: 0, Time elapsed: 0.062 sec
    [junit] Running org.apache.poi.xssf.usermodel.TestTableStyles
    [junit] Tests run: 2, Failures: 0, Errors: 0, Skipped: 0, Time elapsed: 0.289 sec
    [junit] Running org.apache.poi.xssf.usermodel.TestXSSFBugs
    [junit] Tests run: 157, Failures: 0, Errors: 1, Skipped: 8, Time elapsed: 13.991 sec

BUILD FAILED
<https://ci-builds.apache.org/job/POI/job/POI-DSL-OpenJDK/ws/build.xml>:1570: The following error occurred while executing this line:
<https://ci-builds.apache.org/job/POI/job/POI-DSL-OpenJDK/ws/build.xml>:1538: The following error occurred while executing this line:
<https://ci-builds.apache.org/job/POI/job/POI-DSL-OpenJDK/ws/build.xml>:1166: Tests failed

Total time: 11 minutes 58 seconds
Build step 'Invoke Ant' marked build as failure
[SpotBugs] Skipping execution of recorder since overall result is 'FAILURE'
Archiving artifacts
[Fast Archiver] Compressed 3.09 MB of artifacts by 99.2% relative to #26
Skipping publisher since build result is FAILURE
Recording test results

---------------------------------------------------------------------
To unsubscribe, e-mail: [hidden email]
For additional commands, e-mail: [hidden email]

Reply | Threaded
Open this post in threaded view
|

Build failed in Jenkins: POI » POI-DSL-OpenJDK #28

Apache Jenkins Server
See <https://ci-builds.apache.org/job/POI/job/POI-DSL-OpenJDK/28/display/redirect?page=changes>

Changes:

[PJ Fanning] doc build fails if context has more than one value

[PJ Fanning] fix xslf urls


------------------------------------------
[...truncated 130.05 KB...]
    [junit] Running org.apache.poi.poifs.crypt.dsig.TestSignatureInfo
    [junit] Tests run: 15, Failures: 0, Errors: 0, Skipped: 1, Time elapsed: 9.097 sec
    [junit] Running org.apache.poi.poifs.crypt.tests.TestAgileEncryptionParameters
    [junit] Tests run: 60, Failures: 0, Errors: 0, Skipped: 0, Time elapsed: 10.529 sec
    [junit] Running org.apache.poi.poifs.crypt.tests.TestDecryptor
    [junit] Tests run: 7, Failures: 0, Errors: 0, Skipped: 0, Time elapsed: 0.359 sec
    [junit] Running org.apache.poi.poifs.crypt.tests.TestEncryptionInfo
    [junit] Tests run: 2, Failures: 0, Errors: 0, Skipped: 0, Time elapsed: 0.005 sec
    [junit] Running org.apache.poi.poifs.crypt.tests.TestEncryptor
    [junit] Tests run: 8, Failures: 0, Errors: 0, Skipped: 1, Time elapsed: 13.375 sec
    [junit] Running org.apache.poi.poifs.crypt.tests.TestHxxFEncryption
    [junit] Tests run: 20, Failures: 0, Errors: 0, Skipped: 0, Time elapsed: 0.72 sec
    [junit] Running org.apache.poi.poifs.crypt.tests.TestSecureTempZip
    [junit] Tests run: 2, Failures: 0, Errors: 0, Skipped: 0, Time elapsed: 0.244 sec
    [junit] Running org.apache.poi.sl.tests.TestFonts
    [junit] Tests run: 2, Failures: 0, Errors: 0, Skipped: 0, Time elapsed: 0.277 sec
    [junit] Running org.apache.poi.sl.tests.TestHeadersFooters
    [junit] Tests run: 1, Failures: 0, Errors: 0, Skipped: 0, Time elapsed: 0.046 sec
    [junit] Running org.apache.poi.sl.tests.TestOleShape
    [junit] Tests run: 6, Failures: 0, Errors: 0, Skipped: 0, Time elapsed: 0.268 sec
    [junit] Running org.apache.poi.sl.tests.TestSlide
    [junit] Tests run: 2, Failures: 0, Errors: 0, Skipped: 0, Time elapsed: 0.065 sec
    [junit] Running org.apache.poi.sl.tests.TestTable
    [junit] Tests run: 4, Failures: 0, Errors: 0, Skipped: 0, Time elapsed: 0.145 sec
    [junit] Running org.apache.poi.sl.tests.draw.TestDrawPictureShape
    [junit] Tests run: 2, Failures: 0, Errors: 0, Skipped: 0, Time elapsed: 0.073 sec
    [junit] Running org.apache.poi.ss.tests.TestWorkbookFactory
    [junit] Tests run: 12, Failures: 0, Errors: 0, Skipped: 0, Time elapsed: 1.138 sec
    [junit] Running org.apache.poi.ss.tests.extractor.TestEmbeddedExtractor
    [junit] Tests run: 3, Failures: 0, Errors: 0, Skipped: 0, Time elapsed: 0.236 sec
    [junit] Running org.apache.poi.ss.tests.format.TestCellFormatPart
    [junit] Tests run: 7, Failures: 0, Errors: 0, Skipped: 0, Time elapsed: 0.481 sec
    [junit] Running org.apache.poi.ss.tests.formula.TestFormulaParser
    [junit] Tests run: 9, Failures: 0, Errors: 0, Skipped: 0, Time elapsed: 0.1 sec
    [junit] Running org.apache.poi.ss.tests.formula.TestStructuredReferences
    [junit] Tests run: 2, Failures: 0, Errors: 0, Skipped: 0, Time elapsed: 0.197 sec
    [junit] Running org.apache.poi.ss.tests.formula.eval.TestXSSFCircularReferences
    [junit] Tests run: 4, Failures: 0, Errors: 0, Skipped: 0, Time elapsed: 0.028 sec
    [junit] Running org.apache.poi.ss.tests.formula.functions.TestProper
    [junit] Tests run: 4, Failures: 0, Errors: 0, Skipped: 0, Time elapsed: 1.568 sec
    [junit] Running org.apache.poi.ss.tests.formula.functions.TestSumifsXSSF
    [junit] Tests run: 1, Failures: 0, Errors: 0, Skipped: 0, Time elapsed: 0.035 sec
    [junit] Running org.apache.poi.ss.tests.formula.functions.TestVlookup
    [junit] Tests run: 6, Failures: 0, Errors: 0, Skipped: 0, Time elapsed: 30.551 sec
    [junit] Running org.apache.poi.ss.tests.usermodel.TestEmbedOLEPackage
    [junit] Tests run: 3, Failures: 0, Errors: 0, Skipped: 0, Time elapsed: 0.151 sec
    [junit] Running org.apache.poi.ss.tests.usermodel.TestXSSFBorderStyle
    [junit] Tests run: 1, Failures: 0, Errors: 0, Skipped: 0, Time elapsed: 0.01 sec
    [junit] Running org.apache.poi.ss.tests.usermodel.TestXSSFRangeCopier
    [junit] Tests run: 9, Failures: 0, Errors: 0, Skipped: 0, Time elapsed: 0.099 sec
    [junit] Running org.apache.poi.ss.tests.util.TestSXSSFCellUtil
    [junit] Tests run: 14, Failures: 0, Errors: 0, Skipped: 0, Time elapsed: 0.103 sec
    [junit] Running org.apache.poi.ss.tests.util.TestXSSFCellUtil
    [junit] Tests run: 14, Failures: 0, Errors: 0, Skipped: 0, Time elapsed: 0.062 sec
    [junit] Running org.apache.poi.ss.tests.util.TestXSSFPropertyTemplate
    [junit] Tests run: 2, Failures: 0, Errors: 0, Skipped: 0, Time elapsed: 0.03 sec
    [junit] Running org.apache.poi.util.tests.TestIdentifierManager
    [junit] Tests run: 5, Failures: 0, Errors: 0, Skipped: 0, Time elapsed: 0.002 sec
    [junit] Running org.apache.poi.util.tests.TestTempFileThreaded
    [junit] Tests run: 1, Failures: 0, Errors: 0, Skipped: 0, Time elapsed: 4.326 sec
    [junit] Running org.apache.poi.xddf.usermodel.TestNecessaryOOXMLClasses
    [junit] Tests run: 1, Failures: 0, Errors: 0, Skipped: 0, Time elapsed: 0.132 sec
    [junit] Running org.apache.poi.xddf.usermodel.TestXDDFColor
    [junit] Tests run: 5, Failures: 0, Errors: 0, Skipped: 0, Time elapsed: 0.071 sec
    [junit] Running org.apache.poi.xddf.usermodel.chart.TestXDDFChart
    [junit] Tests run: 2, Failures: 0, Errors: 0, Skipped: 0, Time elapsed: 0.015 sec
    [junit] Running org.apache.poi.xddf.usermodel.chart.TestXDDFChartExtensionList
    [junit] Tests run: 1, Failures: 0, Errors: 0, Skipped: 0, Time elapsed: 0.003 sec
    [junit] Running org.apache.poi.xddf.usermodel.chart.TestXDDFChartRemoveSeries
    [junit] Tests run: 4, Failures: 0, Errors: 0, Skipped: 0, Time elapsed: 0.108 sec
    [junit] Running org.apache.poi.xddf.usermodel.chart.TestXDDFDataSourcesFactory
    [junit] Tests run: 6, Failures: 0, Errors: 0, Skipped: 0, Time elapsed: 0.011 sec
    [junit] Running org.apache.poi.xddf.usermodel.text.TestXDDFTextBodyProperties
    [junit] Tests run: 1, Failures: 0, Errors: 0, Skipped: 0, Time elapsed: 0.007 sec
    [junit] Running org.apache.poi.xddf.usermodel.text.TestXDDFTextRun
    [junit] Tests run: 3, Failures: 0, Errors: 0, Skipped: 0, Time elapsed: 0.09 sec
    [junit] Running org.apache.poi.xdgf.extractor.TestXDGFVisioExtractor
    [junit] Tests run: 3, Failures: 0, Errors: 0, Skipped: 0, Time elapsed: 0.246 sec
    [junit] Running org.apache.poi.xslf.TestNecessaryOOXMLClasses
    [junit] Tests run: 1, Failures: 0, Errors: 0, Skipped: 0, Time elapsed: 0.005 sec
    [junit] Running org.apache.poi.xslf.TestXSLFBugs
    [junit] Tests run: 31, Failures: 0, Errors: 0, Skipped: 2, Time elapsed: 2.036 sec
    [junit] Running org.apache.poi.xslf.TestXSLFSlideShow
    [junit] Tests run: 5, Failures: 0, Errors: 0, Skipped: 0, Time elapsed: 0.087 sec
    [junit] Running org.apache.poi.xslf.extractor.TestXSLFPowerPointExtractor
    [junit] Tests run: 8, Failures: 0, Errors: 0, Skipped: 0, Time elapsed: 0.712 sec
    [junit] Running org.apache.poi.xslf.usermodel.TestPPTX2PNG
    [junit] Tests run: 20, Failures: 0, Errors: 0, Skipped: 0, Time elapsed: 21.319 sec
    [junit] Running org.apache.poi.xslf.usermodel.TestXMLSlideShow
    [junit] Tests run: 12, Failures: 0, Errors: 0, Skipped: 0, Time elapsed: 0.368 sec
    [junit] Running org.apache.poi.xslf.usermodel.TestXSLFAutoShape
    [junit] Tests run: 4, Failures: 0, Errors: 0, Skipped: 0, Time elapsed: 0.081 sec
    [junit] Running org.apache.poi.xslf.usermodel.TestXSLFBackground
    [junit] Tests run: 4, Failures: 0, Errors: 0, Skipped: 0, Time elapsed: 0.144 sec
    [junit] Running org.apache.poi.xslf.usermodel.TestXSLFChart
    [junit] Tests run: 5, Failures: 0, Errors: 0, Skipped: 0, Time elapsed: 0.197 sec
    [junit] Running org.apache.poi.xslf.usermodel.TestXSLFColor
    [junit] Tests run: 6, Failures: 0, Errors: 0, Skipped: 0, Time elapsed: 0.031 sec
    [junit] Running org.apache.poi.xslf.usermodel.TestXSLFConnectorShape
    [junit] Tests run: 2, Failures: 0, Errors: 0, Skipped: 0, Time elapsed: 0.036 sec
    [junit] Running org.apache.poi.xslf.usermodel.TestXSLFFreeformShape
    [junit] Tests run: 2, Failures: 0, Errors: 0, Skipped: 0, Time elapsed: 0.064 sec
    [junit] Running org.apache.poi.xslf.usermodel.TestXSLFGroupShape
    [junit] Tests run: 2, Failures: 0, Errors: 0, Skipped: 0, Time elapsed: 0.033 sec
    [junit] Running org.apache.poi.xslf.usermodel.TestXSLFHyperlink
    [junit] Tests run: 3, Failures: 0, Errors: 0, Skipped: 0, Time elapsed: 0.077 sec
    [junit] Running org.apache.poi.xslf.usermodel.TestXSLFNotes
    [junit] Tests run: 3, Failures: 0, Errors: 0, Skipped: 0, Time elapsed: 0.066 sec
    [junit] Running org.apache.poi.xslf.usermodel.TestXSLFPictureShape
    [junit] Tests run: 7, Failures: 0, Errors: 0, Skipped: 0, Time elapsed: 1.313 sec
    [junit] Running org.apache.poi.xslf.usermodel.TestXSLFShape
    [junit] Tests run: 3, Failures: 0, Errors: 0, Skipped: 0, Time elapsed: 0.089 sec
    [junit] Running org.apache.poi.xslf.usermodel.TestXSLFShapeContainer
    [junit] Tests run: 1, Failures: 0, Errors: 0, Skipped: 0, Time elapsed: 0.021 sec
    [junit] Running org.apache.poi.xslf.usermodel.TestXSLFSheet
    [junit] Tests run: 1, Failures: 0, Errors: 0, Skipped: 0, Time elapsed: 0.049 sec
    [junit] Running org.apache.poi.xslf.usermodel.TestXSLFSimpleShape
    [junit] Tests run: 7, Failures: 0, Errors: 0, Skipped: 0, Time elapsed: 1.841 sec
    [junit] Running org.apache.poi.xslf.usermodel.TestXSLFSlide
    [junit] Tests run: 5, Failures: 0, Errors: 0, Skipped: 0, Time elapsed: 0.57 sec
    [junit] Running org.apache.poi.xslf.usermodel.TestXSLFSlideShow
    [junit] Tests run: 6, Failures: 0, Errors: 0, Skipped: 0, Time elapsed: 0.167 sec
    [junit] Running org.apache.poi.xslf.usermodel.TestXSLFSlideShowFactory
    [junit] Tests run: 6, Failures: 0, Errors: 0, Skipped: 0, Time elapsed: 0.444 sec
    [junit] Running org.apache.poi.xslf.usermodel.TestXSLFTable
    [junit] Tests run: 6, Failures: 0, Errors: 0, Skipped: 0, Time elapsed: 1.516 sec
    [junit] Running org.apache.poi.xslf.usermodel.TestXSLFTableRow
    [junit] Tests run: 8, Failures: 0, Errors: 0, Skipped: 0, Time elapsed: 0.15 sec
    [junit] Running org.apache.poi.xslf.usermodel.TestXSLFTableStyles
    [junit] Tests run: 1, Failures: 0, Errors: 0, Skipped: 0, Time elapsed: 0.013 sec
    [junit] Running org.apache.poi.xslf.usermodel.TestXSLFTextBox
    [junit] Tests run: 2, Failures: 0, Errors: 0, Skipped: 0, Time elapsed: 0.027 sec
    [junit] Running org.apache.poi.xslf.usermodel.TestXSLFTextParagraph
    [junit] Tests run: 5, Failures: 0, Errors: 0, Skipped: 1, Time elapsed: 0.072 sec
    [junit] Running org.apache.poi.xslf.usermodel.TestXSLFTextRun
    [junit] Tests run: 4, Failures: 0, Errors: 0, Skipped: 0, Time elapsed: 0.06 sec
    [junit] Running org.apache.poi.xslf.usermodel.TestXSLFTextShape
    [junit] Tests run: 4, Failures: 0, Errors: 0, Skipped: 0, Time elapsed: 0.07 sec
    [junit] Running org.apache.poi.xslf.usermodel.TestXSLFTheme
    [junit] Tests run: 1, Failures: 0, Errors: 0, Skipped: 0, Time elapsed: 0.096 sec
    [junit] Running org.apache.poi.xssf.TestNecessaryOOXMLClasses
    [junit] Tests run: 1, Failures: 0, Errors: 0, Skipped: 0, Time elapsed: 0.002 sec
    [junit] Running org.apache.poi.xssf.TestSheetProtection
    [junit] Tests run: 17, Failures: 0, Errors: 0, Skipped: 0, Time elapsed: 0.114 sec
    [junit] Running org.apache.poi.xssf.TestWorkbookProtection
    [junit] Tests run: 8, Failures: 0, Errors: 0, Skipped: 0, Time elapsed: 0.399 sec
    [junit] Running org.apache.poi.xssf.TestXSSFCloneSheet
    [junit] Tests run: 8, Failures: 0, Errors: 0, Skipped: 0, Time elapsed: 0.177 sec
    [junit] Running org.apache.poi.xssf.TestXSSFOffset
    [junit] Tests run: 1, Failures: 0, Errors: 0, Skipped: 0, Time elapsed: 0.007 sec
    [junit] Running org.apache.poi.xssf.binary.TestXSSFBSharedStringsTable
    [junit] Tests run: 1, Failures: 0, Errors: 0, Skipped: 0, Time elapsed: 0.008 sec
    [junit] Running org.apache.poi.xssf.binary.TestXSSFBSheetHyperlinkManager
    [junit] Tests run: 1, Failures: 0, Errors: 0, Skipped: 0, Time elapsed: 0.01 sec
    [junit] Running org.apache.poi.xssf.eventusermodel.TestReadOnlySharedStringsTable
    [junit] Tests run: 4, Failures: 0, Errors: 0, Skipped: 0, Time elapsed: 0.021 sec
    [junit] Running org.apache.poi.xssf.eventusermodel.TestXSSFBReader
    [junit] Tests run: 4, Failures: 0, Errors: 0, Skipped: 0, Time elapsed: 0.025 sec
    [junit] Running org.apache.poi.xssf.eventusermodel.TestXSSFReader
    [junit] Tests run: 14, Failures: 0, Errors: 0, Skipped: 1, Time elapsed: 0.101 sec
    [junit] Running org.apache.poi.xssf.extractor.TestXSSFBEventBasedExcelExtractor
    [junit] Tests run: 4, Failures: 0, Errors: 0, Skipped: 0, Time elapsed: 0.055 sec
    [junit] Running org.apache.poi.xssf.extractor.TestXSSFEventBasedExcelExtractor
    [junit] Tests run: 12, Failures: 0, Errors: 0, Skipped: 0, Time elapsed: 0.283 sec
    [junit] Running org.apache.poi.xssf.extractor.TestXSSFEventBasedExcelExtractorUsingFactory
    [junit] Tests run: 12, Failures: 0, Errors: 0, Skipped: 0, Time elapsed: 0.229 sec
    [junit] Running org.apache.poi.xssf.extractor.TestXSSFExcelExtractor
    [junit] Tests run: 8, Failures: 0, Errors: 0, Skipped: 0, Time elapsed: 0.292 sec
    [junit] Running org.apache.poi.xssf.extractor.TestXSSFExcelExtractorUsingFactory
    [junit] Tests run: 8, Failures: 0, Errors: 0, Skipped: 0, Time elapsed: 0.227 sec
    [junit] Running org.apache.poi.xssf.extractor.TestXSSFExportToXML
    [junit] Tests run: 18, Failures: 0, Errors: 0, Skipped: 1, Time elapsed: 0.454 sec
    [junit] Running org.apache.poi.xssf.extractor.TestXSSFImportFromXML
    [junit] Tests run: 5, Failures: 0, Errors: 0, Skipped: 0, Time elapsed: 4.887 sec
    [junit] Running org.apache.poi.xssf.io.TestLoadSaveXSSF
    [junit] Tests run: 3, Failures: 0, Errors: 0, Skipped: 0, Time elapsed: 0.042 sec
    [junit] Running org.apache.poi.xssf.model.TestCalculationChain
    [junit] Tests run: 1, Failures: 0, Errors: 0, Skipped: 0, Time elapsed: 0.232 sec
    [junit] Running org.apache.poi.xssf.model.TestCommentsTable
    [junit] Tests run: 7, Failures: 0, Errors: 0, Skipped: 0, Time elapsed: 0.081 sec
    [junit] Running org.apache.poi.xssf.model.TestExternalLinksTable
    [junit] Tests run: 4, Failures: 0, Errors: 0, Skipped: 0, Time elapsed: 0.048 sec
    [junit] Running org.apache.poi.xssf.model.TestMapInfo
    [junit] Tests run: 1, Failures: 0, Errors: 0, Skipped: 0, Time elapsed: 0.008 sec
    [junit] Running org.apache.poi.xssf.model.TestSharedStringsTable
    [junit] Tests run: 4, Failures: 0, Errors: 0, Skipped: 0, Time elapsed: 0.068 sec
    [junit] Running org.apache.poi.xssf.model.TestStylesTable
    [junit] Tests run: 13, Failures: 0, Errors: 0, Skipped: 0, Time elapsed: 0.214 sec
    [junit] Running org.apache.poi.xssf.model.TestThemesTable
    [junit] Tests run: 3, Failures: 0, Errors: 0, Skipped: 0, Time elapsed: 0.086 sec
    [junit] Running org.apache.poi.xssf.streaming.TestAutoSizeColumnTracker
    [junit] Tests run: 8, Failures: 0, Errors: 0, Skipped: 0, Time elapsed: 0.03 sec
    [junit] Running org.apache.poi.xssf.streaming.TestDeferredSXSSFWorkbook
    [junit] Tests run: 31, Failures: 0, Errors: 0, Skipped: 3, Time elapsed: 0.579 sec
    [junit] Running org.apache.poi.xssf.streaming.TestOutlining
    [junit] Tests run: 6, Failures: 0, Errors: 0, Skipped: 0, Time elapsed: 0.017 sec
    [junit] Running org.apache.poi.xssf.streaming.TestSXSSFCell
    [junit] Tests run: 60, Failures: 0, Errors: 0, Skipped: 4, Time elapsed: 1.552 sec
    [junit] Running org.apache.poi.xssf.streaming.TestSXSSFDataValidation
    [junit] Tests run: 2, Failures: 0, Errors: 0, Skipped: 0, Time elapsed: 0.116 sec
    [junit] Running org.apache.poi.xssf.streaming.TestSXSSFEvaluationSheet
    [junit] Tests run: 1, Failures: 0, Errors: 0, Skipped: 0, Time elapsed: 0.005 sec
    [junit] Running org.apache.poi.xssf.streaming.TestSXSSFFormulaEvaluation
    [junit] Tests run: 29, Failures: 0, Errors: 0, Skipped: 1, Time elapsed: 0.722 sec
    [junit] Running org.apache.poi.xssf.streaming.TestSXSSFHyperlink
    [junit] Tests run: 2, Failures: 0, Errors: 0, Skipped: 0, Time elapsed: 0.016 sec
    [junit] Running org.apache.poi.xssf.streaming.TestSXSSFRow
    [junit] Tests run: 14, Failures: 0, Errors: 0, Skipped: 2, Time elapsed: 0.135 sec
    [junit] Running org.apache.poi.xssf.streaming.TestSXSSFSheet
    [junit] Tests run: 50, Failures: 0, Errors: 0, Skipped: 0, Time elapsed: 0.441 sec
    [junit] Running org.apache.poi.xssf.streaming.TestSXSSFSheetAutoSizeColumn
    [junit] Tests run: 26, Failures: 0, Errors: 0, Skipped: 0, Time elapsed: 0.115 sec
    [junit] Running org.apache.poi.xssf.streaming.TestSXSSFUnicodeSurrogates
    [junit] Tests run: 1, Failures: 0, Errors: 0, Skipped: 0, Time elapsed: 0.014 sec
    [junit] Running org.apache.poi.xssf.streaming.TestSXSSFWorkbook
    [junit] Tests run: 37, Failures: 0, Errors: 0, Skipped: 4, Time elapsed: 0.668 sec
    [junit] Running org.apache.poi.xssf.streaming.TestSXSSFWorkbookWithCustomZipEntrySource
    [junit] Tests run: 3, Failures: 0, Errors: 0, Skipped: 0, Time elapsed: 0.045 sec
    [junit] Running org.apache.poi.xssf.streaming.TestSheetDataWriter
    [junit] Tests run: 3, Failures: 0, Errors: 0, Skipped: 0, Time elapsed: 0.002 sec
    [junit] Running org.apache.poi.xssf.usermodel.TestFormulaEvaluatorOnXSSF
    [junit] Tests run: 369, Failures: 0, Errors: 0, Skipped: 90, Time elapsed: 0.318 sec
    [junit] Running org.apache.poi.xssf.usermodel.TestMatrixFormulasFromXMLSpreadsheet
    [junit] Tests run: 34, Failures: 0, Errors: 0, Skipped: 0, Time elapsed: 0.117 sec
    [junit] Running org.apache.poi.xssf.usermodel.TestMissingWorkbookOnXSSF
    [junit] Tests run: 3, Failures: 0, Errors: 0, Skipped: 0, Time elapsed: 0.026 sec
    [junit] Running org.apache.poi.xssf.usermodel.TestMultiSheetFormulaEvaluatorOnXSSF
    [junit] Tests run: 2, Failures: 0, Errors: 0, Skipped: 0, Time elapsed: 0.003 sec
    [junit] Running org.apache.poi.xssf.usermodel.TestSXSSFBugs
    [junit] Tests run: 43, Failures: 0, Errors: 0, Skipped: 9, Time elapsed: 4.215 sec
    [junit] Running org.apache.poi.xssf.usermodel.TestSheetHiding
    [junit] Tests run: 5, Failures: 0, Errors: 0, Skipped: 0, Time elapsed: 0.069 sec
    [junit] Running org.apache.poi.xssf.usermodel.TestTableStyles
    [junit] Tests run: 2, Failures: 0, Errors: 0, Skipped: 0, Time elapsed: 0.325 sec
    [junit] Running org.apache.poi.xssf.usermodel.TestXSSFBugs
    [junit] Tests run: 157, Failures: 0, Errors: 1, Skipped: 8, Time elapsed: 13.265 sec

BUILD FAILED
<https://ci-builds.apache.org/job/POI/job/POI-DSL-OpenJDK/ws/build.xml>:1570: The following error occurred while executing this line:
<https://ci-builds.apache.org/job/POI/job/POI-DSL-OpenJDK/ws/build.xml>:1538: The following error occurred while executing this line:
<https://ci-builds.apache.org/job/POI/job/POI-DSL-OpenJDK/ws/build.xml>:1166: Tests failed

Total time: 9 minutes 13 seconds
Build step 'Invoke Ant' marked build as failure
[SpotBugs] Skipping execution of recorder since overall result is 'FAILURE'
Archiving artifacts
[Fast Archiver] Compressed 3.09 MB of artifacts by 99.2% relative to #26
Skipping publisher since build result is FAILURE
Recording test results

---------------------------------------------------------------------
To unsubscribe, e-mail: [hidden email]
For additional commands, e-mail: [hidden email]

Reply | Threaded
Open this post in threaded view
|

Jenkins build is back to normal : POI » POI-DSL-OpenJDK #29

Apache Jenkins Server
See <https://ci-builds.apache.org/job/POI/job/POI-DSL-OpenJDK/29/display/redirect?page=changes>


---------------------------------------------------------------------
To unsubscribe, e-mail: [hidden email]
For additional commands, e-mail: [hidden email]