Build failed in Jenkins: POI » POI-DSL-OpenJDK #131

classic Classic list List threaded Threaded
3 messages Options
Reply | Threaded
Open this post in threaded view
|

Build failed in Jenkins: POI » POI-DSL-OpenJDK #131

Apache Jenkins Server
See <https://ci-builds.apache.org/job/POI/job/POI-DSL-OpenJDK/131/display/redirect?page=changes>

Changes:

[Andreas Beeker] Use upcoming XmlBeans 5.0.0 (working version 4.0.1)
Make batik optional as it doesn't work on the module-path
Use sub-components of batik as batik-all references them all again resulting in duplicated entries (maven poms haven't been migrated yet ...)
Remove SLF4j dependency


------------------------------------------
[...truncated 138.83 KB...]
[junitlauncher] Running org.apache.poi.hwpf.converter.TestNumberFormatter
[junitlauncher] Tests run: 2, Failures: 0, Aborted: 0, Skipped: 0, Time elapsed: 0.090000 sec
[junitlauncher]
[junitlauncher] Running org.apache.poi.hwpf.converter.TestWordToConverterSuite
[junitlauncher] Tests run: 402, Failures: 0, Aborted: 0, Skipped: 0, Time elapsed: 4.671000 sec
[junitlauncher]
[junitlauncher] Running org.apache.poi.hwpf.converter.TestWordToFoConverter
[junitlauncher] Tests run: 8, Failures: 0, Aborted: 0, Skipped: 0, Time elapsed: 0.012000 sec
[junitlauncher]
[junitlauncher] Running org.apache.poi.hwpf.converter.TestWordToHtmlConverter
[junitlauncher] Tests run: 21, Failures: 0, Aborted: 0, Skipped: 0, Time elapsed: 0.132000 sec
[junitlauncher]
[junitlauncher] Running org.apache.poi.hwpf.converter.TestWordToTextConverter
[junitlauncher] Tests run: 3, Failures: 0, Aborted: 0, Skipped: 0, Time elapsed: 0.041000 sec
[junitlauncher]
[junitlauncher] Running org.apache.poi.hwpf.dev.TestHWPFLister
[junitlauncher] Tests run: 2, Failures: 0, Aborted: 0, Skipped: 0, Time elapsed: 0.023000 sec
[junitlauncher]
[junitlauncher] Running org.apache.poi.hwpf.extractor.TestDifferentRoutes
[junitlauncher] Tests run: 2, Failures: 0, Aborted: 0, Skipped: 0, Time elapsed: 0.003000 sec
[junitlauncher]
[junitlauncher] Running org.apache.poi.hwpf.extractor.TestWordExtractor
[junitlauncher] Tests run: 18, Failures: 0, Aborted: 0, Skipped: 0, Time elapsed: 0.050000 sec
[junitlauncher]
[junitlauncher] Running org.apache.poi.hwpf.extractor.TestWordExtractorBugs
[junitlauncher] Tests run: 3, Failures: 0, Aborted: 0, Skipped: 0, Time elapsed: 0.202000 sec
[junitlauncher]
[junitlauncher] Running org.apache.poi.hwpf.model.TestBookmarksTables
[junitlauncher] Tests run: 5, Failures: 0, Aborted: 0, Skipped: 0, Time elapsed: 0.004000 sec
[junitlauncher]
[junitlauncher] Running org.apache.poi.hwpf.model.TestCHPBinTable
[junitlauncher] Tests run: 1, Failures: 0, Aborted: 0, Skipped: 0, Time elapsed: 0.001000 sec
[junitlauncher]
[junitlauncher] Running org.apache.poi.hwpf.model.TestDocumentProperties
[junitlauncher] Tests run: 1, Failures: 0, Aborted: 0, Skipped: 0, Time elapsed: 0.165000 sec
[junitlauncher]
[junitlauncher] Running org.apache.poi.hwpf.model.TestFileInformationBlock
[junitlauncher] Tests run: 1, Failures: 0, Aborted: 0, Skipped: 0, Time elapsed: 0.004000 sec
[junitlauncher]
[junitlauncher] Running org.apache.poi.hwpf.model.TestFontTable
[junitlauncher] Tests run: 1, Failures: 0, Aborted: 0, Skipped: 0, Time elapsed: 0.027000 sec
[junitlauncher]
[junitlauncher] Running org.apache.poi.hwpf.model.TestListTables
[junitlauncher] Tests run: 1, Failures: 0, Aborted: 0, Skipped: 0, Time elapsed: 0.001000 sec
[junitlauncher]
[junitlauncher] Running org.apache.poi.hwpf.model.TestNotesTables
[junitlauncher] Tests run: 1, Failures: 0, Aborted: 0, Skipped: 0, Time elapsed: 0.001000 sec
[junitlauncher]
[junitlauncher] Running org.apache.poi.hwpf.model.TestPAPBinTable
[junitlauncher] Tests run: 2, Failures: 0, Aborted: 0, Skipped: 0, Time elapsed: 0.022000 sec
[junitlauncher]
[junitlauncher] Running org.apache.poi.hwpf.model.TestPlexOfCps
[junitlauncher] Tests run: 1, Failures: 0, Aborted: 0, Skipped: 0, Time elapsed: 0.002000 sec
[junitlauncher]
[junitlauncher] Running org.apache.poi.hwpf.model.TestPlfLfo
[junitlauncher] Tests run: 2, Failures: 0, Aborted: 0, Skipped: 0, Time elapsed: 0.001000 sec
[junitlauncher]
[junitlauncher] Running org.apache.poi.hwpf.model.TestRevisionMarkAuthorTable
[junitlauncher] Tests run: 3, Failures: 0, Aborted: 0, Skipped: 0, Time elapsed: 0.006000 sec
[junitlauncher]
[junitlauncher] Running org.apache.poi.hwpf.model.TestSavedByTable
[junitlauncher] Tests run: 1, Failures: 0, Aborted: 0, Skipped: 0, Time elapsed: 0.018000 sec
[junitlauncher]
[junitlauncher] Running org.apache.poi.hwpf.model.TestSectionTable
[junitlauncher] Tests run: 1, Failures: 0, Aborted: 0, Skipped: 0, Time elapsed: 0.002000 sec
[junitlauncher]
[junitlauncher] Running org.apache.poi.hwpf.model.TestStyleSheet
[junitlauncher] Tests run: 2, Failures: 0, Aborted: 0, Skipped: 0, Time elapsed: 0.002000 sec
[junitlauncher]
[junitlauncher] Running org.apache.poi.hwpf.model.TestTextPieceTable
[junitlauncher] Tests run: 4, Failures: 0, Aborted: 0, Skipped: 0, Time elapsed: 0.013000 sec
[junitlauncher]
[junitlauncher] Running org.apache.poi.hwpf.model.types.TestLFOLVLBaseAbstractType
[junitlauncher] Tests run: 1, Failures: 0, Aborted: 0, Skipped: 0, Time elapsed: 0.001000 sec
[junitlauncher]
[junitlauncher] Running org.apache.poi.hwpf.model.types.TestLVLFAbstractType
[junitlauncher] Tests run: 1, Failures: 0, Aborted: 0, Skipped: 0, Time elapsed: 0.001000 sec
[junitlauncher]
[junitlauncher] Running org.apache.poi.hwpf.sprm.TestSprms
[junitlauncher] Tests run: 2, Failures: 0, Aborted: 0, Skipped: 0, Time elapsed: 0.008000 sec
[junitlauncher]
[junitlauncher] Running org.apache.poi.hwpf.usermodel.TestBorderCode
[junitlauncher] Tests run: 1, Failures: 0, Aborted: 0, Skipped: 0, Time elapsed: 0.002000 sec
[junitlauncher]
[junitlauncher] Running org.apache.poi.hwpf.usermodel.TestBug46610
[junitlauncher] Tests run: 3, Failures: 0, Aborted: 0, Skipped: 0, Time elapsed: 0.008000 sec
[junitlauncher]
[junitlauncher] Running org.apache.poi.hwpf.usermodel.TestBug47563
[junitlauncher] Tests run: 8, Failures: 0, Aborted: 0, Skipped: 0, Time elapsed: 0.033000 sec
[junitlauncher]
[junitlauncher] Running org.apache.poi.hwpf.usermodel.TestBug49820
[junitlauncher] Tests run: 1, Failures: 0, Aborted: 0, Skipped: 0, Time elapsed: 0.002000 sec
[junitlauncher]
[junitlauncher] Running org.apache.poi.hwpf.usermodel.TestBug50075
[junitlauncher] Tests run: 1, Failures: 0, Aborted: 0, Skipped: 0, Time elapsed: 0.002000 sec
[junitlauncher]
[junitlauncher] Running org.apache.poi.hwpf.usermodel.TestBugs
[junitlauncher] Tests run: 43, Failures: 0, Aborted: 0, Skipped: 0, Time elapsed: 0.709000 sec
[junitlauncher]
[junitlauncher] Running org.apache.poi.hwpf.usermodel.TestHWPFOldDocument
[junitlauncher] Tests run: 14, Failures: 0, Aborted: 0, Skipped: 0, Time elapsed: 0.066000 sec
[junitlauncher]
[junitlauncher] Running org.apache.poi.hwpf.usermodel.TestHWPFWrite
[junitlauncher] Tests run: 5, Failures: 0, Aborted: 0, Skipped: 0, Time elapsed: 0.021000 sec
[junitlauncher]
[junitlauncher] Running org.apache.poi.hwpf.usermodel.TestHeaderStories
[junitlauncher] Tests run: 8, Failures: 0, Aborted: 0, Skipped: 0, Time elapsed: 0.027000 sec
[junitlauncher]
[junitlauncher] Running org.apache.poi.hwpf.usermodel.TestLists
[junitlauncher] Tests run: 7, Failures: 0, Aborted: 0, Skipped: 0, Time elapsed: 0.008000 sec
[junitlauncher]
[junitlauncher] Running org.apache.poi.hwpf.usermodel.TestOfficeDrawings
[junitlauncher] Tests run: 1, Failures: 0, Aborted: 0, Skipped: 0, Time elapsed: 0.002000 sec
[junitlauncher]
[junitlauncher] Running org.apache.poi.hwpf.usermodel.TestPictures
[junitlauncher] Tests run: 16, Failures: 0, Aborted: 0, Skipped: 2, Time elapsed: 0.039000 sec
[junitlauncher]
[junitlauncher] Running org.apache.poi.hwpf.usermodel.TestProblems
[junitlauncher] Tests run: 10, Failures: 0, Aborted: 0, Skipped: 0, Time elapsed: 0.022000 sec
[junitlauncher]
[junitlauncher] Running org.apache.poi.hwpf.usermodel.TestRange
[junitlauncher] Tests run: 2, Failures: 0, Aborted: 0, Skipped: 0, Time elapsed: 0.003000 sec
[junitlauncher]
[junitlauncher] Running org.apache.poi.hwpf.usermodel.TestRangeDelete
[junitlauncher] Tests run: 4, Failures: 0, Aborted: 0, Skipped: 0, Time elapsed: 0.006000 sec
[junitlauncher]
[junitlauncher] Running org.apache.poi.hwpf.usermodel.TestRangeInsertion
[junitlauncher] Tests run: 3, Failures: 0, Aborted: 0, Skipped: 0, Time elapsed: 0.003000 sec
[junitlauncher]
[junitlauncher] Running org.apache.poi.hwpf.usermodel.TestRangeProperties
[junitlauncher] Tests run: 5, Failures: 0, Aborted: 0, Skipped: 0, Time elapsed: 0.011000 sec
[junitlauncher]
[junitlauncher] Running org.apache.poi.hwpf.usermodel.TestRangeReplacement
[junitlauncher] Tests run: 3, Failures: 0, Aborted: 0, Skipped: 0, Time elapsed: 0.004000 sec
[junitlauncher]
[junitlauncher] Running org.apache.poi.hwpf.usermodel.TestRangeSymbols
[junitlauncher] Tests run: 2, Failures: 0, Aborted: 0, Skipped: 0, Time elapsed: 0.003000 sec
[junitlauncher]
[junitlauncher] Running org.apache.poi.hwpf.usermodel.TestTableRow
[junitlauncher] Tests run: 2, Failures: 0, Aborted: 0, Skipped: 0, Time elapsed: 0.003000 sec
[junitlauncher]
[junitlauncher] Running org.apache.poi.hwpf.util.TestLittleEndianCP950Reader
[junitlauncher] Tests run: 1, Failures: 0, Aborted: 0, Skipped: 0, Time elapsed: 0.001000 sec

-test-scratchpad-write-testfile:

-test-ooxml-check:

test-ooxml:
[junitlauncher]
[junitlauncher] Running org.apache.poi.extractor.ooxml.TestExtractorFactory
[junitlauncher] Tests run: 117, Failures: 0, Aborted: 0, Skipped: 0, Time elapsed: 6.853000 sec
[junitlauncher]
[junitlauncher] Running org.apache.poi.ooxml.TestDetectAsOOXML
[junitlauncher] Tests run: 5, Failures: 0, Aborted: 0, Skipped: 0, Time elapsed: 0.061000 sec
[junitlauncher]
[junitlauncher] Running org.apache.poi.ooxml.TestEmbedded
[junitlauncher] Tests run: 3, Failures: 0, Aborted: 0, Skipped: 0, Time elapsed: 0.388000 sec
[junitlauncher]
[junitlauncher] Running org.apache.poi.ooxml.TestPOIXMLDocument
[junitlauncher] Tests run: 11, Failures: 0, Aborted: 0, Skipped: 0, Time elapsed: 2.036000 sec
[junitlauncher]
[junitlauncher] Running org.apache.poi.ooxml.TestPOIXMLProperties
[junitlauncher] Tests run: 11, Failures: 0, Aborted: 0, Skipped: 1, Time elapsed: 0.385000 sec
[junitlauncher]
[junitlauncher] Running org.apache.poi.ooxml.TestTriggerCoverage
[junitlauncher]    Aborted: [3] <https://ci-builds.apache.org/job/POI/job/POI-DSL-OpenJDK/ws/test-data/integration/stress025.docx>
[junitlauncher] Tests run: 25, Failures: 0, Aborted: 1, Skipped: 0, Time elapsed: 15.261000 sec
[junitlauncher]
[junitlauncher] Running org.apache.poi.ooxml.TestXMLPropertiesTextExtractor
[junitlauncher] Tests run: 5, Failures: 0, Aborted: 0, Skipped: 0, Time elapsed: 0.069000 sec
[junitlauncher]
[junitlauncher] Running org.apache.poi.openxml4j.opc.TestContentType
[junitlauncher] Tests run: 39, Failures: 0, Aborted: 0, Skipped: 0, Time elapsed: 0.054000 sec
[junitlauncher]
[junitlauncher] Running org.apache.poi.openxml4j.opc.TestFileHelper
[junitlauncher] Tests run: 1, Failures: 0, Aborted: 0, Skipped: 0, Time elapsed: 0.002000 sec
[junitlauncher]
[junitlauncher] Running org.apache.poi.openxml4j.opc.TestListParts
[junitlauncher] Tests run: 1, Failures: 0, Aborted: 0, Skipped: 0, Time elapsed: 0.006000 sec
[junitlauncher]
[junitlauncher] Running org.apache.poi.openxml4j.opc.TestPackage
[junitlauncher] Tests run: 43, Failures: 0, Aborted: 0, Skipped: 1, Time elapsed: 1.394000 sec
[junitlauncher]
[junitlauncher] Running org.apache.poi.openxml4j.opc.TestPackageCoreProperties
[junitlauncher] Tests run: 7, Failures: 0, Aborted: 0, Skipped: 0, Time elapsed: 0.074000 sec
[junitlauncher]
[junitlauncher] Running org.apache.poi.openxml4j.opc.TestPackagePartName
[junitlauncher] Tests run: 1, Failures: 0, Aborted: 0, Skipped: 0, Time elapsed: 0.001000 sec
[junitlauncher]
[junitlauncher] Running org.apache.poi.openxml4j.opc.TestPackageThumbnail
[junitlauncher] Tests run: 1, Failures: 0, Aborted: 0, Skipped: 0, Time elapsed: 0.014000 sec
[junitlauncher]
[junitlauncher] Running org.apache.poi.openxml4j.opc.TestPackagingURIHelper
[junitlauncher] Tests run: 5, Failures: 0, Aborted: 0, Skipped: 0, Time elapsed: 0.006000 sec
[junitlauncher]
[junitlauncher] Running org.apache.poi.openxml4j.opc.TestRelationships
[junitlauncher] Tests run: 9, Failures: 0, Aborted: 0, Skipped: 0, Time elapsed: 0.063000 sec
[junitlauncher]
[junitlauncher] Running org.apache.poi.openxml4j.opc.compliance.TestOPCComplianceCoreProperties
[junitlauncher] Tests run: 11, Failures: 0, Aborted: 0, Skipped: 0, Time elapsed: 0.080000 sec
[junitlauncher]
[junitlauncher] Running org.apache.poi.openxml4j.opc.compliance.TestOPCCompliancePackageModel
[junitlauncher] Tests run: 6, Failures: 0, Aborted: 0, Skipped: 0, Time elapsed: 0.024000 sec
[junitlauncher]
[junitlauncher] Running org.apache.poi.openxml4j.opc.compliance.TestOPCCompliancePartName
[junitlauncher] Tests run: 10, Failures: 0, Aborted: 0, Skipped: 0, Time elapsed: 0.011000 sec
[junitlauncher]
[junitlauncher] Running org.apache.poi.openxml4j.opc.internal.TestContentTypeManager
[junitlauncher] Tests run: 4, Failures: 0, Aborted: 0, Skipped: 0, Time elapsed: 0.130000 sec
[junitlauncher]
[junitlauncher] Running org.apache.poi.openxml4j.opc.internal.marshallers.TestZipPackagePropertiesMarshaller
[junitlauncher] Tests run: 3, Failures: 0, Aborted: 0, Skipped: 0, Time elapsed: 0.004000 sec
[junitlauncher]
[junitlauncher] Running org.apache.poi.openxml4j.util.TestZipSecureFile
[junitlauncher] Tests run: 1, Failures: 0, Aborted: 0, Skipped: 0, Time elapsed: 0.025000 sec
[junitlauncher]
[junitlauncher] Running org.apache.poi.poifs.crypt.dsig.TestSignatureConfig
[junitlauncher] Tests run: 2, Failures: 0, Aborted: 0, Skipped: 1, Time elapsed: 0.008000 sec
[junitlauncher]
[junitlauncher] Running org.apache.poi.poifs.crypt.dsig.TestSignatureInfo
[junitlauncher]    Failed: testRetrieveCertificate()
[junitlauncher]    Failed: testSignatureImage()
[junitlauncher]    Failed: bug58630()
[junitlauncher]    Failed: getSignerUnsigned()
[junitlauncher]    Failed: office2007prettyPrintedRels()
[junitlauncher]    Failed: testCertChain()
[junitlauncher]    Failed: testMultiSign()
[junitlauncher]    Failed: testManipulation()
[junitlauncher]    Failed: testSignSpreadsheet()
[junitlauncher]    Failed: getSigner()
[junitlauncher]    Failed: testSignSpreadsheetWithSignatureInfo()
[junitlauncher]    Failed: testSignEnvelopingDocument()
[junitlauncher]    Failed: testNonSha1()
[junitlauncher]    Failed: getMultiSigners()
[junitlauncher] Tests run: 15, Failures: 14, Aborted: 0, Skipped: 1, Time elapsed: 3.777000 sec

BUILD FAILED
<https://ci-builds.apache.org/job/POI/job/POI-DSL-OpenJDK/ws/build.xml>:1753: The following error occurred while executing this line:
<https://ci-builds.apache.org/job/POI/job/POI-DSL-OpenJDK/ws/build.xml>:1725: The following error occurred while executing this line:
<https://ci-builds.apache.org/job/POI/job/POI-DSL-OpenJDK/ws/build.xml>:1338: Some test(s) have failure(s)

Total time: 8 minutes 7 seconds
Build step 'Invoke Ant' marked build as failure
[SpotBugs] Skipping execution of recorder since overall result is 'FAILURE'
Archiving artifacts
[Fast Archiver] Compressed 2.79 MB of artifacts by 24.6% relative to #130
Skipping publisher since build result is FAILURE
Recording test results

---------------------------------------------------------------------
To unsubscribe, e-mail: [hidden email]
For additional commands, e-mail: [hidden email]

Reply | Threaded
Open this post in threaded view
|

Build failed in Jenkins: POI » POI-DSL-OpenJDK #132

Apache Jenkins Server
See <https://ci-builds.apache.org/job/POI/job/POI-DSL-OpenJDK/132/display/redirect?page=changes>

Changes:

[Marius Volkhart] [bug-63046] Fix Java 16 build

org.apache.santuario:xmlsec:2.2.0 has a dependency on SLF4J. We use this in SignatureInfo.java.


------------------------------------------
[...truncated 849.77 KB...]
  [javadoc]                                                          ^
  [javadoc] <https://ci-builds.apache.org/job/POI/job/POI-DSL-OpenJDK/ws/src/ooxml/java/org/apache/poi/xssf/streaming/DeferredSXSSFSheet.java>:28: error: unexpected end tag: </code>
  [javadoc]  * A variant of SXSSFSheet that uses a <code>RowGeneratorFunction</code></code> to lazily create rows.
  [javadoc]                                                                         ^
  [javadoc] <https://ci-builds.apache.org/job/POI/job/POI-DSL-OpenJDK/ws/src/ooxml/java/org/apache/poi/xssf/streaming/SXSSFRow.java>:120: error: malformed HTML
  [javadoc]      * @throws IllegalArgumentException if columnIndex < 0 or greater than the maximum number of supported columns
  [javadoc]                                                        ^
  [javadoc] <https://ci-builds.apache.org/job/POI/job/POI-DSL-OpenJDK/ws/src/ooxml/java/org/apache/poi/xssf/streaming/SXSSFRow.java>:137: error: malformed HTML
  [javadoc]      * @throws IllegalArgumentException if columnIndex < 0 or greater than a maximum number of supported columns
  [javadoc]                                                        ^
  [javadoc] <https://ci-builds.apache.org/job/POI/job/POI-DSL-OpenJDK/ws/src/ooxml/java/org/apache/poi/xssf/streaming/SXSSFRow.java>:195: error: malformed HTML
  [javadoc]      * @throws IllegalArgumentException if rowNum < 0
  [javadoc]                                                   ^
  [javadoc] <https://ci-builds.apache.org/job/POI/job/POI-DSL-OpenJDK/ws/src/ooxml/java/org/apache/poi/xssf/streaming/SXSSFRow.java>:235: error: malformed HTML
  [javadoc]      * @throws IllegalArgumentException if cellnum < 0 or the specified MissingCellPolicy is invalid
  [javadoc]                                                    ^
  [javadoc] <https://ci-builds.apache.org/job/POI/job/POI-DSL-OpenJDK/ws/src/ooxml/java/org/apache/poi/xssf/usermodel/XSSFColor.java>:265: error: unknown tag: clrScheme
  [javadoc]      * Index into the <clrScheme> collection, referencing a particular <sysClr> or
  [javadoc]                       ^
  [javadoc] <https://ci-builds.apache.org/job/POI/job/POI-DSL-OpenJDK/ws/src/ooxml/java/org/apache/poi/xssf/usermodel/XSSFColor.java>:265: error: unknown tag: sysClr
  [javadoc]      * Index into the <clrScheme> collection, referencing a particular <sysClr> or
  [javadoc]                                                                        ^
  [javadoc] <https://ci-builds.apache.org/job/POI/job/POI-DSL-OpenJDK/ws/src/ooxml/java/org/apache/poi/xssf/usermodel/XSSFColor.java>:266: error: unknown tag: srgbClr
  [javadoc]      *  <srgbClr> value expressed in the Theme part.
  [javadoc]         ^
  [javadoc] <https://ci-builds.apache.org/job/POI/job/POI-DSL-OpenJDK/ws/src/ooxml/java/org/apache/poi/xssf/usermodel/XSSFColor.java>:274: error: unknown tag: clrScheme
  [javadoc]      * Index into the <clrScheme> collection, referencing a particular <sysClr> or
  [javadoc]                       ^
  [javadoc] <https://ci-builds.apache.org/job/POI/job/POI-DSL-OpenJDK/ws/src/ooxml/java/org/apache/poi/xssf/usermodel/XSSFColor.java>:274: error: unknown tag: sysClr
  [javadoc]      * Index into the <clrScheme> collection, referencing a particular <sysClr> or
  [javadoc]                                                                        ^
  [javadoc] <https://ci-builds.apache.org/job/POI/job/POI-DSL-OpenJDK/ws/src/ooxml/java/org/apache/poi/xssf/usermodel/XSSFColor.java>:275: error: unknown tag: srgbClr
  [javadoc]      *  <srgbClr> value expressed in the Theme part.
  [javadoc]         ^
  [javadoc] <https://ci-builds.apache.org/job/POI/job/POI-DSL-OpenJDK/ws/src/ooxml/java/org/apache/poi/xssf/usermodel/XSSFDxfStyleProvider.java>:42: error: bad use of '>'
  [javadoc]      * @param stripeSize 0 for non-stripe styles, > 1 for stripes
  [javadoc]                                                   ^
  [javadoc] <https://ci-builds.apache.org/job/POI/job/POI-DSL-OpenJDK/ws/src/ooxml/java/org/apache/poi/xssf/usermodel/XSSFName.java>:146: error: tag not allowed here: <blockquote>
  [javadoc]      * <pre><blockquote>
  [javadoc]             ^
  [javadoc] <https://ci-builds.apache.org/job/POI/job/POI-DSL-OpenJDK/ws/src/ooxml/java/org/apache/poi/xssf/usermodel/XSSFName.java>:165: error: unexpected end tag: </p>
  [javadoc]     * </p>
  [javadoc]       ^
  [javadoc] <https://ci-builds.apache.org/job/POI/job/POI-DSL-OpenJDK/ws/src/ooxml/java/org/apache/poi/xssf/usermodel/XSSFName.java>:36: error: tag not allowed here: <blockquote>
  [javadoc]  * <pre><blockquote>
  [javadoc]         ^
  [javadoc] <https://ci-builds.apache.org/job/POI/job/POI-DSL-OpenJDK/ws/src/ooxml/java/org/apache/poi/xssf/usermodel/XSSFName.java>:86: error: tag not allowed here: <li>
  [javadoc]      * <li> this defined name refers to a range to which an advanced filter has been
  [javadoc]        ^
  [javadoc] <https://ci-builds.apache.org/job/POI/job/POI-DSL-OpenJDK/ws/src/ooxml/java/org/apache/poi/xssf/usermodel/XSSFName.java>:88: error: tag not allowed here: <li>
  [javadoc]      * <li> This defined name refers to a range to which an AutoFilter has been
  [javadoc]        ^
  [javadoc] <https://ci-builds.apache.org/job/POI/job/POI-DSL-OpenJDK/ws/src/ooxml/java/org/apache/poi/xssf/usermodel/XSSFRichTextString.java>:445: error: bad use of '>'
  [javadoc]      * CTRPrElt --> CTFont adapter
  [javadoc]                   ^
  [javadoc] <https://ci-builds.apache.org/job/POI/job/POI-DSL-OpenJDK/ws/src/ooxml/java/org/apache/poi/xssf/usermodel/XSSFRow.java>:106: error: unknown tag: Cell
  [javadoc]      * for (Iterator<Cell> it = row.cellIterator(); it.hasNext(); ) {
  [javadoc]                     ^
  [javadoc] <https://ci-builds.apache.org/job/POI/job/POI-DSL-OpenJDK/ws/src/ooxml/java/org/apache/poi/xssf/usermodel/XSSFRow.java>:193: error: malformed HTML
  [javadoc]      * @throws IllegalArgumentException if columnIndex < 0 or greater than 16384,
  [javadoc]                                                        ^
  [javadoc] <https://ci-builds.apache.org/job/POI/job/POI-DSL-OpenJDK/ws/src/ooxml/java/org/apache/poi/xssf/usermodel/XSSFRow.java>:207: error: malformed HTML
  [javadoc]      * @throws IllegalArgumentException if the specified cell type is invalid, columnIndex < 0
  [javadoc]                                                                                            ^
  [javadoc] <https://ci-builds.apache.org/job/POI/job/POI-DSL-OpenJDK/ws/src/ooxml/java/org/apache/poi/xssf/usermodel/XSSFRow.java>:415: error: malformed HTML
  [javadoc]      * @throws IllegalArgumentException if rowNum < 0 or greater than 1048575
  [javadoc]                                                   ^
  [javadoc] <https://ci-builds.apache.org/job/POI/job/POI-DSL-OpenJDK/ws/src/ooxml/java/org/apache/poi/xssf/usermodel/XSSFSheetConditionalFormatting.java>:70: error: unexpected end tag: </p>
  [javadoc]      * </p>
  [javadoc]        ^
  [javadoc] <https://ci-builds.apache.org/job/POI/job/POI-DSL-OpenJDK/ws/src/ooxml/java/org/apache/poi/xssf/usermodel/XSSFWorkbook.java>:831: error: unexpected end tag: </p>
  [javadoc]      * </p>
  [javadoc]        ^
  [javadoc] <https://ci-builds.apache.org/job/POI/job/POI-DSL-OpenJDK/ws/src/ooxml/java/org/apache/poi/xssf/usermodel/XSSFWorkbook.java>:848: error: unexpected end tag: </p>
  [javadoc]      * </p>
  [javadoc]        ^
  [javadoc] <https://ci-builds.apache.org/job/POI/job/POI-DSL-OpenJDK/ws/src/ooxml/java/org/apache/poi/xssf/usermodel/extensions/XSSFHeaderFooter.java>:40: error: semicolon missing
  [javadoc]  * section), and the date on the second line (center section). &CCenter
  [javadoc]                                                                ^
  [javadoc] <https://ci-builds.apache.org/job/POI/job/POI-DSL-OpenJDK/ws/src/ooxml/java/org/apache/poi/xssf/usermodel/extensions/XSSFHeaderFooter.java>:41: error: bad HTML entity
  [javadoc]  * &"-,Bold"Bold &"-,Regular"Header_x000A_&D
  [javadoc]    ^
  [javadoc] <https://ci-builds.apache.org/job/POI/job/POI-DSL-OpenJDK/ws/src/ooxml/java/org/apache/poi/xssf/usermodel/extensions/XSSFHeaderFooter.java>:41: error: bad HTML entity
  [javadoc]  * &"-,Bold"Bold &"-,Regular"Header_x000A_&D
  [javadoc]                  ^
  [javadoc] <https://ci-builds.apache.org/job/POI/job/POI-DSL-OpenJDK/ws/src/ooxml/java/org/apache/poi/xssf/usermodel/extensions/XSSFHeaderFooter.java>:41: error: semicolon missing
  [javadoc]  * &"-,Bold"Bold &"-,Regular"Header_x000A_&D
  [javadoc]                                           ^
  [javadoc] <https://ci-builds.apache.org/job/POI/job/POI-DSL-OpenJDK/ws/src/ooxml/java/org/apache/poi/xssf/usermodel/extensions/XSSFHeaderFooter.java>:48: error: semicolon missing
  [javadoc]  * <dt>&L</dt>
  [javadoc]        ^
  [javadoc] <https://ci-builds.apache.org/job/POI/job/POI-DSL-OpenJDK/ws/src/ooxml/java/org/apache/poi/xssf/usermodel/extensions/XSSFHeaderFooter.java>:53: error: semicolon missing
  [javadoc]  * <dt>&P</dt>
  [javadoc]        ^
  [javadoc] <https://ci-builds.apache.org/job/POI/job/POI-DSL-OpenJDK/ws/src/ooxml/java/org/apache/poi/xssf/usermodel/extensions/XSSFHeaderFooter.java>:55: error: semicolon missing
  [javadoc]  * <dt>&N</dt>
  [javadoc]        ^
  [javadoc] <https://ci-builds.apache.org/job/POI/job/POI-DSL-OpenJDK/ws/src/ooxml/java/org/apache/poi/xssf/usermodel/extensions/XSSFHeaderFooter.java>:57: error: semicolon missing
  [javadoc]  * <dt>&font size</dt>
  [javadoc]        ^
  [javadoc] <https://ci-builds.apache.org/job/POI/job/POI-DSL-OpenJDK/ws/src/ooxml/java/org/apache/poi/xssf/usermodel/extensions/XSSFHeaderFooter.java>:59: error: semicolon missing
  [javadoc]  * <dt>&K</dt>
  [javadoc]        ^
  [javadoc] <https://ci-builds.apache.org/job/POI/job/POI-DSL-OpenJDK/ws/src/ooxml/java/org/apache/poi/xssf/usermodel/extensions/XSSFHeaderFooter.java>:63: error: semicolon missing
  [javadoc]  * <dt>&S</dt>
  [javadoc]        ^
  [javadoc] <https://ci-builds.apache.org/job/POI/job/POI-DSL-OpenJDK/ws/src/ooxml/java/org/apache/poi/xssf/usermodel/extensions/XSSFHeaderFooter.java>:65: error: semicolon missing
  [javadoc]  * <dt>&X</dt>
  [javadoc]        ^
  [javadoc] <https://ci-builds.apache.org/job/POI/job/POI-DSL-OpenJDK/ws/src/ooxml/java/org/apache/poi/xssf/usermodel/extensions/XSSFHeaderFooter.java>:67: error: semicolon missing
  [javadoc]  * <dt>&Y</dt>
  [javadoc]        ^
  [javadoc] <https://ci-builds.apache.org/job/POI/job/POI-DSL-OpenJDK/ws/src/ooxml/java/org/apache/poi/xssf/usermodel/extensions/XSSFHeaderFooter.java>:69: error: semicolon missing
  [javadoc]  * <dt>&C</dt>
  [javadoc]        ^
  [javadoc] <https://ci-builds.apache.org/job/POI/job/POI-DSL-OpenJDK/ws/src/ooxml/java/org/apache/poi/xssf/usermodel/extensions/XSSFHeaderFooter.java>:74: error: semicolon missing
  [javadoc]  * <dt>&D</dt>
  [javadoc]        ^
  [javadoc] <https://ci-builds.apache.org/job/POI/job/POI-DSL-OpenJDK/ws/src/ooxml/java/org/apache/poi/xssf/usermodel/extensions/XSSFHeaderFooter.java>:76: error: semicolon missing
  [javadoc]  * <dt>&T</dt>
  [javadoc]        ^
  [javadoc] <https://ci-builds.apache.org/job/POI/job/POI-DSL-OpenJDK/ws/src/ooxml/java/org/apache/poi/xssf/usermodel/extensions/XSSFHeaderFooter.java>:78: error: semicolon missing
  [javadoc]  * <dt>&G</dt>
  [javadoc]        ^
  [javadoc] <https://ci-builds.apache.org/job/POI/job/POI-DSL-OpenJDK/ws/src/ooxml/java/org/apache/poi/xssf/usermodel/extensions/XSSFHeaderFooter.java>:80: error: semicolon missing
  [javadoc]  * <dt>&U</dt>
  [javadoc]        ^
  [javadoc] 100 errors
  [javadoc] 100 warnings
      [jar] Building jar: <https://ci-builds.apache.org/job/POI/job/POI-DSL-OpenJDK/ws/build/dist/maven/poi-ooxml/poi-ooxml-5.0.1-SNAPSHOT-javadoc.jar>

assemble:
      [zip] Building zip: <https://ci-builds.apache.org/job/POI/job/POI-DSL-OpenJDK/ws/build/dist/poi-bin-5.0.1-SNAPSHOT-20210223.zip>
      [tar] Building tar: <https://ci-builds.apache.org/job/POI/job/POI-DSL-OpenJDK/132/artifact/build/dist/poi-bin-5.0.1-SNAPSHOT-20210223.tar.gz>
      [zip] Building zip: <https://ci-builds.apache.org/job/POI/job/POI-DSL-OpenJDK/ws/build/dist/poi-src-5.0.1-SNAPSHOT-20210223.zip>
      [tar] Building tar: <https://ci-builds.apache.org/job/POI/job/POI-DSL-OpenJDK/132/artifact/build/dist/poi-src-5.0.1-SNAPSHOT-20210223.tar.gz>
     [echo] Creating Maven POMs

maven-poms:
     [copy] Copying 7 files to <https://ci-builds.apache.org/job/POI/job/POI-DSL-OpenJDK/ws/build/dist/maven>
     [echo] Maven POMs are located in <https://ci-builds.apache.org/job/POI/job/POI-DSL-OpenJDK/ws/build/dist>
     [echo] Use ant dist-nexus to deploy the artifacts in the remote repository
     [echo] Distribution located in <https://ci-builds.apache.org/job/POI/job/POI-DSL-OpenJDK/ws/build/dist>
     [echo] Use "ant dist-checksum" to create sha256/sha512 checksums and GPG signatures

findbugs:
    [mkdir] Created dir: <https://ci-builds.apache.org/job/POI/job/POI-DSL-OpenJDK/ws/build/findbugs/lib/config>
      [get] Getting: https://repo1.maven.org/maven2/com/github/spotbugs/spotbugs/4.2.0/spotbugs-4.2.0.jar
      [get] To: <https://ci-builds.apache.org/job/POI/job/POI-DSL-OpenJDK/ws/build/findbugs/lib/spotbugs.jar>
      [get] Getting: https://repo1.maven.org/maven2/com/github/spotbugs/spotbugs-ant/4.2.0/spotbugs-ant-4.2.0.jar
      [get] To: <https://ci-builds.apache.org/job/POI/job/POI-DSL-OpenJDK/ws/build/findbugs/lib/spotbugs-ant.jar>
      [get] Getting: https://repo1.maven.org/maven2/com/github/spotbugs/spotbugs-annotations/4.2.0/spotbugs-annotations-4.2.0.jar
      [get] To: <https://ci-builds.apache.org/job/POI/job/POI-DSL-OpenJDK/ws/build/findbugs/lib/spotbugs-annotations.jar>
      [get] Getting: https://repo1.maven.org/maven2/org/dom4j/dom4j/2.1.3/dom4j-2.1.3.jar
      [get] To: <https://ci-builds.apache.org/job/POI/job/POI-DSL-OpenJDK/ws/build/findbugs/lib/dom4j-2.1.3.jar>
      [get] Getting: https://repo1.maven.org/maven2/jaxen/jaxen/1.2.0/jaxen-1.2.0.jar
      [get] To: <https://ci-builds.apache.org/job/POI/job/POI-DSL-OpenJDK/ws/build/findbugs/lib/jaxen-1.2.0.jar>
      [get] Getting: https://repo1.maven.org/maven2/org/apache/bcel/bcel/6.5.0/bcel-6.5.0.jar
      [get] To: <https://ci-builds.apache.org/job/POI/job/POI-DSL-OpenJDK/ws/build/findbugs/lib/bcel-6.5.0.jar>
      [get] Getting: https://repo1.maven.org/maven2/org/slf4j/slf4j-api/1.8.0-beta4/slf4j-api-1.8.0-beta4.jar
      [get] To: <https://ci-builds.apache.org/job/POI/job/POI-DSL-OpenJDK/ws/build/findbugs/lib/slf4j-api-1.8.0-beta4.jar>
      [get] Getting: https://repo1.maven.org/maven2/org/apache/commons/commons-lang3/3.11/commons-lang3-3.11.jar
      [get] To: <https://ci-builds.apache.org/job/POI/job/POI-DSL-OpenJDK/ws/build/findbugs/lib/commons-lang3-3.11.jar>
      [get] Getting: https://repo1.maven.org/maven2/org/apache/commons/commons-text/1.9/commons-text-1.9.jar
      [get] To: <https://ci-builds.apache.org/job/POI/job/POI-DSL-OpenJDK/ws/build/findbugs/lib/commons-text-1.9.jar>
      [get] Getting: https://repo1.maven.org/maven2/net/jcip/jcip-annotations/1.0/jcip-annotations-1.0.jar
      [get] To: <https://ci-builds.apache.org/job/POI/job/POI-DSL-OpenJDK/ws/build/findbugs/lib/jcip-annotations-1.0.jar>
      [get] Getting: https://repo1.maven.org/maven2/com/google/code/findbugs/jsr305/3.0.2/jsr305-3.0.2.jar
      [get] To: <https://ci-builds.apache.org/job/POI/job/POI-DSL-OpenJDK/ws/build/findbugs/lib/jsr305-3.0.2.jar>
      [get] Getting: https://repo1.maven.org/maven2/org/ow2/asm/asm/9.0/asm-9.0.jar
      [get] To: <https://ci-builds.apache.org/job/POI/job/POI-DSL-OpenJDK/ws/build/findbugs/lib/asm-9.0.jar>
      [get] Getting: https://repo1.maven.org/maven2/org/ow2/asm/asm-analysis/9.0/asm-analysis-9.0.jar
      [get] To: <https://ci-builds.apache.org/job/POI/job/POI-DSL-OpenJDK/ws/build/findbugs/lib/asm-analysis-9.0.jar>
      [get] Getting: https://repo1.maven.org/maven2/org/ow2/asm/asm-commons/9.0/asm-commons-9.0.jar
      [get] To: <https://ci-builds.apache.org/job/POI/job/POI-DSL-OpenJDK/ws/build/findbugs/lib/asm-commons-9.0.jar>
      [get] Getting: https://repo1.maven.org/maven2/org/ow2/asm/asm-tree/9.0/asm-tree-9.0.jar
      [get] To: <https://ci-builds.apache.org/job/POI/job/POI-DSL-OpenJDK/ws/build/findbugs/lib/asm-tree-9.0.jar>
      [get] Getting: https://repo1.maven.org/maven2/org/ow2/asm/asm-util/9.0/asm-util-9.0.jar
      [get] To: <https://ci-builds.apache.org/job/POI/job/POI-DSL-OpenJDK/ws/build/findbugs/lib/asm-util-9.0.jar>
      [get] Getting: https://repo1.maven.org/maven2/org/apache/logging/log4j/log4j-api/2.14.0/log4j-api-2.14.0.jar
      [get] To: <https://ci-builds.apache.org/job/POI/job/POI-DSL-OpenJDK/ws/build/findbugs/lib/log4j-api-2.14.0.jar>
      [get] Getting: https://repo1.maven.org/maven2/org/apache/logging/log4j/log4j-core/2.14.0/log4j-core-2.14.0.jar
      [get] To: <https://ci-builds.apache.org/job/POI/job/POI-DSL-OpenJDK/ws/build/findbugs/lib/log4j-core-2.14.0.jar>
      [get] Getting: https://repo1.maven.org/maven2/org/apache/logging/log4j/log4j-slf4j18-impl/2.14.0/log4j-slf4j18-impl-2.14.0.jar
      [get] To: <https://ci-builds.apache.org/job/POI/job/POI-DSL-OpenJDK/ws/build/findbugs/lib/log4j-slf4j18-impl-2.14.0.jar>
      [get] Getting: https://repo1.maven.org/maven2/net/sf/saxon/Saxon-HE/9.9.1-8/Saxon-HE-9.9.1-8.jar
      [get] To: <https://ci-builds.apache.org/job/POI/job/POI-DSL-OpenJDK/ws/build/findbugs/lib/Saxon-HE-9.9.1-8.jar>
      [get] Getting: https://repo1.maven.org/maven2/com/ibm/icu/icu4j/68.2/icu4j-68.2.jar
      [get] To: <https://ci-builds.apache.org/job/POI/job/POI-DSL-OpenJDK/ws/build/findbugs/lib/icu4j-63.1.jar>
 [spotbugs] Executing SpotBugs FindBugsTask from ant task
 [spotbugs] Running SpotBugs...
 [spotbugs] Java Result: 1
 [spotbugs] Output saved to build/findbugs.xml
     [xslt] Transforming into <https://ci-builds.apache.org/job/POI/job/POI-DSL-OpenJDK/ws/build>
     [xslt] Processing <https://ci-builds.apache.org/job/POI/job/POI-DSL-OpenJDK/ws/build/findbugs.xml> to <https://ci-builds.apache.org/job/POI/job/POI-DSL-OpenJDK/132/artifact/build/findbugs.html>
     [xslt] Loading stylesheet jar:<https://ci-builds.apache.org/job/POI/job/POI-DSL-OpenJDK/ws/build/findbugs/lib/spotbugs.jar!/fancy.xsl>

release-notes:
     [copy] Copying 1 file to <https://ci-builds.apache.org/job/POI/job/POI-DSL-OpenJDK/ws/build/dist>

rat-check:
    [mkdir] Created dir: <https://ci-builds.apache.org/job/POI/job/POI-DSL-OpenJDK/ws/build/rat>
     [echo]
     [echo] *****************************************************
     [echo] Summary
     [echo] -------
     [echo] Generated at: 2021-02-23T00:33:10+00:00
     [echo]
     [echo] Notes: 0
     [echo] Binaries: 114
     [echo] Archives: 0
     [echo] Standards: 3752
     [echo]
     [echo] Apache Licensed: 3752
     [echo] Generated Documents: 0
     [echo]
     [echo] JavaDocs are generated, thus a license header is optional.
     [echo] Generated files do not require license headers.
     [echo]
     [echo] 0 Unknown Licenses
     [echo]
     [echo] *****************************************************
     [echo]   Files with Apache License headers will be marked AL
     [echo]   Binary files (which do not require any license headers) will be marked B
     [echo]   Compressed archives will be marked A
     [echo]   Notices, licenses etc. will be marked N
     [echo]  
     [echo] *****************************************************

forbidden-apis-check:
[forbiddenapis] Reading bundled API signatures: jdk-unsafe-1.8
[forbiddenapis] Reading bundled API signatures: jdk-deprecated-1.8
[forbiddenapis] Reading bundled API signatures: jdk-internal-1.8
[forbiddenapis] Reading bundled API signatures: jdk-non-portable
[forbiddenapis] Reading bundled API signatures: jdk-reflection
[forbiddenapis] Reading API signatures: <https://ci-builds.apache.org/job/POI/job/POI-DSL-OpenJDK/ws/src/resources/devtools/forbidden-signatures.txt>
[forbiddenapis] Loading classes to check...
[forbiddenapis] Scanning classes for violations...

BUILD FAILED
<https://ci-builds.apache.org/job/POI/job/POI-DSL-OpenJDK/ws/build.xml>:2517: Check for forbidden API calls failed while scanning class 'org.apache.poi.xslf.draw.SVGRenderExtension': java.lang.ClassNotFoundException: org.apache.batik.svggen.DefaultExtensionHandler (while looking up details about referenced class 'org.apache.poi.xslf.draw.SVGRenderExtension')

Total time: 26 minutes 11 seconds
Build step 'Invoke Ant' marked build as failure
[SpotBugs] Skipping execution of recorder since overall result is 'FAILURE'
Archiving artifacts
[Fast Archiver] Compressed 220.88 MB of artifacts by 25.0% relative to #130
Skipping publisher since build result is FAILURE
Recording test results

---------------------------------------------------------------------
To unsubscribe, e-mail: [hidden email]
For additional commands, e-mail: [hidden email]

Reply | Threaded
Open this post in threaded view
|

Jenkins build is back to normal : POI » POI-DSL-OpenJDK #133

Apache Jenkins Server
See <https://ci-builds.apache.org/job/POI/job/POI-DSL-OpenJDK/133/display/redirect?page=changes>


---------------------------------------------------------------------
To unsubscribe, e-mail: [hidden email]
For additional commands, e-mail: [hidden email]