Build failed in Jenkins: POI » POI-DSL-OpenJDK #118

classic Classic list List threaded Threaded
2 messages Options
Reply | Threaded
Open this post in threaded view
|

Build failed in Jenkins: POI » POI-DSL-OpenJDK #118

Apache Jenkins Server
See <https://ci-builds.apache.org/job/POI/job/POI-DSL-OpenJDK/118/display/redirect?page=changes>

Changes:

[PJ Fanning] remove accidental commit

[PJ Fanning] [bug-65120] PartAlreadyExistsException when creating cell comments (after some comments removed). Thanks to Raúl Wegmann


------------------------------------------
[...truncated 478.67 KB...]
  [javadoc]      * </p>
  [javadoc]        ^
  [javadoc] /home/jenkins/jenkins-agent/workspace/POI/POI-DSL-OpenJDK/src/ooxml/java/org/apache/poi/xssf/usermodel/XSSFWorkbook.java:839: error: unexpected end tag: </p>
  [javadoc]      * </p>
  [javadoc]        ^
  [javadoc] /home/jenkins/jenkins-agent/workspace/POI/POI-DSL-OpenJDK/src/ooxml/java/org/apache/poi/xssf/usermodel/extensions/XSSFHeaderFooter.java:40: error: semicolon missing
  [javadoc]  * section), and the date on the second line (center section). &CCenter
  [javadoc]                                                                ^
  [javadoc] /home/jenkins/jenkins-agent/workspace/POI/POI-DSL-OpenJDK/src/ooxml/java/org/apache/poi/xssf/usermodel/extensions/XSSFHeaderFooter.java:41: error: bad HTML entity
  [javadoc]  * &"-,Bold"Bold &"-,Regular"Header_x000A_&D
  [javadoc]    ^
  [javadoc] /home/jenkins/jenkins-agent/workspace/POI/POI-DSL-OpenJDK/src/ooxml/java/org/apache/poi/xssf/usermodel/extensions/XSSFHeaderFooter.java:41: error: bad HTML entity
  [javadoc]  * &"-,Bold"Bold &"-,Regular"Header_x000A_&D
  [javadoc]                  ^
  [javadoc] /home/jenkins/jenkins-agent/workspace/POI/POI-DSL-OpenJDK/src/ooxml/java/org/apache/poi/xssf/usermodel/extensions/XSSFHeaderFooter.java:41: error: semicolon missing
  [javadoc]  * &"-,Bold"Bold &"-,Regular"Header_x000A_&D
  [javadoc]                                           ^
  [javadoc] /home/jenkins/jenkins-agent/workspace/POI/POI-DSL-OpenJDK/src/ooxml/java/org/apache/poi/xssf/usermodel/extensions/XSSFHeaderFooter.java:48: error: semicolon missing
  [javadoc]  * <dt>&L</dt>
  [javadoc]        ^
  [javadoc] /home/jenkins/jenkins-agent/workspace/POI/POI-DSL-OpenJDK/src/ooxml/java/org/apache/poi/xssf/usermodel/extensions/XSSFHeaderFooter.java:53: error: semicolon missing
  [javadoc]  * <dt>&P</dt>
  [javadoc]        ^
  [javadoc] /home/jenkins/jenkins-agent/workspace/POI/POI-DSL-OpenJDK/src/ooxml/java/org/apache/poi/xssf/usermodel/extensions/XSSFHeaderFooter.java:55: error: semicolon missing
  [javadoc]  * <dt>&N</dt>
  [javadoc]        ^
  [javadoc] /home/jenkins/jenkins-agent/workspace/POI/POI-DSL-OpenJDK/src/ooxml/java/org/apache/poi/xssf/usermodel/extensions/XSSFHeaderFooter.java:57: error: semicolon missing
  [javadoc]  * <dt>&font size</dt>
  [javadoc]        ^
  [javadoc] /home/jenkins/jenkins-agent/workspace/POI/POI-DSL-OpenJDK/src/ooxml/java/org/apache/poi/xssf/usermodel/extensions/XSSFHeaderFooter.java:59: error: semicolon missing
  [javadoc]  * <dt>&K</dt>
  [javadoc]        ^
  [javadoc] /home/jenkins/jenkins-agent/workspace/POI/POI-DSL-OpenJDK/src/ooxml/java/org/apache/poi/xssf/usermodel/extensions/XSSFHeaderFooter.java:63: error: semicolon missing
  [javadoc]  * <dt>&S</dt>
  [javadoc]        ^
  [javadoc] /home/jenkins/jenkins-agent/workspace/POI/POI-DSL-OpenJDK/src/ooxml/java/org/apache/poi/xssf/usermodel/extensions/XSSFHeaderFooter.java:65: error: semicolon missing
  [javadoc]  * <dt>&X</dt>
  [javadoc]        ^
  [javadoc] /home/jenkins/jenkins-agent/workspace/POI/POI-DSL-OpenJDK/src/ooxml/java/org/apache/poi/xssf/usermodel/extensions/XSSFHeaderFooter.java:67: error: semicolon missing
  [javadoc]  * <dt>&Y</dt>
  [javadoc]        ^
  [javadoc] /home/jenkins/jenkins-agent/workspace/POI/POI-DSL-OpenJDK/src/ooxml/java/org/apache/poi/xssf/usermodel/extensions/XSSFHeaderFooter.java:69: error: semicolon missing
  [javadoc]  * <dt>&C</dt>
  [javadoc]        ^
  [javadoc] /home/jenkins/jenkins-agent/workspace/POI/POI-DSL-OpenJDK/src/ooxml/java/org/apache/poi/xssf/usermodel/extensions/XSSFHeaderFooter.java:74: error: semicolon missing
  [javadoc]  * <dt>&D</dt>
  [javadoc]        ^
  [javadoc] /home/jenkins/jenkins-agent/workspace/POI/POI-DSL-OpenJDK/src/ooxml/java/org/apache/poi/xssf/usermodel/extensions/XSSFHeaderFooter.java:76: error: semicolon missing
  [javadoc]  * <dt>&T</dt>
  [javadoc]        ^
  [javadoc] /home/jenkins/jenkins-agent/workspace/POI/POI-DSL-OpenJDK/src/ooxml/java/org/apache/poi/xssf/usermodel/extensions/XSSFHeaderFooter.java:78: error: semicolon missing
  [javadoc]  * <dt>&G</dt>
  [javadoc]        ^
  [javadoc] /home/jenkins/jenkins-agent/workspace/POI/POI-DSL-OpenJDK/src/ooxml/java/org/apache/poi/xssf/usermodel/extensions/XSSFHeaderFooter.java:80: error: semicolon missing
  [javadoc]  * <dt>&U</dt>
  [javadoc]        ^
  [javadoc] 100 errors
  [javadoc] 100 warnings
      [jar] Building jar: /home/jenkins/jenkins-agent/workspace/POI/POI-DSL-OpenJDK/build/dist/maven/poi-ooxml/poi-ooxml-5.0.1-SNAPSHOT-javadoc.jar

assemble:
      [zip] Building zip: /home/jenkins/jenkins-agent/workspace/POI/POI-DSL-OpenJDK/build/dist/poi-bin-5.0.1-SNAPSHOT-20210203.zip
      [tar] Building tar: /home/jenkins/jenkins-agent/workspace/POI/POI-DSL-OpenJDK/build/dist/poi-bin-5.0.1-SNAPSHOT-20210203.tar.gz
      [zip] Building zip: /home/jenkins/jenkins-agent/workspace/POI/POI-DSL-OpenJDK/build/dist/poi-src-5.0.1-SNAPSHOT-20210203.zip
      [tar] Building tar: /home/jenkins/jenkins-agent/workspace/POI/POI-DSL-OpenJDK/build/dist/poi-src-5.0.1-SNAPSHOT-20210203.tar.gz
     [echo] Creating Maven POMs

maven-poms:
     [copy] Copying 7 files to /home/jenkins/jenkins-agent/workspace/POI/POI-DSL-OpenJDK/build/dist/maven
     [echo] Maven POMs are located in /home/jenkins/jenkins-agent/workspace/POI/POI-DSL-OpenJDK/build/dist
     [echo] Use ant dist-nexus to deploy the artifacts in the remote repository
     [echo] Distribution located in /home/jenkins/jenkins-agent/workspace/POI/POI-DSL-OpenJDK/build/dist
     [echo] Use "ant dist-checksum" to create sha256/sha512 checksums and GPG signatures

findbugs:
    [mkdir] Created dir: /home/jenkins/jenkins-agent/workspace/POI/POI-DSL-OpenJDK/build/findbugs/lib/config
      [get] Getting: https://repo1.maven.org/maven2/com/github/spotbugs/spotbugs/4.2.0/spotbugs-4.2.0.jar
      [get] To: /home/jenkins/jenkins-agent/workspace/POI/POI-DSL-OpenJDK/build/findbugs/lib/spotbugs.jar
      [get] Getting: https://repo1.maven.org/maven2/com/github/spotbugs/spotbugs-ant/4.2.0/spotbugs-ant-4.2.0.jar
      [get] To: /home/jenkins/jenkins-agent/workspace/POI/POI-DSL-OpenJDK/build/findbugs/lib/spotbugs-ant.jar
      [get] Getting: https://repo1.maven.org/maven2/com/github/spotbugs/spotbugs-annotations/4.2.0/spotbugs-annotations-4.2.0.jar
      [get] To: /home/jenkins/jenkins-agent/workspace/POI/POI-DSL-OpenJDK/build/findbugs/lib/spotbugs-annotations.jar
      [get] Getting: https://repo1.maven.org/maven2/org/dom4j/dom4j/2.1.3/dom4j-2.1.3.jar
      [get] To: /home/jenkins/jenkins-agent/workspace/POI/POI-DSL-OpenJDK/build/findbugs/lib/dom4j-2.1.3.jar
      [get] Getting: https://repo1.maven.org/maven2/jaxen/jaxen/1.2.0/jaxen-1.2.0.jar
      [get] To: /home/jenkins/jenkins-agent/workspace/POI/POI-DSL-OpenJDK/build/findbugs/lib/jaxen-1.2.0.jar
      [get] Getting: https://repo1.maven.org/maven2/org/apache/bcel/bcel/6.5.0/bcel-6.5.0.jar
      [get] To: /home/jenkins/jenkins-agent/workspace/POI/POI-DSL-OpenJDK/build/findbugs/lib/bcel-6.5.0.jar
      [get] Getting: https://repo1.maven.org/maven2/org/slf4j/slf4j-api/1.8.0-beta4/slf4j-api-1.8.0-beta4.jar
      [get] To: /home/jenkins/jenkins-agent/workspace/POI/POI-DSL-OpenJDK/build/findbugs/lib/slf4j-api-1.8.0-beta4.jar
      [get] Getting: https://repo1.maven.org/maven2/org/apache/commons/commons-lang3/3.11/commons-lang3-3.11.jar
      [get] To: /home/jenkins/jenkins-agent/workspace/POI/POI-DSL-OpenJDK/build/findbugs/lib/commons-lang3-3.11.jar
      [get] Getting: https://repo1.maven.org/maven2/org/apache/commons/commons-text/1.9/commons-text-1.9.jar
      [get] To: /home/jenkins/jenkins-agent/workspace/POI/POI-DSL-OpenJDK/build/findbugs/lib/commons-text-1.9.jar
      [get] Getting: https://repo1.maven.org/maven2/net/jcip/jcip-annotations/1.0/jcip-annotations-1.0.jar
      [get] To: /home/jenkins/jenkins-agent/workspace/POI/POI-DSL-OpenJDK/build/findbugs/lib/jcip-annotations-1.0.jar
      [get] Getting: https://repo1.maven.org/maven2/com/google/code/findbugs/jsr305/3.0.2/jsr305-3.0.2.jar
      [get] To: /home/jenkins/jenkins-agent/workspace/POI/POI-DSL-OpenJDK/build/findbugs/lib/jsr305-3.0.2.jar
      [get] Getting: https://repo1.maven.org/maven2/org/ow2/asm/asm/9.0/asm-9.0.jar
      [get] To: /home/jenkins/jenkins-agent/workspace/POI/POI-DSL-OpenJDK/build/findbugs/lib/asm-9.0.jar
      [get] Getting: https://repo1.maven.org/maven2/org/ow2/asm/asm-analysis/9.0/asm-analysis-9.0.jar
      [get] To: /home/jenkins/jenkins-agent/workspace/POI/POI-DSL-OpenJDK/build/findbugs/lib/asm-analysis-9.0.jar
      [get] Getting: https://repo1.maven.org/maven2/org/ow2/asm/asm-commons/9.0/asm-commons-9.0.jar
      [get] To: /home/jenkins/jenkins-agent/workspace/POI/POI-DSL-OpenJDK/build/findbugs/lib/asm-commons-9.0.jar
      [get] Getting: https://repo1.maven.org/maven2/org/ow2/asm/asm-tree/9.0/asm-tree-9.0.jar
      [get] To: /home/jenkins/jenkins-agent/workspace/POI/POI-DSL-OpenJDK/build/findbugs/lib/asm-tree-9.0.jar
      [get] Getting: https://repo1.maven.org/maven2/org/ow2/asm/asm-util/9.0/asm-util-9.0.jar
      [get] To: /home/jenkins/jenkins-agent/workspace/POI/POI-DSL-OpenJDK/build/findbugs/lib/asm-util-9.0.jar
      [get] Getting: https://repo1.maven.org/maven2/org/apache/logging/log4j/log4j-api/2.14.0/log4j-api-2.14.0.jar
      [get] To: /home/jenkins/jenkins-agent/workspace/POI/POI-DSL-OpenJDK/build/findbugs/lib/log4j-api-2.14.0.jar
      [get] Getting: https://repo1.maven.org/maven2/org/apache/logging/log4j/log4j-core/2.14.0/log4j-core-2.14.0.jar
      [get] To: /home/jenkins/jenkins-agent/workspace/POI/POI-DSL-OpenJDK/build/findbugs/lib/log4j-core-2.14.0.jar
      [get] Getting: https://repo1.maven.org/maven2/org/apache/logging/log4j/log4j-slf4j18-impl/2.14.0/log4j-slf4j18-impl-2.14.0.jar
      [get] To: /home/jenkins/jenkins-agent/workspace/POI/POI-DSL-OpenJDK/build/findbugs/lib/log4j-slf4j18-impl-2.14.0.jar
      [get] Getting: https://repo1.maven.org/maven2/net/sf/saxon/Saxon-HE/9.9.1-8/Saxon-HE-9.9.1-8.jar
      [get] To: /home/jenkins/jenkins-agent/workspace/POI/POI-DSL-OpenJDK/build/findbugs/lib/Saxon-HE-9.9.1-8.jar
      [get] Getting: https://repo1.maven.org/maven2/com/ibm/icu/icu4j/68.2/icu4j-68.2.jar
      [get] To: /home/jenkins/jenkins-agent/workspace/POI/POI-DSL-OpenJDK/build/findbugs/lib/icu4j-63.1.jar
 [spotbugs] Executing SpotBugs FindBugsTask from ant task
 [spotbugs] Running SpotBugs...
 [spotbugs] Java Result: 1
 [spotbugs] Output saved to build/findbugs.xml
     [xslt] Transforming into /home/jenkins/jenkins-agent/workspace/POI/POI-DSL-OpenJDK/build
     [xslt] Processing /home/jenkins/jenkins-agent/workspace/POI/POI-DSL-OpenJDK/build/findbugs.xml to /home/jenkins/jenkins-agent/workspace/POI/POI-DSL-OpenJDK/build/findbugs.html
     [xslt] Loading stylesheet jar:file:/home/jenkins/jenkins-agent/workspace/POI/POI-DSL-OpenJDK/build/findbugs/lib/spotbugs.jar!/fancy.xsl

release-notes:
     [copy] Copying 1 file to /home/jenkins/jenkins-agent/workspace/POI/POI-DSL-OpenJDK/build/dist

rat-check:
    [mkdir] Created dir: /home/jenkins/jenkins-agent/workspace/POI/POI-DSL-OpenJDK/build/rat
     [echo]
     [echo] *****************************************************
     [echo] Summary
     [echo] -------
     [echo] Generated at: 2021-02-03T00:56:31+00:00
     [echo]
     [echo] Notes: 0
     [echo] Binaries: 114
     [echo] Archives: 0
     [echo] Standards: 3761
     [echo]
     [echo] Apache Licensed: 3761
     [echo] Generated Documents: 0
     [echo]
     [echo] JavaDocs are generated, thus a license header is optional.
     [echo] Generated files do not require license headers.
     [echo]
     [echo] 0 Unknown Licenses
     [echo]
     [echo] *****************************************************
     [echo]   Files with Apache License headers will be marked AL
     [echo]   Binary files (which do not require any license headers) will be marked B
     [echo]   Compressed archives will be marked A
     [echo]   Notices, licenses etc. will be marked N
     [echo]  
     [echo] *****************************************************

forbidden-apis-check:
[forbiddenapis] Reading bundled API signatures: jdk-unsafe-1.8
[forbiddenapis] Reading bundled API signatures: jdk-deprecated-1.8
[forbiddenapis] Reading bundled API signatures: jdk-internal-1.8
[forbiddenapis] Reading bundled API signatures: jdk-non-portable
[forbiddenapis] Reading bundled API signatures: jdk-reflection
[forbiddenapis] Reading API signatures: /home/jenkins/jenkins-agent/workspace/POI/POI-DSL-OpenJDK/src/resources/devtools/forbidden-signatures.txt
[forbiddenapis] Loading classes to check...
[forbiddenapis] Scanning classes for violations...
[forbiddenapis] Scanned 4819 class file(s) for forbidden API invocations (in 136.06s), 0 error(s).
[forbiddenapis] Reading API signatures: /home/jenkins/jenkins-agent/workspace/POI/POI-DSL-OpenJDK/src/resources/devtools/forbidden-signatures-prod.txt
[forbiddenapis] Loading classes to check...
[forbiddenapis] Scanning classes for violations...
[forbiddenapis] Scanned 3534 class file(s) for forbidden API invocations (in 62.91s), 0 error(s).

help:
     [echo]
     [echo]   This is POI 5.0.1-SNAPSHOT
     [echo]   Java Version 1.8/1.8.0_252
     [echo]   Timestamp 20210203
     [echo]   The main targets of interest are:
     [echo]     - clean       Erase all build work products (ie. everything in the build directory)
     [echo]     - compile     Compile all files from main, ooxml and scratchpad
     [echo]     - test        Run all unit tests from main, ooxml and scratchpad
     [echo]     - jar         Produce jar files
     [echo]     - assemble    Produce the zipped distribution files
     [echo]     - site        Generate all documentation (Requires Apache Forrest)
     [echo]     - dist        Create a distribution (Requires Apache Forrest)
     [echo]        

check-svn-jars:

fetch-svn-jars:

maven-poms:
     [echo] Maven POMs are located in /home/jenkins/jenkins-agent/workspace/POI/POI-DSL-OpenJDK/build/dist
     [echo] Use ant dist-nexus to deploy the artifacts in the remote repository

maventask:
      [get] Destination already exists (skipping): /home/jenkins/jenkins-agent/workspace/POI/POI-DSL-OpenJDK/lib/util/maven-ant-tasks-2.1.3.jar

mvn-install:
[mvn:install] [INFO] Installing /home/jenkins/jenkins-agent/workspace/POI/POI-DSL-OpenJDK/build/dist/maven/poi/poi-5.0.1-SNAPSHOT.jar to /home/jenkins/.m2/repository/org/apache/poi/poi/5.0.1-SNAPSHOT/poi-5.0.1-SNAPSHOT.jar
[mvn:install] [INFO] Installing /home/jenkins/jenkins-agent/workspace/POI/POI-DSL-OpenJDK/build/dist/maven/poi-scratchpad/poi-scratchpad-5.0.1-SNAPSHOT.jar to /home/jenkins/.m2/repository/org/apache/poi/poi-scratchpad/5.0.1-SNAPSHOT/poi-scratchpad-5.0.1-SNAPSHOT.jar
[mvn:install] [INFO] Installing /home/jenkins/jenkins-agent/workspace/POI/POI-DSL-OpenJDK/build/dist/maven/poi-ooxml/poi-ooxml-5.0.1-SNAPSHOT.jar to /home/jenkins/.m2/repository/org/apache/poi/poi-ooxml/5.0.1-SNAPSHOT/poi-ooxml-5.0.1-SNAPSHOT.jar
[mvn:install] [INFO] Installing /home/jenkins/jenkins-agent/workspace/POI/POI-DSL-OpenJDK/build/dist/maven/poi-examples/poi-examples-5.0.1-SNAPSHOT.jar to /home/jenkins/.m2/repository/org/apache/poi/poi-examples/5.0.1-SNAPSHOT/poi-examples-5.0.1-SNAPSHOT.jar
[mvn:install] [INFO] Installing /home/jenkins/jenkins-agent/workspace/POI/POI-DSL-OpenJDK/build/dist/maven/poi-ooxml-lite/poi-ooxml-lite-5.0.1-SNAPSHOT.jar to /home/jenkins/.m2/repository/org/apache/poi/poi-ooxml-lite/5.0.1-SNAPSHOT/poi-ooxml-lite-5.0.1-SNAPSHOT.jar
[mvn:install] [INFO] Installing /home/jenkins/jenkins-agent/workspace/POI/POI-DSL-OpenJDK/build/dist/maven/poi-ooxml-full/poi-ooxml-full-5.0.1-SNAPSHOT.jar to /home/jenkins/.m2/repository/org/apache/poi/poi-ooxml-full/5.0.1-SNAPSHOT/poi-ooxml-full-5.0.1-SNAPSHOT.jar
[mvn:install] [INFO] Installing /home/jenkins/jenkins-agent/workspace/POI/POI-DSL-OpenJDK/build/dist/maven/poi-excelant/poi-excelant-5.0.1-SNAPSHOT.jar to /home/jenkins/.m2/repository/org/apache/poi/poi-excelant/5.0.1-SNAPSHOT/poi-excelant-5.0.1-SNAPSHOT.jar

jenkins:

BUILD SUCCESSFUL
Total time: 32 minutes 19 seconds
Agent went offline during the build
Build step 'Invoke Ant' marked build as failure
FATAL: Channel "hudson.remoting.Channel@7fee02e3:H27": Remote call on H27 failed. The channel is closing down or has closed down
java.io.IOException: Pipe closed after 0 cycles
        at org.apache.sshd.common.channel.ChannelPipedInputStream.read(ChannelPipedInputStream.java:118)
        at org.apache.sshd.common.channel.ChannelPipedInputStream.read(ChannelPipedInputStream.java:101)
        at hudson.remoting.FlightRecorderInputStream.read(FlightRecorderInputStream.java:91)
        at hudson.remoting.ChunkedInputStream.readHeader(ChunkedInputStream.java:73)
        at hudson.remoting.ChunkedInputStream.readUntilBreak(ChunkedInputStream.java:103)
        at hudson.remoting.ChunkedCommandTransport.readBlock(ChunkedCommandTransport.java:39)
        at hudson.remoting.AbstractSynchronousByteArrayCommandTransport.read(AbstractSynchronousByteArrayCommandTransport.java:34)
        at hudson.remoting.SynchronousCommandTransport$ReaderThread.run(SynchronousCommandTransport.java:63)
Caused: hudson.remoting.ChannelClosedException: Channel "hudson.remoting.Channel@7fee02e3:H27": Remote call on H27 failed. The channel is closing down or has closed down
        at hudson.remoting.Channel.call(Channel.java:991)
        at hudson.Launcher$RemoteLauncher.kill(Launcher.java:1083)
        at hudson.model.AbstractBuild$AbstractBuildExecution.run(AbstractBuild.java:510)
        at hudson.model.Run.execute(Run.java:1880)
        at hudson.model.FreeStyleBuild.run(FreeStyleBuild.java:43)
        at hudson.model.ResourceController.execute(ResourceController.java:97)
        at hudson.model.Executor.run(Executor.java:428)
ERROR: Step ?Record compiler warnings and static analysis results? aborted due to exception:
java.io.IOException: No workspace found for POI/POI-DSL-OpenJDK #118
        at io.jenkins.plugins.analysis.core.steps.IssuesRecorder.perform(IssuesRecorder.java:577)
        at hudson.tasks.BuildStepMonitor$1.perform(BuildStepMonitor.java:20)
        at hudson.model.AbstractBuild$AbstractBuildExecution.perform(AbstractBuild.java:741)
        at hudson.model.AbstractBuild$AbstractBuildExecution.performAllBuildSteps(AbstractBuild.java:690)
        at hudson.model.Build$BuildExecution.post2(Build.java:186)
        at hudson.model.AbstractBuild$AbstractBuildExecution.post(AbstractBuild.java:635)
        at hudson.model.Run.execute(Run.java:1905)
        at hudson.model.FreeStyleBuild.run(FreeStyleBuild.java:43)
        at hudson.model.ResourceController.execute(ResourceController.java:97)
        at hudson.model.Executor.run(Executor.java:428)
ERROR: Step ?Archive the artifacts? failed: no workspace for POI/POI-DSL-OpenJDK #118
ERROR: Step ?[Deprecated] Scan for compiler warnings? failed: no workspace for POI/POI-DSL-OpenJDK #118
ERROR: Step ?Publish JUnit test result report? failed: no workspace for POI/POI-DSL-OpenJDK #118
ERROR: Step ?Record JaCoCo coverage report? failed: no workspace for POI/POI-DSL-OpenJDK #118
ERROR: H27 is offline; cannot locate openjdk_1.8.0_252

---------------------------------------------------------------------
To unsubscribe, e-mail: [hidden email]
For additional commands, e-mail: [hidden email]

Reply | Threaded
Open this post in threaded view
|

Jenkins build is back to normal : POI » POI-DSL-OpenJDK #119

Apache Jenkins Server
See <https://ci-builds.apache.org/job/POI/job/POI-DSL-OpenJDK/119/display/redirect?page=changes>


---------------------------------------------------------------------
To unsubscribe, e-mail: [hidden email]
For additional commands, e-mail: [hidden email]