Build failed in Jenkins: POI » POI-DSL-Maven #36

classic Classic list List threaded Threaded
10 messages Options
Reply | Threaded
Open this post in threaded view
|

Build failed in Jenkins: POI » POI-DSL-Maven #36

Apache Jenkins Server
See <https://ci-builds.apache.org/job/POI/job/POI-DSL-Maven/36/display/redirect?page=changes>

Changes:

[PJ Fanning] disable broken test

[PJ Fanning] use xmlbeans official 4.0.0 release


------------------------------------------
[...truncated 816.04 KB...]
                        First few bytes are []
                Stream at 35161 (0x8959)
                        Type is 69 (0x45)
                        Format is 82 (0x52)
                        Length is 13 (0xd)
                        DC.Length is 72 (0x48)
                        Compressed is true
                        Stream is org.apache.poi.hdgf.streams.PointerContainingStream
                        First few bytes are [60, 0, 0, 0, 0, 0, 0, 0, 0, 0, 0, 0, 0, 0, 0, 0, 0, 0, 0, 0, 0, 0, 0, 0, 0, 0, 0, 0, 0, 0, 0, 0, 0, 0, 0, 0, 0, 0, 0, 0, 0, 0, 0, 0, 0, 0, 0, 0, 0, 0, 0, 0, 0, 0, 0, 0, 0, 0, 0, 0, 0, 0, 0, 0, 0, 0, 0, 0, 0, 0, 0, 0]
                        Nbr of children 0 (0x0)
[INFO] Tests run: 1, Failures: 0, Errors: 0, Skipped: 0, Time elapsed: 1.389 s - in org.apache.poi.hdgf.dev.TestVSDDumper
[INFO] Running org.apache.poi.hdgf.chunks.TestChunks
[INFO] Tests run: 5, Failures: 0, Errors: 0, Skipped: 0, Time elapsed: 0.001 s - in org.apache.poi.hdgf.chunks.TestChunks
[INFO] Running org.apache.poi.hdgf.TestHDGFCore
[INFO] Tests run: 7, Failures: 0, Errors: 0, Skipped: 0, Time elapsed: 0.007 s - in org.apache.poi.hdgf.TestHDGFCore
[INFO] Running org.apache.poi.hsmf.TestNameIdChunks
[INFO] Tests run: 2, Failures: 0, Errors: 0, Skipped: 0, Time elapsed: 0.045 s - in org.apache.poi.hsmf.TestNameIdChunks
[INFO] Running org.apache.poi.hsmf.TestFixedSizedProperties
[INFO] Tests run: 7, Failures: 0, Errors: 0, Skipped: 0, Time elapsed: 0.046 s - in org.apache.poi.hsmf.TestFixedSizedProperties
[INFO] Running org.apache.poi.hsmf.Test7BitCodepage
[INFO] Tests run: 1, Failures: 0, Errors: 0, Skipped: 0, Time elapsed: 0.046 s - in org.apache.poi.hsmf.Test7BitCodepage
[INFO] Running org.apache.poi.hsmf.datatypes.TestTypes
[INFO] Tests run: 3, Failures: 0, Errors: 0, Skipped: 0, Time elapsed: 0.001 s - in org.apache.poi.hsmf.datatypes.TestTypes
[INFO] Running org.apache.poi.hsmf.datatypes.TestSorters
[INFO] Tests run: 2, Failures: 0, Errors: 0, Skipped: 0, Time elapsed: 0.002 s - in org.apache.poi.hsmf.datatypes.TestSorters
[INFO] Running org.apache.poi.hsmf.datatypes.TestChunkData
[INFO] Tests run: 6, Failures: 0, Errors: 0, Skipped: 0, Time elapsed: 0.002 s - in org.apache.poi.hsmf.datatypes.TestChunkData
[INFO] Running org.apache.poi.hsmf.datatypes.TestMAPIProperty
[INFO] Tests run: 3, Failures: 0, Errors: 0, Skipped: 0, Time elapsed: 0.001 s - in org.apache.poi.hsmf.datatypes.TestMAPIProperty
[INFO] Running org.apache.poi.hsmf.TestBlankFileRead
[INFO] Tests run: 7, Failures: 0, Errors: 0, Skipped: 0, Time elapsed: 0.002 s - in org.apache.poi.hsmf.TestBlankFileRead
[INFO] Running org.apache.poi.hsmf.TestSimpleFileRead
[INFO] Tests run: 9, Failures: 0, Errors: 0, Skipped: 0, Time elapsed: 0.058 s - in org.apache.poi.hsmf.TestSimpleFileRead
[INFO] Running org.apache.poi.hsmf.extractor.TestOutlookTextExtractor
[INFO] Tests run: 8, Failures: 0, Errors: 0, Skipped: 0, Time elapsed: 0.125 s - in org.apache.poi.hsmf.extractor.TestOutlookTextExtractor
[INFO] Running org.apache.poi.hsmf.TestExtractEmbeddedMSG
[INFO] Tests run: 1, Failures: 0, Errors: 0, Skipped: 0, Time elapsed: 0.008 s - in org.apache.poi.hsmf.TestExtractEmbeddedMSG
[INFO] Running org.apache.poi.hsmf.TestMessageSubmissionChunk
[INFO] Tests run: 2, Failures: 0, Errors: 0, Skipped: 0, Time elapsed: 0.007 s - in org.apache.poi.hsmf.TestMessageSubmissionChunk
[INFO] Running org.apache.poi.hsmf.TestOutlook30FileRead
[INFO] Tests run: 9, Failures: 0, Errors: 0, Skipped: 0, Time elapsed: 0.085 s - in org.apache.poi.hsmf.TestOutlook30FileRead
[INFO] Running org.apache.poi.hsmf.TestFileWithAttachmentsRead
[INFO] Tests run: 4, Failures: 0, Errors: 0, Skipped: 0, Time elapsed: 0.001 s - in org.apache.poi.hsmf.TestFileWithAttachmentsRead
[INFO] Running org.apache.poi.hsmf.parsers.TestPOIFSChunkParser
[INFO] Tests run: 6, Failures: 0, Errors: 0, Skipped: 0, Time elapsed: 0.073 s - in org.apache.poi.hsmf.parsers.TestPOIFSChunkParser
[INFO] Running org.apache.poi.hsmf.TestBasics
[INFO] Tests run: 9, Failures: 0, Errors: 0, Skipped: 0, Time elapsed: 0.163 s - in org.apache.poi.hsmf.TestBasics
[INFO] Running org.apache.poi.hsmf.TestMessageSubmissionChunkY2KRead
[INFO] Tests run: 3, Failures: 0, Errors: 0, Skipped: 0, Time elapsed: 0.009 s - in org.apache.poi.hsmf.TestMessageSubmissionChunkY2KRead
[INFO] Running org.apache.poi.hwmf.TestHwmfParsing
[WARNING] Tests run: 5, Failures: 0, Errors: 0, Skipped: 1, Time elapsed: 0.037 s - in org.apache.poi.hwmf.TestHwmfParsing
[INFO] Running org.apache.poi.hmef.TestCompressedRTF
[INFO] Tests run: 4, Failures: 0, Errors: 0, Skipped: 0, Time elapsed: 0.015 s - in org.apache.poi.hmef.TestCompressedRTF
[INFO] Running org.apache.poi.hmef.TestBugs
[INFO] Tests run: 3, Failures: 0, Errors: 0, Skipped: 0, Time elapsed: 0.016 s - in org.apache.poi.hmef.TestBugs
[INFO] Running org.apache.poi.hmef.TestAttachments
[INFO] Tests run: 4, Failures: 0, Errors: 0, Skipped: 0, Time elapsed: 0.004 s - in org.apache.poi.hmef.TestAttachments
[INFO] Running org.apache.poi.hmef.extractor.TestHMEFContentsExtractor
Extracting...
Extraction completed
[INFO] Tests run: 3, Failures: 0, Errors: 0, Skipped: 0, Time elapsed: 0.009 s - in org.apache.poi.hmef.extractor.TestHMEFContentsExtractor
[INFO] Running org.apache.poi.hmef.dev.TestHMEFDumper
[INFO] Tests run: 3, Failures: 0, Errors: 0, Skipped: 0, Time elapsed: 0.02 s - in org.apache.poi.hmef.dev.TestHMEFDumper
[INFO] Running org.apache.poi.hmef.TestHMEFMessage
[INFO] Tests run: 9, Failures: 0, Errors: 0, Skipped: 0, Time elapsed: 0.006 s - in org.apache.poi.hmef.TestHMEFMessage
[INFO] Running org.apache.poi.hmef.attribute.TestMAPIAttributes
[INFO] Tests run: 4, Failures: 0, Errors: 0, Skipped: 0, Time elapsed: 0.005 s - in org.apache.poi.hmef.attribute.TestMAPIAttributes
[INFO] Running org.apache.poi.hmef.attribute.TestTNEFAttributes
[INFO] Tests run: 6, Failures: 0, Errors: 0, Skipped: 0, Time elapsed: 0.009 s - in org.apache.poi.hmef.attribute.TestTNEFAttributes
[INFO]
[INFO] Results:
[INFO]
[WARNING] Tests run: 3089, Failures: 0, Errors: 0, Skipped: 5
[INFO]
[INFO]
[INFO] --- jacoco-maven-plugin:0.8.6:report (report) @ poi-scratchpad ---
[INFO] Loading execution data file <https://ci-builds.apache.org/job/POI/job/POI-DSL-Maven/ws/sonar/scratchpad/target/jacoco.exec>
[INFO] Analyzed bundle 'Apache POI Scratchpad package' with 875 classes
[INFO]
[INFO] --- maven-jar-plugin:2.4:jar (default-jar) @ poi-scratchpad ---
[INFO] Building jar: <https://ci-builds.apache.org/job/POI/job/POI-DSL-Maven/ws/sonar/scratchpad/target/poi-scratchpad-5.0.0-SNAPSHOT.jar>
[INFO]
[INFO] ------------------< org.apache.poi:poi-ooxml-schema >-------------------
[INFO] Building Apache POI - Openxmlformats Schema package 5.0.0-SNAPSHOT [4/10]
[INFO] --------------------------------[ jar ]---------------------------------
Downloading from apache-releases-repo: https://repository.apache.org/content/repositories/releases/org/apache/xmlbeans/xmlbeans/4.0.0/xmlbeans-4.0.0.pom
Progress (1): 3.7 kB                    Downloaded from apache-releases-repo: https://repository.apache.org/content/repositories/releases/org/apache/xmlbeans/xmlbeans/4.0.0/xmlbeans-4.0.0.pom (3.7 kB at 3.1 kB/s)
Downloading from apache-releases-repo: https://repository.apache.org/content/repositories/releases/xml-apis/xml-apis/1.4.01/xml-apis-1.4.01.pom
Downloading from central: https://repo.maven.apache.org/maven2/xml-apis/xml-apis/1.4.01/xml-apis-1.4.01.pom
Progress (1): 2.7 kB                    Downloaded from central: https://repo.maven.apache.org/maven2/xml-apis/xml-apis/1.4.01/xml-apis-1.4.01.pom (2.7 kB at 26 kB/s)
Downloading from apache-releases-repo: https://repository.apache.org/content/repositories/releases/org/apache/xmlbeans/xmlbeans/4.0.0/xmlbeans-4.0.0.jar
Downloading from apache-releases-repo: https://repository.apache.org/content/repositories/releases/xml-apis/xml-apis/1.4.01/xml-apis-1.4.01.jar
Progress (1): 0/2.5 MBProgress (1): 0/2.5 MBProgress (1): 0/2.5 MBProgress (1): 0.1/2.5 MBProgress (1): 0.1/2.5 MBProgress (1): 0.1/2.5 MBProgress (1): 0.1/2.5 MBProgress (1): 0.1/2.5 MBProgress (1): 0.1/2.5 MBProgress (1): 0.2/2.5 MBProgress (1): 0.2/2.5 MBProgress (1): 0.2/2.5 MBProgress (1): 0.2/2.5 MBProgress (1): 0.2/2.5 MBProgress (1): 0.2/2.5 MBProgress (1): 0.3/2.5 MBProgress (1): 0.3/2.5 MBProgress (1): 0.3/2.5 MBProgress (1): 0.3/2.5 MBProgress (1): 0.3/2.5 MBProgress (1): 0.3/2.5 MBProgress (1): 0.4/2.5 MBProgress (1): 0.4/2.5 MBProgress (1): 0.4/2.5 MBProgress (1): 0.4/2.5 MBProgress (1): 0.4/2.5 MBProgress (1): 0.4/2.5 MBProgress (1): 0.5/2.5 MBProgress (1): 0.5/2.5 MBProgress (1): 0.5/2.5 MBProgress (1): 0.5/2.5 MBProgress (1): 0.5/2.5 MBProgress (1): 0.5/2.5 MBProgress (1): 0.5/2.5 MBProgress (1): 0.6/2.5 MBProgress (1): 0.6/2.5 MBProgress (1): 0.6/2.5 MBProgress (1): 0.6/2.5 MBProgress (1): 0.6/2.5 MBProgress (1): 0.6/2.5 MBProgress (1): 0.7/2.5 MBProgress (1): 0.7/2.5 MBProgress (1): 0.7/2.5 MBProgress (1): 0.7/2.5 MBProgress (1): 0.7/2.5 MBProgress (1): 0.7/2.5 MBProgress (1): 0.8/2.5 MBProgress (1): 0.8/2.5 MBProgress (1): 0.8/2.5 MBProgress (1): 0.8/2.5 MBProgress (1): 0.8/2.5 MBProgress (1): 0.8/2.5 MBProgress (1): 0.9/2.5 MBProgress (1): 0.9/2.5 MBProgress (1): 0.9/2.5 MBProgress (1): 0.9/2.5 MBProgress (1): 0.9/2.5 MBProgress (1): 0.9/2.5 MBProgress (1): 0.9/2.5 MBProgress (1): 1.0/2.5 MBProgress (1): 1.0/2.5 MBProgress (1): 1.0/2.5 MBProgress (1): 1.0/2.5 MBProgress (1): 1.0/2.5 MBProgress (1): 1.0/2.5 MBProgress (1): 1.1/2.5 MBProgress (1): 1.1/2.5 MBProgress (1): 1.1/2.5 MBProgress (1): 1.1/2.5 MBProgress (1): 1.1/2.5 MBProgress (1): 1.1/2.5 MBProgress (1): 1.2/2.5 MBProgress (1): 1.2/2.5 MBProgress (1): 1.2/2.5 MBProgress (1): 1.2/2.5 MBProgress (1): 1.2/2.5 MBProgress (1): 1.2/2.5 MBProgress (1): 1.3/2.5 MBProgress (1): 1.3/2.5 MBProgress (1): 1.3/2.5 MBProgress (1): 1.3/2.5 MBProgress (1): 1.3/2.5 MBProgress (1): 1.3/2.5 MBProgress (1): 1.3/2.5 MBProgress (1): 1.4/2.5 MBProgress (1): 1.4/2.5 MBProgress (1): 1.4/2.5 MBProgress (1): 1.4/2.5 MBProgress (1): 1.4/2.5 MBProgress (1): 1.4/2.5 MBProgress (1): 1.5/2.5 MBProgress (1): 1.5/2.5 MBProgress (1): 1.5/2.5 MBProgress (1): 1.5/2.5 MBProgress (1): 1.5/2.5 MBProgress (1): 1.5/2.5 MBProgress (1): 1.6/2.5 MBProgress (1): 1.6/2.5 MBProgress (1): 1.6/2.5 MBProgress (1): 1.6/2.5 MBProgress (1): 1.6/2.5 MBProgress (1): 1.6/2.5 MBProgress (1): 1.7/2.5 MBProgress (1): 1.7/2.5 MBProgress (1): 1.7/2.5 MBProgress (1): 1.7/2.5 MBProgress (1): 1.7/2.5 MBProgress (1): 1.7/2.5 MBProgress (1): 1.7/2.5 MBProgress (1): 1.8/2.5 MBProgress (1): 1.8/2.5 MBProgress (1): 1.8/2.5 MBProgress (1): 1.8/2.5 MBProgress (1): 1.8/2.5 MBProgress (1): 1.8/2.5 MBProgress (1): 1.9/2.5 MBProgress (1): 1.9/2.5 MBProgress (1): 1.9/2.5 MBProgress (1): 1.9/2.5 MBProgress (1): 1.9/2.5 MBProgress (1): 1.9/2.5 MBProgress (1): 2.0/2.5 MBProgress (1): 2.0/2.5 MBProgress (1): 2.0/2.5 MBProgress (1): 2.0/2.5 MBProgress (1): 2.0/2.5 MBProgress (1): 2.0/2.5 MBProgress (1): 2.1/2.5 MBProgress (1): 2.1/2.5 MBProgress (1): 2.1/2.5 MBProgress (1): 2.1/2.5 MBProgress (1): 2.1/2.5 MBProgress (1): 2.1/2.5 MBProgress (1): 2.1/2.5 MBProgress (1): 2.2/2.5 MBProgress (1): 2.2/2.5 MBProgress (1): 2.2/2.5 MBProgress (1): 2.2/2.5 MBProgress (1): 2.2/2.5 MBProgress (1): 2.2/2.5 MBProgress (1): 2.3/2.5 MBProgress (1): 2.3/2.5 MBProgress (1): 2.3/2.5 MBProgress (1): 2.3/2.5 MBProgress (1): 2.3/2.5 MBProgress (1): 2.3/2.5 MBProgress (1): 2.4/2.5 MBProgress (1): 2.4/2.5 MBProgress (1): 2.4/2.5 MBProgress (1): 2.4/2.5 MBProgress (1): 2.4/2.5 MBProgress (1): 2.4/2.5 MBProgress (1): 2.4/2.5 MBProgress (1): 2.5/2.5 MBProgress (1): 2.5/2.5 MBProgress (1): 2.5 MB                        Downloaded from apache-releases-repo: https://repository.apache.org/content/repositories/releases/org/apache/xmlbeans/xmlbeans/4.0.0/xmlbeans-4.0.0.jar (2.5 MB at 1.3 MB/s)
Downloading from central: https://repo.maven.apache.org/maven2/xml-apis/xml-apis/1.4.01/xml-apis-1.4.01.jar
Progress (1): 2.7/221 kBProgress (1): 5.5/221 kBProgress (1): 8.2/221 kBProgress (1): 11/221 kB Progress (1): 14/221 kBProgress (1): 16/221 kBProgress (1): 19/221 kBProgress (1): 22/221 kBProgress (1): 25/221 kBProgress (1): 27/221 kBProgress (1): 30/221 kBProgress (1): 33/221 kBProgress (1): 36/221 kBProgress (1): 38/221 kBProgress (1): 41/221 kBProgress (1): 44/221 kBProgress (1): 47/221 kBProgress (1): 49/221 kBProgress (1): 52/221 kBProgress (1): 55/221 kBProgress (1): 58/221 kBProgress (1): 60/221 kBProgress (1): 63/221 kBProgress (1): 66/221 kBProgress (1): 69/221 kBProgress (1): 71/221 kBProgress (1): 74/221 kBProgress (1): 77/221 kBProgress (1): 80/221 kBProgress (1): 82/221 kBProgress (1): 85/221 kBProgress (1): 88/221 kBProgress (1): 90/221 kBProgress (1): 93/221 kBProgress (1): 96/221 kBProgress (1): 99/221 kBProgress (1): 101/221 kBProgress (1): 104/221 kBProgress (1): 107/221 kBProgress (1): 110/221 kBProgress (1): 112/221 kBProgress (1): 115/221 kBProgress (1): 118/221 kBProgress (1): 121/221 kBProgress (1): 123/221 kBProgress (1): 126/221 kBProgress (1): 129/221 kBProgress (1): 132/221 kBProgress (1): 134/221 kBProgress (1): 137/221 kBProgress (1): 140/221 kBProgress (1): 143/221 kBProgress (1): 145/221 kBProgress (1): 148/221 kBProgress (1): 151/221 kBProgress (1): 154/221 kBProgress (1): 156/221 kBProgress (1): 159/221 kBProgress (1): 162/221 kBProgress (1): 165/221 kBProgress (1): 167/221 kBProgress (1): 170/221 kBProgress (1): 173/221 kBProgress (1): 175/221 kBProgress (1): 178/221 kBProgress (1): 181/221 kBProgress (1): 184/221 kBProgress (1): 186/221 kBProgress (1): 189/221 kBProgress (1): 192/221 kBProgress (1): 195/221 kBProgress (1): 197/221 kBProgress (1): 200/221 kBProgress (1): 203/221 kBProgress (1): 206/221 kBProgress (1): 208/221 kBProgress (1): 211/221 kBProgress (1): 214/221 kBProgress (1): 217/221 kBProgress (1): 219/221 kBProgress (1): 221 kB                        Downloaded from central: https://repo.maven.apache.org/maven2/xml-apis/xml-apis/1.4.01/xml-apis-1.4.01.jar (221 kB at 4.6 MB/s)
[INFO]
[INFO] --- jacoco-maven-plugin:0.8.6:prepare-agent (default) @ poi-ooxml-schema ---
[INFO] argLine set to -javaagent:<https://ci-builds.apache.org/job/POI/job/POI-DSL-Maven/ws/.repository/org/jacoco/org.jacoco.agent/0.8.6/org.jacoco.agent-0.8.6-runtime.jar=destfile=/home/jenkins/workspace/POI/POI-DSL-Maven/sonar/ooxml-schema/target/jacoco.exec> -Xmx1024m
[INFO]
[INFO] --- download-maven-plugin:1.5.0:wget (download-xsds) @ poi-ooxml-schema ---
[INFO] Got from cache: <https://ci-builds.apache.org/job/POI/job/POI-DSL-Maven/ws/.repository/.cache/download-maven-plugin/Office%20Open%20XML%201st%20edition%20Part%204%20(PDF).zip_c501e12cb3c66007e0f51e41db066eac>
[INFO]
[INFO] --- maven-antrun-plugin:1.8:run (copy-xmltype-and-xsdconfig) @ poi-ooxml-schema ---
[INFO] Executing tasks

main:
     [copy] Copying 6 files to <https://ci-builds.apache.org/job/POI/job/POI-DSL-Maven/ws/sonar/ooxml-schema/target/schemas>
[INFO] Executed tasks
[INFO]
[INFO] --- maven-antrun-plugin:1.8:run (unzip-schema) @ poi-ooxml-schema ---
[INFO] Executing tasks

main:
     [echo] unzip schemas
    [unzip] Expanding: <https://ci-builds.apache.org/job/POI/job/POI-DSL-Maven/ws/sonar/ooxml-schema/target/OfficeOpenXML-XMLSchema.zip> into <https://ci-builds.apache.org/job/POI/job/POI-DSL-Maven/ws/sonar/ooxml-schema/target/schemas>
     [copy] Copying 1 file to <https://ci-builds.apache.org/job/POI/job/POI-DSL-Maven/ws/sonar/ooxml-schema/target/schemas>
[INFO] Executed tasks
[INFO]
[INFO] --- xmlbeans-maven-plugin:2.3.3:xmlbeans (default) @ poi-ooxml-schema ---
[INFO] ------------------------------------------------------------------------
[INFO] Reactor Summary for Apache POI - the Java API for Microsoft Documents 5.0.0-SNAPSHOT:
[INFO]
[INFO] Apache POI - the Java API for Microsoft Documents .. SUCCESS [  1.984 s]
[INFO] Apache POI Main package ............................ SUCCESS [03:56 min]
[INFO] Apache POI Scratchpad package ...................... SUCCESS [ 30.612 s]
[INFO] Apache POI - Openxmlformats Schema package ......... FAILURE [ 10.785 s]
[INFO] Apache POI - Openxmlformats Encryption Schema package SKIPPED
[INFO] Apache POI - Openxmlformats Security-Schema package  SKIPPED
[INFO] Apache POI OOXML package ........................... SKIPPED
[INFO] Apache POI ExcelAnt package ........................ SKIPPED
[INFO] Apache POI Examples package ........................ SKIPPED
[INFO] Apache POI integration test ........................ SKIPPED
[INFO] ------------------------------------------------------------------------
[INFO] BUILD FAILURE
[INFO] ------------------------------------------------------------------------
[INFO] Total time:  04:39 min
[INFO] Finished at: 2020-10-16T20:40:01Z
[INFO] ------------------------------------------------------------------------
[ERROR] Failed to execute goal org.codehaus.mojo:xmlbeans-maven-plugin:2.3.3:xmlbeans (default) on project poi-ooxml-schema: XmlBeans compile failed:
[ERROR]  xml ErrorLoading schema file <https://ci-builds.apache.org/job/POI/job/POI-DSL-Maven/ws/sonar/ooxml-schema/target/schemas/sml-sharedWorkbookRevisions.xsd>
[ERROR] xml ErrorLoading schema file <https://ci-builds.apache.org/job/POI/job/POI-DSL-Maven/ws/sonar/ooxml-schema/target/schemas/dml-shapeStyle.xsd>
[ERROR] xml ErrorLoading schema file <https://ci-builds.apache.org/job/POI/job/POI-DSL-Maven/ws/sonar/ooxml-schema/target/schemas/vml-main.xsd>
[ERROR] xml ErrorLoading schema file <https://ci-builds.apache.org/job/POI/job/POI-DSL-Maven/ws/sonar/ooxml-schema/target/schemas/pml-userDefinedTags.xsd>
[ERROR] xml ErrorLoading schema file <https://ci-builds.apache.org/job/POI/job/POI-DSL-Maven/ws/sonar/ooxml-schema/target/schemas/dml-shape3DCamera.xsd>
[ERROR] xml ErrorLoading schema file <https://ci-builds.apache.org/job/POI/job/POI-DSL-Maven/ws/sonar/ooxml-schema/target/schemas/sml-volatileDependencies.xsd>
[ERROR] xml ErrorLoading schema file <https://ci-builds.apache.org/job/POI/job/POI-DSL-Maven/ws/sonar/ooxml-schema/target/schemas/dml-gvml.xsd>
[ERROR] xml ErrorLoading schema file <https://ci-builds.apache.org/job/POI/job/POI-DSL-Maven/ws/sonar/ooxml-schema/target/schemas/wml.xsd>
[ERROR] xml ErrorLoading schema file <https://ci-builds.apache.org/job/POI/job/POI-DSL-Maven/ws/sonar/ooxml-schema/target/schemas/dml-graphicalObject.xsd>
[ERROR] xml ErrorLoading schema file <https://ci-builds.apache.org/job/POI/job/POI-DSL-Maven/ws/sonar/ooxml-schema/target/schemas/dml-diagramLayoutVariables.xsd>
[ERROR] xml ErrorLoading schema file <https://ci-builds.apache.org/job/POI/job/POI-DSL-Maven/ws/sonar/ooxml-schema/target/schemas/dml-shape3DStyles.xsd>
[ERROR] xml ErrorLoading schema file <https://ci-builds.apache.org/job/POI/job/POI-DSL-Maven/ws/sonar/ooxml-schema/target/schemas/dml-styleDefaults.xsd>
[ERROR] xml ErrorLoading schema file <https://ci-builds.apache.org/job/POI/job/POI-DSL-Maven/ws/sonar/ooxml-schema/target/schemas/shared-customXmlDataProperties.xsd>
[ERROR] xml ErrorLoading schema file <https://ci-builds.apache.org/job/POI/job/POI-DSL-Maven/ws/sonar/ooxml-schema/target/schemas/dml-documentProperties.xsd>
[ERROR] xml ErrorLoading schema file <https://ci-builds.apache.org/job/POI/job/POI-DSL-Maven/ws/sonar/ooxml-schema/target/schemas/xmldsig-core-schema.xsd>
[ERROR] xml ErrorLoading schema file <https://ci-builds.apache.org/job/POI/job/POI-DSL-Maven/ws/sonar/ooxml-schema/target/schemas/dml-textRun.xsd>
[ERROR] xml ErrorLoading schema file <https://ci-builds.apache.org/job/POI/job/POI-DSL-Maven/ws/sonar/ooxml-schema/target/schemas/dml-textCharacter.xsd>
[ERROR] xml ErrorLoading schema file <https://ci-builds.apache.org/job/POI/job/POI-DSL-Maven/ws/sonar/ooxml-schema/target/schemas/dml-audioVideo.xsd>
[ERROR] xml ErrorLoading schema file <https://ci-builds.apache.org/job/POI/job/POI-DSL-Maven/ws/sonar/ooxml-schema/target/schemas/dml-shape3DLighting.xsd>
[ERROR] xml ErrorLoading schema file <https://ci-builds.apache.org/job/POI/job/POI-DSL-Maven/ws/sonar/ooxml-schema/target/schemas/dml-diagramDataModel.xsd>
[ERROR] xml ErrorLoading schema file <https://ci-builds.apache.org/job/POI/job/POI-DSL-Maven/ws/sonar/ooxml-schema/target/schemas/sml-singleCellTable.xsd>
[ERROR] xml ErrorLoading schema file <https://ci-builds.apache.org/job/POI/job/POI-DSL-Maven/ws/sonar/ooxml-schema/target/schemas/pml-animationInfo.xsd>
[ERROR] xml ErrorLoading schema file <https://ci-builds.apache.org/job/POI/job/POI-DSL-Maven/ws/sonar/ooxml-schema/target/schemas/dml-baseTypes.xsd>
[ERROR] xml ErrorLoading schema file <https://ci-builds.apache.org/job/POI/job/POI-DSL-Maven/ws/sonar/ooxml-schema/target/schemas/pml-presentationProperties.xsd>
[ERROR] xml ErrorLoading schema file <https://ci-builds.apache.org/job/POI/job/POI-DSL-Maven/ws/sonar/ooxml-schema/target/schemas/markup-compatibility.xsd>
[ERROR] xml ErrorLoading schema file <https://ci-builds.apache.org/job/POI/job/POI-DSL-Maven/ws/sonar/ooxml-schema/target/schemas/vmlDrawing.xsd>
[ERROR] xml ErrorLoading schema file <https://ci-builds.apache.org/job/POI/job/POI-DSL-Maven/ws/sonar/ooxml-schema/target/schemas/dml-shapeProperties.xsd>
[ERROR] xml ErrorLoading schema file <https://ci-builds.apache.org/job/POI/job/POI-DSL-Maven/ws/sonar/ooxml-schema/target/schemas/sml-calculationChain.xsd>
[ERROR] xml ErrorLoading schema file <https://ci-builds.apache.org/job/POI/job/POI-DSL-Maven/ws/sonar/ooxml-schema/target/schemas/dml-picture.xsd>
[ERROR] xml ErrorLoading schema file <https://ci-builds.apache.org/job/POI/job/POI-DSL-Maven/ws/sonar/ooxml-schema/target/schemas/dml-diagramElementPropertySet.xsd>
[ERROR] xml ErrorLoading schema file <https://ci-builds.apache.org/job/POI/job/POI-DSL-Maven/ws/sonar/ooxml-schema/target/schemas/dml-shape3DScene.xsd>
[ERROR] xml ErrorLoading schema file <https://ci-builds.apache.org/job/POI/job/POI-DSL-Maven/ws/sonar/ooxml-schema/target/schemas/sml-sharedWorkbookUserNames.xsd>
[ERROR] xml ErrorLoading schema file <https://ci-builds.apache.org/job/POI/job/POI-DSL-Maven/ws/sonar/ooxml-schema/target/schemas/pml-viewProperties.xsd>
[ERROR] xml ErrorLoading schema file <https://ci-builds.apache.org/job/POI/job/POI-DSL-Maven/ws/sonar/ooxml-schema/target/schemas/sml-workbook.xsd>
[ERROR] xml ErrorLoading schema file <https://ci-builds.apache.org/job/POI/job/POI-DSL-Maven/ws/sonar/ooxml-schema/target/schemas/shared-relationshipReference.xsd>
[ERROR] xml ErrorLoading schema file <https://ci-builds.apache.org/job/POI/job/POI-DSL-Maven/ws/sonar/ooxml-schema/target/schemas/dml-table.xsd>
[ERROR] xml ErrorLoading schema file <https://ci-builds.apache.org/job/POI/job/POI-DSL-Maven/ws/sonar/ooxml-schema/target/schemas/dml-graphicalObjectFormat.xsd>
[ERROR] xml ErrorLoading schema file <https://ci-builds.apache.org/job/POI/job/POI-DSL-Maven/ws/sonar/ooxml-schema/target/schemas/vml-officeDrawing.xsd>
[ERROR] xml ErrorLoading schema file <https://ci-builds.apache.org/job/POI/job/POI-DSL-Maven/ws/sonar/ooxml-schema/target/schemas/dml-diagramTypes.xsd>
[ERROR] xml ErrorLoading schema file <https://ci-builds.apache.org/job/POI/job/POI-DSL-Maven/ws/sonar/ooxml-schema/target/schemas/shared-customXmlSchemaProperties.xsd>
[ERROR] xml ErrorLoading schema file <https://ci-builds.apache.org/job/POI/job/POI-DSL-Maven/ws/sonar/ooxml-schema/target/schemas/sml-queryTable.xsd>
[ERROR] xml ErrorLoading schema file <https://ci-builds.apache.org/job/POI/job/POI-DSL-Maven/ws/sonar/ooxml-schema/target/schemas/sml-supplementaryWorkbooks.xsd>
[ERROR] xml ErrorLoading schema file <https://ci-builds.apache.org/job/POI/job/POI-DSL-Maven/ws/sonar/ooxml-schema/target/schemas/pml-embedding.xsd>
[ERROR] xml ErrorLoading schema file <https://ci-builds.apache.org/job/POI/job/POI-DSL-Maven/ws/sonar/ooxml-schema/target/schemas/sml-pivotTable.xsd>
[ERROR] xml ErrorLoading schema file <https://ci-builds.apache.org/job/POI/job/POI-DSL-Maven/ws/sonar/ooxml-schema/target/schemas/dml-shape3DScenePlane.xsd>
[ERROR] xml ErrorLoading schema file <https://ci-builds.apache.org/job/POI/job/POI-DSL-Maven/ws/sonar/ooxml-schema/target/schemas/sml-comments.xsd>
[ERROR] xml ErrorLoading schema file <https://ci-builds.apache.org/job/POI/job/POI-DSL-Maven/ws/sonar/ooxml-schema/target/schemas/sml-sheet.xsd>
[ERROR] xml ErrorLoading schema file <https://ci-builds.apache.org/job/POI/job/POI-DSL-Maven/ws/sonar/ooxml-schema/target/schemas/dml-chart.xsd>
[ERROR] xml ErrorLoading schema file <https://ci-builds.apache.org/job/POI/job/POI-DSL-Maven/ws/sonar/ooxml-schema/target/schemas/sml-customXmlMappings.xsd>
[ERROR] xml ErrorLoading schema file <https://ci-builds.apache.org/job/POI/job/POI-DSL-Maven/ws/sonar/ooxml-schema/target/schemas/sml-pivotTableShared.xsd>
[ERROR] xml ErrorLoading schema file <https://ci-builds.apache.org/job/POI/job/POI-DSL-Maven/ws/sonar/ooxml-schema/target/schemas/dml-textBullet.xsd>
[ERROR] xml ErrorLoading schema file <https://ci-builds.apache.org/job/POI/job/POI-DSL-Maven/ws/sonar/ooxml-schema/target/schemas/shared-documentPropertiesVariantTypes.xsd>
[ERROR] xml ErrorLoading schema file <https://ci-builds.apache.org/job/POI/job/POI-DSL-Maven/ws/sonar/ooxml-schema/target/schemas/dml-stylesheet.xsd>
[ERROR] xml ErrorLoading schema file <https://ci-builds.apache.org/job/POI/job/POI-DSL-Maven/ws/sonar/ooxml-schema/target/schemas/pml-slideSynchronizationData.xsd>
[ERROR] xml ErrorLoading schema file <https://ci-builds.apache.org/job/POI/job/POI-DSL-Maven/ws/sonar/ooxml-schema/target/schemas/dml-compatibility.xsd>
[ERROR] xml ErrorLoading schema file <https://ci-builds.apache.org/job/POI/job/POI-DSL-Maven/ws/sonar/ooxml-schema/target/schemas/vml-wordprocessingDrawing.xsd>
[ERROR] xml ErrorLoading schema file <https://ci-builds.apache.org/job/POI/job/POI-DSL-Maven/ws/sonar/ooxml-schema/target/schemas/dml-shapeGeometry.xsd>
[ERROR] xml ErrorLoading schema file <https://ci-builds.apache.org/job/POI/job/POI-DSL-Maven/ws/sonar/ooxml-schema/target/schemas/sml-sheetMetadata.xsd>
[ERROR] xml ErrorLoading schema file <https://ci-builds.apache.org/job/POI/job/POI-DSL-Maven/ws/sonar/ooxml-schema/target/schemas/dml-shapeLineProperties.xsd>
[ERROR] xml ErrorLoading schema file <https://ci-builds.apache.org/job/POI/job/POI-DSL-Maven/ws/sonar/ooxml-schema/target/schemas/vml-spreadsheetDrawing.xsd>
[ERROR] xml ErrorLoading schema file <https://ci-builds.apache.org/job/POI/job/POI-DSL-Maven/ws/sonar/ooxml-schema/target/schemas/dml-lockedCanvas.xsd>
[ERROR] xml ErrorLoading schema file <https://ci-builds.apache.org/job/POI/job/POI-DSL-Maven/ws/sonar/ooxml-schema/target/schemas/shared-math.xsd>
[ERROR] xml ErrorLoading schema file <https://ci-builds.apache.org/job/POI/job/POI-DSL-Maven/ws/sonar/ooxml-schema/target/schemas/dml-text.xsd>
[ERROR] xml ErrorLoading schema file <https://ci-builds.apache.org/job/POI/job/POI-DSL-Maven/ws/sonar/ooxml-schema/target/schemas/shared-bibliography.xsd>
[ERROR] xml ErrorLoading schema file <https://ci-builds.apache.org/job/POI/job/POI-DSL-Maven/ws/sonar/ooxml-schema/target/schemas/pml-slide.xsd>
[ERROR] xml ErrorLoading schema file <https://ci-builds.apache.org/job/POI/job/POI-DSL-Maven/ws/sonar/ooxml-schema/target/schemas/dml-diagramColorTransform.xsd>
[ERROR] xml ErrorLoading schema file <https://ci-builds.apache.org/job/POI/job/POI-DSL-Maven/ws/sonar/ooxml-schema/target/schemas/sml-table.xsd>
[ERROR] xml ErrorLoading schema file <https://ci-builds.apache.org/job/POI/job/POI-DSL-Maven/ws/sonar/ooxml-schema/target/schemas/dml-graphicalObjectAnimation.xsd>
[ERROR] xml ErrorLoading schema file <https://ci-builds.apache.org/job/POI/job/POI-DSL-Maven/ws/sonar/ooxml-schema/target/schemas/pml-comments.xsd>
[ERROR] xml ErrorLoading schema file <https://ci-builds.apache.org/job/POI/job/POI-DSL-Maven/ws/sonar/ooxml-schema/target/schemas/shared-documentPropertiesExtended.xsd>
[ERROR] xml ErrorLoading schema file <https://ci-builds.apache.org/job/POI/job/POI-DSL-Maven/ws/sonar/ooxml-schema/target/schemas/sml-sharedStringTable.xsd>
[ERROR] xml ErrorLoading schema file <https://ci-builds.apache.org/job/POI/job/POI-DSL-Maven/ws/sonar/ooxml-schema/target/schemas/dml-spreadsheetDrawing.xsd>
[ERROR] xml ErrorLoading schema file <https://ci-builds.apache.org/job/POI/job/POI-DSL-Maven/ws/sonar/ooxml-schema/target/schemas/sml-baseTypes.xsd>
[ERROR] xml ErrorLoading schema file <https://ci-builds.apache.org/job/POI/job/POI-DSL-Maven/ws/sonar/ooxml-schema/target/schemas/sml-styles.xsd>
[ERROR] xml ErrorLoading schema file <https://ci-builds.apache.org/job/POI/job/POI-DSL-Maven/ws/sonar/ooxml-schema/target/schemas/vml-presentationDrawing.xsd>
[ERROR] xml ErrorLoading schema file <https://ci-builds.apache.org/job/POI/job/POI-DSL-Maven/ws/sonar/ooxml-schema/target/schemas/dml-baseStylesheet.xsd>
[ERROR] xml ErrorLoading schema file <https://ci-builds.apache.org/job/POI/job/POI-DSL-Maven/ws/sonar/ooxml-schema/target/schemas/dml-tableStyle.xsd>
[ERROR] xml ErrorLoading schema file <https://ci-builds.apache.org/job/POI/job/POI-DSL-Maven/ws/sonar/ooxml-schema/target/schemas/pml-baseTypes.xsd>
[ERROR] xml ErrorLoading schema file <https://ci-builds.apache.org/job/POI/job/POI-DSL-Maven/ws/sonar/ooxml-schema/target/schemas/shared-documentPropertiesCustom.xsd>
[ERROR] xml ErrorLoading schema file <https://ci-builds.apache.org/job/POI/job/POI-DSL-Maven/ws/sonar/ooxml-schema/target/schemas/dml-diagramDefinition.xsd>
[ERROR] xml ErrorLoading schema file <https://ci-builds.apache.org/job/POI/job/POI-DSL-Maven/ws/sonar/ooxml-schema/target/schemas/dml-shapeEffects.xsd>
[ERROR] xml ErrorLoading schema file <https://ci-builds.apache.org/job/POI/job/POI-DSL-Maven/ws/sonar/ooxml-schema/target/schemas/dml-shapeMiscellaneous.xsd>
[ERROR] xml ErrorLoading schema file <https://ci-builds.apache.org/job/POI/job/POI-DSL-Maven/ws/sonar/ooxml-schema/target/schemas/sml-autoFilter.xsd>
[ERROR] xml ErrorLoading schema file <https://ci-builds.apache.org/job/POI/job/POI-DSL-Maven/ws/sonar/ooxml-schema/target/schemas/dml-chartDrawing.xsd>
[ERROR] xml ErrorLoading schema file <https://ci-builds.apache.org/job/POI/job/POI-DSL-Maven/ws/sonar/ooxml-schema/target/schemas/dml-diagramStyleDefinition.xsd>
[ERROR] xml ErrorLoading schema file <https://ci-builds.apache.org/job/POI/job/POI-DSL-Maven/ws/sonar/ooxml-schema/target/schemas/shared-additionalCharacteristics.xsd>
[ERROR] xml ErrorLoading schema file <https://ci-builds.apache.org/job/POI/job/POI-DSL-Maven/ws/sonar/ooxml-schema/target/schemas/dml-textParagraph.xsd>
[ERROR] xml ErrorLoading schema file <https://ci-builds.apache.org/job/POI/job/POI-DSL-Maven/ws/sonar/ooxml-schema/target/schemas/pml-presentation.xsd>
[ERROR] xml ErrorLoading schema file <https://ci-builds.apache.org/job/POI/job/POI-DSL-Maven/ws/sonar/ooxml-schema/target/schemas/visio.xsd>
[ERROR] xml ErrorLoading schema file <https://ci-builds.apache.org/job/POI/job/POI-DSL-Maven/ws/sonar/ooxml-schema/target/schemas/dml-wordprocessingDrawing.xsd>
[ERROR] xml ErrorLoading schema file <https://ci-builds.apache.org/job/POI/job/POI-DSL-Maven/ws/sonar/ooxml-schema/target/schemas/sml-externalConnections.xsd>
[ERROR] xml ErrorLoading config file <https://ci-builds.apache.org/job/POI/job/POI-DSL-Maven/ws/sonar/ooxml-schema/../../src/ooxml/resources/org/apache/poi/poifs/crypt/encryptionCertificate.xsdconfig>
[ERROR] xml ErrorLoading config file <https://ci-builds.apache.org/job/POI/job/POI-DSL-Maven/ws/sonar/ooxml-schema/../../src/ooxml/resources/org/apache/poi/poifs/crypt/encryptionInfo.xsdconfig>
[ERROR] xml ErrorLoading config file <https://ci-builds.apache.org/job/POI/job/POI-DSL-Maven/ws/sonar/ooxml-schema/../../src/ooxml/resources/org/apache/poi/poifs/crypt/encryptionPassword.xsdconfig>
[ERROR] xml ErrorLoading config file <https://ci-builds.apache.org/job/POI/job/POI-DSL-Maven/ws/sonar/ooxml-schema/../../src/ooxml/resources/org/apache/poi/schemas/ooxmlSchemas.xsdconfig>
[ERROR] xml Error<https://ci-builds.apache.org/job/POI/job/POI-DSL-Maven/ws/sonar/ooxml-schema/target/schemas/wml.xsd>:5537:9: error: src-resolve: attribute 'space@http://www.w3.org/XML/1998/namespace' not found.
[ERROR] xml Error<https://ci-builds.apache.org/job/POI/job/POI-DSL-Maven/ws/sonar/ooxml-schema/target/schemas/shared-math.xsd>:413:9: error: src-resolve: attribute 'space@http://www.w3.org/XML/1998/namespace' not found.
[ERROR]
[ERROR] -> [Help 1]
[ERROR]
[ERROR] To see the full stack trace of the errors, re-run Maven with the -e switch.
[ERROR] Re-run Maven using the -X switch to enable full debug logging.
[ERROR]
[ERROR] For more information about the errors and possible solutions, please read the following articles:
[ERROR] [Help 1] http://cwiki.apache.org/confluence/display/MAVEN/MojoExecutionException
[ERROR]
[ERROR] After correcting the problems, you can resume the build with the command
[ERROR]   mvn <args> -rf :poi-ooxml-schema
Build step 'Invoke top-level Maven targets' marked build as failure
Recording test results

---------------------------------------------------------------------
To unsubscribe, e-mail: [hidden email]
For additional commands, e-mail: [hidden email]

Reply | Threaded
Open this post in threaded view
|

Build failed in Jenkins: POI » POI-DSL-Maven #37

Apache Jenkins Server
See <https://ci-builds.apache.org/job/POI/job/POI-DSL-Maven/37/display/redirect?page=changes>

Changes:

[Andreas Beeker] #64817 - Fix issue in testXLSXinPPT


------------------------------------------
[...truncated 816.14 KB...]
                        Length is 0 (0x0)
                        Compressed is false
                        Stream is org.apache.poi.hdgf.streams.UnknownStream
                        First few bytes are []
                Stream at 0 (0x0)
                        Type is 0 (0x0)
                        Format is 0 (0x0)
                        Length is 0 (0x0)
                        Compressed is false
                        Stream is org.apache.poi.hdgf.streams.UnknownStream
                        First few bytes are []
                Stream at 35161 (0x8959)
                        Type is 69 (0x45)
                        Format is 82 (0x52)
                        Length is 13 (0xd)
                        DC.Length is 72 (0x48)
                        Compressed is true
                        Stream is org.apache.poi.hdgf.streams.PointerContainingStream
                        First few bytes are [60, 0, 0, 0, 0, 0, 0, 0, 0, 0, 0, 0, 0, 0, 0, 0, 0, 0, 0, 0, 0, 0, 0, 0, 0, 0, 0, 0, 0, 0, 0, 0, 0, 0, 0, 0, 0, 0, 0, 0, 0, 0, 0, 0, 0, 0, 0, 0, 0, 0, 0, 0, 0, 0, 0, 0, 0, 0, 0, 0, 0, 0, 0, 0, 0, 0, 0, 0, 0, 0, 0, 0]
                        Nbr of children 0 (0x0)
[INFO] Tests run: 1, Failures: 0, Errors: 0, Skipped: 0, Time elapsed: 1.339 s - in org.apache.poi.hdgf.dev.TestVSDDumper
[INFO] Running org.apache.poi.hdgf.chunks.TestChunks
[INFO] Tests run: 5, Failures: 0, Errors: 0, Skipped: 0, Time elapsed: 0.001 s - in org.apache.poi.hdgf.chunks.TestChunks
[INFO] Running org.apache.poi.hdgf.TestHDGFCore
[INFO] Tests run: 7, Failures: 0, Errors: 0, Skipped: 0, Time elapsed: 0.035 s - in org.apache.poi.hdgf.TestHDGFCore
[INFO] Running org.apache.poi.hsmf.TestNameIdChunks
[INFO] Tests run: 2, Failures: 0, Errors: 0, Skipped: 0, Time elapsed: 0.044 s - in org.apache.poi.hsmf.TestNameIdChunks
[INFO] Running org.apache.poi.hsmf.TestFixedSizedProperties
[INFO] Tests run: 7, Failures: 0, Errors: 0, Skipped: 0, Time elapsed: 0.046 s - in org.apache.poi.hsmf.TestFixedSizedProperties
[INFO] Running org.apache.poi.hsmf.Test7BitCodepage
[INFO] Tests run: 1, Failures: 0, Errors: 0, Skipped: 0, Time elapsed: 0.029 s - in org.apache.poi.hsmf.Test7BitCodepage
[INFO] Running org.apache.poi.hsmf.datatypes.TestTypes
[INFO] Tests run: 3, Failures: 0, Errors: 0, Skipped: 0, Time elapsed: 0.001 s - in org.apache.poi.hsmf.datatypes.TestTypes
[INFO] Running org.apache.poi.hsmf.datatypes.TestSorters
[INFO] Tests run: 2, Failures: 0, Errors: 0, Skipped: 0, Time elapsed: 0.001 s - in org.apache.poi.hsmf.datatypes.TestSorters
[INFO] Running org.apache.poi.hsmf.datatypes.TestChunkData
[INFO] Tests run: 6, Failures: 0, Errors: 0, Skipped: 0, Time elapsed: 0.001 s - in org.apache.poi.hsmf.datatypes.TestChunkData
[INFO] Running org.apache.poi.hsmf.datatypes.TestMAPIProperty
[INFO] Tests run: 3, Failures: 0, Errors: 0, Skipped: 0, Time elapsed: 0.001 s - in org.apache.poi.hsmf.datatypes.TestMAPIProperty
[INFO] Running org.apache.poi.hsmf.TestBlankFileRead
[INFO] Tests run: 7, Failures: 0, Errors: 0, Skipped: 0, Time elapsed: 0.001 s - in org.apache.poi.hsmf.TestBlankFileRead
[INFO] Running org.apache.poi.hsmf.TestSimpleFileRead
[INFO] Tests run: 9, Failures: 0, Errors: 0, Skipped: 0, Time elapsed: 0.034 s - in org.apache.poi.hsmf.TestSimpleFileRead
[INFO] Running org.apache.poi.hsmf.extractor.TestOutlookTextExtractor
[INFO] Tests run: 8, Failures: 0, Errors: 0, Skipped: 0, Time elapsed: 0.124 s - in org.apache.poi.hsmf.extractor.TestOutlookTextExtractor
[INFO] Running org.apache.poi.hsmf.TestExtractEmbeddedMSG
[INFO] Tests run: 1, Failures: 0, Errors: 0, Skipped: 0, Time elapsed: 0.01 s - in org.apache.poi.hsmf.TestExtractEmbeddedMSG
[INFO] Running org.apache.poi.hsmf.TestMessageSubmissionChunk
[INFO] Tests run: 2, Failures: 0, Errors: 0, Skipped: 0, Time elapsed: 0.007 s - in org.apache.poi.hsmf.TestMessageSubmissionChunk
[INFO] Running org.apache.poi.hsmf.TestOutlook30FileRead
[INFO] Tests run: 9, Failures: 0, Errors: 0, Skipped: 0, Time elapsed: 0.076 s - in org.apache.poi.hsmf.TestOutlook30FileRead
[INFO] Running org.apache.poi.hsmf.TestFileWithAttachmentsRead
[INFO] Tests run: 4, Failures: 0, Errors: 0, Skipped: 0, Time elapsed: 0.001 s - in org.apache.poi.hsmf.TestFileWithAttachmentsRead
[INFO] Running org.apache.poi.hsmf.parsers.TestPOIFSChunkParser
[INFO] Tests run: 6, Failures: 0, Errors: 0, Skipped: 0, Time elapsed: 0.073 s - in org.apache.poi.hsmf.parsers.TestPOIFSChunkParser
[INFO] Running org.apache.poi.hsmf.TestBasics
[INFO] Tests run: 9, Failures: 0, Errors: 0, Skipped: 0, Time elapsed: 0.154 s - in org.apache.poi.hsmf.TestBasics
[INFO] Running org.apache.poi.hsmf.TestMessageSubmissionChunkY2KRead
[INFO] Tests run: 3, Failures: 0, Errors: 0, Skipped: 0, Time elapsed: 0.019 s - in org.apache.poi.hsmf.TestMessageSubmissionChunkY2KRead
[INFO] Running org.apache.poi.hwmf.TestHwmfParsing
[WARNING] Tests run: 5, Failures: 0, Errors: 0, Skipped: 1, Time elapsed: 0.017 s - in org.apache.poi.hwmf.TestHwmfParsing
[INFO] Running org.apache.poi.hmef.TestCompressedRTF
[INFO] Tests run: 4, Failures: 0, Errors: 0, Skipped: 0, Time elapsed: 0.02 s - in org.apache.poi.hmef.TestCompressedRTF
[INFO] Running org.apache.poi.hmef.TestBugs
[INFO] Tests run: 3, Failures: 0, Errors: 0, Skipped: 0, Time elapsed: 0.007 s - in org.apache.poi.hmef.TestBugs
[INFO] Running org.apache.poi.hmef.TestAttachments
[INFO] Tests run: 4, Failures: 0, Errors: 0, Skipped: 0, Time elapsed: 0.003 s - in org.apache.poi.hmef.TestAttachments
[INFO] Running org.apache.poi.hmef.extractor.TestHMEFContentsExtractor
Extracting...
Extraction completed
[INFO] Tests run: 3, Failures: 0, Errors: 0, Skipped: 0, Time elapsed: 0.011 s - in org.apache.poi.hmef.extractor.TestHMEFContentsExtractor
[INFO] Running org.apache.poi.hmef.dev.TestHMEFDumper
[INFO] Tests run: 3, Failures: 0, Errors: 0, Skipped: 0, Time elapsed: 0.025 s - in org.apache.poi.hmef.dev.TestHMEFDumper
[INFO] Running org.apache.poi.hmef.TestHMEFMessage
[INFO] Tests run: 9, Failures: 0, Errors: 0, Skipped: 0, Time elapsed: 0.014 s - in org.apache.poi.hmef.TestHMEFMessage
[INFO] Running org.apache.poi.hmef.attribute.TestMAPIAttributes
[INFO] Tests run: 4, Failures: 0, Errors: 0, Skipped: 0, Time elapsed: 0.008 s - in org.apache.poi.hmef.attribute.TestMAPIAttributes
[INFO] Running org.apache.poi.hmef.attribute.TestTNEFAttributes
[INFO] Tests run: 6, Failures: 0, Errors: 0, Skipped: 0, Time elapsed: 0.011 s - in org.apache.poi.hmef.attribute.TestTNEFAttributes
[INFO]
[INFO] Results:
[INFO]
[WARNING] Tests run: 3089, Failures: 0, Errors: 0, Skipped: 5
[INFO]
[INFO]
[INFO] --- jacoco-maven-plugin:0.8.6:report (report) @ poi-scratchpad ---
[INFO] Loading execution data file <https://ci-builds.apache.org/job/POI/job/POI-DSL-Maven/ws/sonar/scratchpad/target/jacoco.exec>
[INFO] Analyzed bundle 'Apache POI Scratchpad package' with 875 classes
[INFO]
[INFO] --- maven-jar-plugin:2.4:jar (default-jar) @ poi-scratchpad ---
[INFO] Building jar: <https://ci-builds.apache.org/job/POI/job/POI-DSL-Maven/ws/sonar/scratchpad/target/poi-scratchpad-5.0.0-SNAPSHOT.jar>
[INFO]
[INFO] ------------------< org.apache.poi:poi-ooxml-schema >-------------------
[INFO] Building Apache POI - Openxmlformats Schema package 5.0.0-SNAPSHOT [4/10]
[INFO] --------------------------------[ jar ]---------------------------------
[INFO]
[INFO] --- jacoco-maven-plugin:0.8.6:prepare-agent (default) @ poi-ooxml-schema ---
[INFO] argLine set to -javaagent:<https://ci-builds.apache.org/job/POI/job/POI-DSL-Maven/ws/.repository/org/jacoco/org.jacoco.agent/0.8.6/org.jacoco.agent-0.8.6-runtime.jar=destfile=/home/jenkins/workspace/POI/POI-DSL-Maven/sonar/ooxml-schema/target/jacoco.exec> -Xmx1024m
[INFO]
[INFO] --- download-maven-plugin:1.5.0:wget (download-xsds) @ poi-ooxml-schema ---
[INFO] Got from cache: <https://ci-builds.apache.org/job/POI/job/POI-DSL-Maven/ws/.repository/.cache/download-maven-plugin/Office%20Open%20XML%201st%20edition%20Part%204%20(PDF).zip_c501e12cb3c66007e0f51e41db066eac>
[INFO]
[INFO] --- maven-antrun-plugin:1.8:run (copy-xmltype-and-xsdconfig) @ poi-ooxml-schema ---
[INFO] Executing tasks

main:
     [copy] Copying 6 files to <https://ci-builds.apache.org/job/POI/job/POI-DSL-Maven/ws/sonar/ooxml-schema/target/schemas>
[INFO] Executed tasks
[INFO]
[INFO] --- maven-antrun-plugin:1.8:run (unzip-schema) @ poi-ooxml-schema ---
[INFO] Executing tasks

main:
     [echo] unzip schemas
    [unzip] Expanding: <https://ci-builds.apache.org/job/POI/job/POI-DSL-Maven/ws/sonar/ooxml-schema/target/OfficeOpenXML-XMLSchema.zip> into <https://ci-builds.apache.org/job/POI/job/POI-DSL-Maven/ws/sonar/ooxml-schema/target/schemas>
     [copy] Copying 1 file to <https://ci-builds.apache.org/job/POI/job/POI-DSL-Maven/ws/sonar/ooxml-schema/target/schemas>
[INFO] Executed tasks
[INFO]
[INFO] --- xmlbeans-maven-plugin:2.3.3:xmlbeans (default) @ poi-ooxml-schema ---
[INFO] ------------------------------------------------------------------------
[INFO] Reactor Summary for Apache POI - the Java API for Microsoft Documents 5.0.0-SNAPSHOT:
[INFO]
[INFO] Apache POI - the Java API for Microsoft Documents .. SUCCESS [  0.874 s]
[INFO] Apache POI Main package ............................ SUCCESS [03:57 min]
[INFO] Apache POI Scratchpad package ...................... SUCCESS [ 27.311 s]
[INFO] Apache POI - Openxmlformats Schema package ......... FAILURE [  6.150 s]
[INFO] Apache POI - Openxmlformats Encryption Schema package SKIPPED
[INFO] Apache POI - Openxmlformats Security-Schema package  SKIPPED
[INFO] Apache POI OOXML package ........................... SKIPPED
[INFO] Apache POI ExcelAnt package ........................ SKIPPED
[INFO] Apache POI Examples package ........................ SKIPPED
[INFO] Apache POI integration test ........................ SKIPPED
[INFO] ------------------------------------------------------------------------
[INFO] BUILD FAILURE
[INFO] ------------------------------------------------------------------------
[INFO] Total time:  04:32 min
[INFO] Finished at: 2020-10-19T00:37:16Z
[INFO] ------------------------------------------------------------------------
[ERROR] Failed to execute goal org.codehaus.mojo:xmlbeans-maven-plugin:2.3.3:xmlbeans (default) on project poi-ooxml-schema: XmlBeans compile failed:
[ERROR]  xml ErrorLoading schema file <https://ci-builds.apache.org/job/POI/job/POI-DSL-Maven/ws/sonar/ooxml-schema/target/schemas/sml-sharedWorkbookRevisions.xsd>
[ERROR] xml ErrorLoading schema file <https://ci-builds.apache.org/job/POI/job/POI-DSL-Maven/ws/sonar/ooxml-schema/target/schemas/dml-shapeStyle.xsd>
[ERROR] xml ErrorLoading schema file <https://ci-builds.apache.org/job/POI/job/POI-DSL-Maven/ws/sonar/ooxml-schema/target/schemas/vml-main.xsd>
[ERROR] xml ErrorLoading schema file <https://ci-builds.apache.org/job/POI/job/POI-DSL-Maven/ws/sonar/ooxml-schema/target/schemas/pml-userDefinedTags.xsd>
[ERROR] xml ErrorLoading schema file <https://ci-builds.apache.org/job/POI/job/POI-DSL-Maven/ws/sonar/ooxml-schema/target/schemas/dml-shape3DCamera.xsd>
[ERROR] xml ErrorLoading schema file <https://ci-builds.apache.org/job/POI/job/POI-DSL-Maven/ws/sonar/ooxml-schema/target/schemas/sml-volatileDependencies.xsd>
[ERROR] xml ErrorLoading schema file <https://ci-builds.apache.org/job/POI/job/POI-DSL-Maven/ws/sonar/ooxml-schema/target/schemas/dml-gvml.xsd>
[ERROR] xml ErrorLoading schema file <https://ci-builds.apache.org/job/POI/job/POI-DSL-Maven/ws/sonar/ooxml-schema/target/schemas/wml.xsd>
[ERROR] xml ErrorLoading schema file <https://ci-builds.apache.org/job/POI/job/POI-DSL-Maven/ws/sonar/ooxml-schema/target/schemas/dml-graphicalObject.xsd>
[ERROR] xml ErrorLoading schema file <https://ci-builds.apache.org/job/POI/job/POI-DSL-Maven/ws/sonar/ooxml-schema/target/schemas/dml-diagramLayoutVariables.xsd>
[ERROR] xml ErrorLoading schema file <https://ci-builds.apache.org/job/POI/job/POI-DSL-Maven/ws/sonar/ooxml-schema/target/schemas/dml-shape3DStyles.xsd>
[ERROR] xml ErrorLoading schema file <https://ci-builds.apache.org/job/POI/job/POI-DSL-Maven/ws/sonar/ooxml-schema/target/schemas/dml-styleDefaults.xsd>
[ERROR] xml ErrorLoading schema file <https://ci-builds.apache.org/job/POI/job/POI-DSL-Maven/ws/sonar/ooxml-schema/target/schemas/shared-customXmlDataProperties.xsd>
[ERROR] xml ErrorLoading schema file <https://ci-builds.apache.org/job/POI/job/POI-DSL-Maven/ws/sonar/ooxml-schema/target/schemas/dml-documentProperties.xsd>
[ERROR] xml ErrorLoading schema file <https://ci-builds.apache.org/job/POI/job/POI-DSL-Maven/ws/sonar/ooxml-schema/target/schemas/xmldsig-core-schema.xsd>
[ERROR] xml ErrorLoading schema file <https://ci-builds.apache.org/job/POI/job/POI-DSL-Maven/ws/sonar/ooxml-schema/target/schemas/dml-textRun.xsd>
[ERROR] xml ErrorLoading schema file <https://ci-builds.apache.org/job/POI/job/POI-DSL-Maven/ws/sonar/ooxml-schema/target/schemas/dml-textCharacter.xsd>
[ERROR] xml ErrorLoading schema file <https://ci-builds.apache.org/job/POI/job/POI-DSL-Maven/ws/sonar/ooxml-schema/target/schemas/dml-audioVideo.xsd>
[ERROR] xml ErrorLoading schema file <https://ci-builds.apache.org/job/POI/job/POI-DSL-Maven/ws/sonar/ooxml-schema/target/schemas/dml-shape3DLighting.xsd>
[ERROR] xml ErrorLoading schema file <https://ci-builds.apache.org/job/POI/job/POI-DSL-Maven/ws/sonar/ooxml-schema/target/schemas/dml-diagramDataModel.xsd>
[ERROR] xml ErrorLoading schema file <https://ci-builds.apache.org/job/POI/job/POI-DSL-Maven/ws/sonar/ooxml-schema/target/schemas/sml-singleCellTable.xsd>
[ERROR] xml ErrorLoading schema file <https://ci-builds.apache.org/job/POI/job/POI-DSL-Maven/ws/sonar/ooxml-schema/target/schemas/pml-animationInfo.xsd>
[ERROR] xml ErrorLoading schema file <https://ci-builds.apache.org/job/POI/job/POI-DSL-Maven/ws/sonar/ooxml-schema/target/schemas/dml-baseTypes.xsd>
[ERROR] xml ErrorLoading schema file <https://ci-builds.apache.org/job/POI/job/POI-DSL-Maven/ws/sonar/ooxml-schema/target/schemas/pml-presentationProperties.xsd>
[ERROR] xml ErrorLoading schema file <https://ci-builds.apache.org/job/POI/job/POI-DSL-Maven/ws/sonar/ooxml-schema/target/schemas/markup-compatibility.xsd>
[ERROR] xml ErrorLoading schema file <https://ci-builds.apache.org/job/POI/job/POI-DSL-Maven/ws/sonar/ooxml-schema/target/schemas/vmlDrawing.xsd>
[ERROR] xml ErrorLoading schema file <https://ci-builds.apache.org/job/POI/job/POI-DSL-Maven/ws/sonar/ooxml-schema/target/schemas/dml-shapeProperties.xsd>
[ERROR] xml ErrorLoading schema file <https://ci-builds.apache.org/job/POI/job/POI-DSL-Maven/ws/sonar/ooxml-schema/target/schemas/sml-calculationChain.xsd>
[ERROR] xml ErrorLoading schema file <https://ci-builds.apache.org/job/POI/job/POI-DSL-Maven/ws/sonar/ooxml-schema/target/schemas/dml-picture.xsd>
[ERROR] xml ErrorLoading schema file <https://ci-builds.apache.org/job/POI/job/POI-DSL-Maven/ws/sonar/ooxml-schema/target/schemas/dml-diagramElementPropertySet.xsd>
[ERROR] xml ErrorLoading schema file <https://ci-builds.apache.org/job/POI/job/POI-DSL-Maven/ws/sonar/ooxml-schema/target/schemas/dml-shape3DScene.xsd>
[ERROR] xml ErrorLoading schema file <https://ci-builds.apache.org/job/POI/job/POI-DSL-Maven/ws/sonar/ooxml-schema/target/schemas/sml-sharedWorkbookUserNames.xsd>
[ERROR] xml ErrorLoading schema file <https://ci-builds.apache.org/job/POI/job/POI-DSL-Maven/ws/sonar/ooxml-schema/target/schemas/pml-viewProperties.xsd>
[ERROR] xml ErrorLoading schema file <https://ci-builds.apache.org/job/POI/job/POI-DSL-Maven/ws/sonar/ooxml-schema/target/schemas/sml-workbook.xsd>
[ERROR] xml ErrorLoading schema file <https://ci-builds.apache.org/job/POI/job/POI-DSL-Maven/ws/sonar/ooxml-schema/target/schemas/shared-relationshipReference.xsd>
[ERROR] xml ErrorLoading schema file <https://ci-builds.apache.org/job/POI/job/POI-DSL-Maven/ws/sonar/ooxml-schema/target/schemas/dml-table.xsd>
[ERROR] xml ErrorLoading schema file <https://ci-builds.apache.org/job/POI/job/POI-DSL-Maven/ws/sonar/ooxml-schema/target/schemas/dml-graphicalObjectFormat.xsd>
[ERROR] xml ErrorLoading schema file <https://ci-builds.apache.org/job/POI/job/POI-DSL-Maven/ws/sonar/ooxml-schema/target/schemas/vml-officeDrawing.xsd>
[ERROR] xml ErrorLoading schema file <https://ci-builds.apache.org/job/POI/job/POI-DSL-Maven/ws/sonar/ooxml-schema/target/schemas/dml-diagramTypes.xsd>
[ERROR] xml ErrorLoading schema file <https://ci-builds.apache.org/job/POI/job/POI-DSL-Maven/ws/sonar/ooxml-schema/target/schemas/shared-customXmlSchemaProperties.xsd>
[ERROR] xml ErrorLoading schema file <https://ci-builds.apache.org/job/POI/job/POI-DSL-Maven/ws/sonar/ooxml-schema/target/schemas/sml-queryTable.xsd>
[ERROR] xml ErrorLoading schema file <https://ci-builds.apache.org/job/POI/job/POI-DSL-Maven/ws/sonar/ooxml-schema/target/schemas/sml-supplementaryWorkbooks.xsd>
[ERROR] xml ErrorLoading schema file <https://ci-builds.apache.org/job/POI/job/POI-DSL-Maven/ws/sonar/ooxml-schema/target/schemas/pml-embedding.xsd>
[ERROR] xml ErrorLoading schema file <https://ci-builds.apache.org/job/POI/job/POI-DSL-Maven/ws/sonar/ooxml-schema/target/schemas/sml-pivotTable.xsd>
[ERROR] xml ErrorLoading schema file <https://ci-builds.apache.org/job/POI/job/POI-DSL-Maven/ws/sonar/ooxml-schema/target/schemas/dml-shape3DScenePlane.xsd>
[ERROR] xml ErrorLoading schema file <https://ci-builds.apache.org/job/POI/job/POI-DSL-Maven/ws/sonar/ooxml-schema/target/schemas/sml-comments.xsd>
[ERROR] xml ErrorLoading schema file <https://ci-builds.apache.org/job/POI/job/POI-DSL-Maven/ws/sonar/ooxml-schema/target/schemas/sml-sheet.xsd>
[ERROR] xml ErrorLoading schema file <https://ci-builds.apache.org/job/POI/job/POI-DSL-Maven/ws/sonar/ooxml-schema/target/schemas/dml-chart.xsd>
[ERROR] xml ErrorLoading schema file <https://ci-builds.apache.org/job/POI/job/POI-DSL-Maven/ws/sonar/ooxml-schema/target/schemas/sml-customXmlMappings.xsd>
[ERROR] xml ErrorLoading schema file <https://ci-builds.apache.org/job/POI/job/POI-DSL-Maven/ws/sonar/ooxml-schema/target/schemas/sml-pivotTableShared.xsd>
[ERROR] xml ErrorLoading schema file <https://ci-builds.apache.org/job/POI/job/POI-DSL-Maven/ws/sonar/ooxml-schema/target/schemas/dml-textBullet.xsd>
[ERROR] xml ErrorLoading schema file <https://ci-builds.apache.org/job/POI/job/POI-DSL-Maven/ws/sonar/ooxml-schema/target/schemas/shared-documentPropertiesVariantTypes.xsd>
[ERROR] xml ErrorLoading schema file <https://ci-builds.apache.org/job/POI/job/POI-DSL-Maven/ws/sonar/ooxml-schema/target/schemas/dml-stylesheet.xsd>
[ERROR] xml ErrorLoading schema file <https://ci-builds.apache.org/job/POI/job/POI-DSL-Maven/ws/sonar/ooxml-schema/target/schemas/pml-slideSynchronizationData.xsd>
[ERROR] xml ErrorLoading schema file <https://ci-builds.apache.org/job/POI/job/POI-DSL-Maven/ws/sonar/ooxml-schema/target/schemas/dml-compatibility.xsd>
[ERROR] xml ErrorLoading schema file <https://ci-builds.apache.org/job/POI/job/POI-DSL-Maven/ws/sonar/ooxml-schema/target/schemas/vml-wordprocessingDrawing.xsd>
[ERROR] xml ErrorLoading schema file <https://ci-builds.apache.org/job/POI/job/POI-DSL-Maven/ws/sonar/ooxml-schema/target/schemas/dml-shapeGeometry.xsd>
[ERROR] xml ErrorLoading schema file <https://ci-builds.apache.org/job/POI/job/POI-DSL-Maven/ws/sonar/ooxml-schema/target/schemas/sml-sheetMetadata.xsd>
[ERROR] xml ErrorLoading schema file <https://ci-builds.apache.org/job/POI/job/POI-DSL-Maven/ws/sonar/ooxml-schema/target/schemas/dml-shapeLineProperties.xsd>
[ERROR] xml ErrorLoading schema file <https://ci-builds.apache.org/job/POI/job/POI-DSL-Maven/ws/sonar/ooxml-schema/target/schemas/vml-spreadsheetDrawing.xsd>
[ERROR] xml ErrorLoading schema file <https://ci-builds.apache.org/job/POI/job/POI-DSL-Maven/ws/sonar/ooxml-schema/target/schemas/dml-lockedCanvas.xsd>
[ERROR] xml ErrorLoading schema file <https://ci-builds.apache.org/job/POI/job/POI-DSL-Maven/ws/sonar/ooxml-schema/target/schemas/shared-math.xsd>
[ERROR] xml ErrorLoading schema file <https://ci-builds.apache.org/job/POI/job/POI-DSL-Maven/ws/sonar/ooxml-schema/target/schemas/dml-text.xsd>
[ERROR] xml ErrorLoading schema file <https://ci-builds.apache.org/job/POI/job/POI-DSL-Maven/ws/sonar/ooxml-schema/target/schemas/shared-bibliography.xsd>
[ERROR] xml ErrorLoading schema file <https://ci-builds.apache.org/job/POI/job/POI-DSL-Maven/ws/sonar/ooxml-schema/target/schemas/pml-slide.xsd>
[ERROR] xml ErrorLoading schema file <https://ci-builds.apache.org/job/POI/job/POI-DSL-Maven/ws/sonar/ooxml-schema/target/schemas/dml-diagramColorTransform.xsd>
[ERROR] xml ErrorLoading schema file <https://ci-builds.apache.org/job/POI/job/POI-DSL-Maven/ws/sonar/ooxml-schema/target/schemas/sml-table.xsd>
[ERROR] xml ErrorLoading schema file <https://ci-builds.apache.org/job/POI/job/POI-DSL-Maven/ws/sonar/ooxml-schema/target/schemas/dml-graphicalObjectAnimation.xsd>
[ERROR] xml ErrorLoading schema file <https://ci-builds.apache.org/job/POI/job/POI-DSL-Maven/ws/sonar/ooxml-schema/target/schemas/pml-comments.xsd>
[ERROR] xml ErrorLoading schema file <https://ci-builds.apache.org/job/POI/job/POI-DSL-Maven/ws/sonar/ooxml-schema/target/schemas/shared-documentPropertiesExtended.xsd>
[ERROR] xml ErrorLoading schema file <https://ci-builds.apache.org/job/POI/job/POI-DSL-Maven/ws/sonar/ooxml-schema/target/schemas/sml-sharedStringTable.xsd>
[ERROR] xml ErrorLoading schema file <https://ci-builds.apache.org/job/POI/job/POI-DSL-Maven/ws/sonar/ooxml-schema/target/schemas/dml-spreadsheetDrawing.xsd>
[ERROR] xml ErrorLoading schema file <https://ci-builds.apache.org/job/POI/job/POI-DSL-Maven/ws/sonar/ooxml-schema/target/schemas/sml-baseTypes.xsd>
[ERROR] xml ErrorLoading schema file <https://ci-builds.apache.org/job/POI/job/POI-DSL-Maven/ws/sonar/ooxml-schema/target/schemas/sml-styles.xsd>
[ERROR] xml ErrorLoading schema file <https://ci-builds.apache.org/job/POI/job/POI-DSL-Maven/ws/sonar/ooxml-schema/target/schemas/vml-presentationDrawing.xsd>
[ERROR] xml ErrorLoading schema file <https://ci-builds.apache.org/job/POI/job/POI-DSL-Maven/ws/sonar/ooxml-schema/target/schemas/dml-baseStylesheet.xsd>
[ERROR] xml ErrorLoading schema file <https://ci-builds.apache.org/job/POI/job/POI-DSL-Maven/ws/sonar/ooxml-schema/target/schemas/dml-tableStyle.xsd>
[ERROR] xml ErrorLoading schema file <https://ci-builds.apache.org/job/POI/job/POI-DSL-Maven/ws/sonar/ooxml-schema/target/schemas/pml-baseTypes.xsd>
[ERROR] xml ErrorLoading schema file <https://ci-builds.apache.org/job/POI/job/POI-DSL-Maven/ws/sonar/ooxml-schema/target/schemas/shared-documentPropertiesCustom.xsd>
[ERROR] xml ErrorLoading schema file <https://ci-builds.apache.org/job/POI/job/POI-DSL-Maven/ws/sonar/ooxml-schema/target/schemas/dml-diagramDefinition.xsd>
[ERROR] xml ErrorLoading schema file <https://ci-builds.apache.org/job/POI/job/POI-DSL-Maven/ws/sonar/ooxml-schema/target/schemas/dml-shapeEffects.xsd>
[ERROR] xml ErrorLoading schema file <https://ci-builds.apache.org/job/POI/job/POI-DSL-Maven/ws/sonar/ooxml-schema/target/schemas/dml-shapeMiscellaneous.xsd>
[ERROR] xml ErrorLoading schema file <https://ci-builds.apache.org/job/POI/job/POI-DSL-Maven/ws/sonar/ooxml-schema/target/schemas/sml-autoFilter.xsd>
[ERROR] xml ErrorLoading schema file <https://ci-builds.apache.org/job/POI/job/POI-DSL-Maven/ws/sonar/ooxml-schema/target/schemas/dml-chartDrawing.xsd>
[ERROR] xml ErrorLoading schema file <https://ci-builds.apache.org/job/POI/job/POI-DSL-Maven/ws/sonar/ooxml-schema/target/schemas/dml-diagramStyleDefinition.xsd>
[ERROR] xml ErrorLoading schema file <https://ci-builds.apache.org/job/POI/job/POI-DSL-Maven/ws/sonar/ooxml-schema/target/schemas/shared-additionalCharacteristics.xsd>
[ERROR] xml ErrorLoading schema file <https://ci-builds.apache.org/job/POI/job/POI-DSL-Maven/ws/sonar/ooxml-schema/target/schemas/dml-textParagraph.xsd>
[ERROR] xml ErrorLoading schema file <https://ci-builds.apache.org/job/POI/job/POI-DSL-Maven/ws/sonar/ooxml-schema/target/schemas/pml-presentation.xsd>
[ERROR] xml ErrorLoading schema file <https://ci-builds.apache.org/job/POI/job/POI-DSL-Maven/ws/sonar/ooxml-schema/target/schemas/visio.xsd>
[ERROR] xml ErrorLoading schema file <https://ci-builds.apache.org/job/POI/job/POI-DSL-Maven/ws/sonar/ooxml-schema/target/schemas/dml-wordprocessingDrawing.xsd>
[ERROR] xml ErrorLoading schema file <https://ci-builds.apache.org/job/POI/job/POI-DSL-Maven/ws/sonar/ooxml-schema/target/schemas/sml-externalConnections.xsd>
[ERROR] xml ErrorLoading config file <https://ci-builds.apache.org/job/POI/job/POI-DSL-Maven/ws/sonar/ooxml-schema/../../src/ooxml/resources/org/apache/poi/poifs/crypt/encryptionCertificate.xsdconfig>
[ERROR] xml ErrorLoading config file <https://ci-builds.apache.org/job/POI/job/POI-DSL-Maven/ws/sonar/ooxml-schema/../../src/ooxml/resources/org/apache/poi/poifs/crypt/encryptionInfo.xsdconfig>
[ERROR] xml ErrorLoading config file <https://ci-builds.apache.org/job/POI/job/POI-DSL-Maven/ws/sonar/ooxml-schema/../../src/ooxml/resources/org/apache/poi/poifs/crypt/encryptionPassword.xsdconfig>
[ERROR] xml ErrorLoading config file <https://ci-builds.apache.org/job/POI/job/POI-DSL-Maven/ws/sonar/ooxml-schema/../../src/ooxml/resources/org/apache/poi/schemas/ooxmlSchemas.xsdconfig>
[ERROR] xml Error<https://ci-builds.apache.org/job/POI/job/POI-DSL-Maven/ws/sonar/ooxml-schema/target/schemas/wml.xsd>:5537:9: error: src-resolve: attribute 'space@http://www.w3.org/XML/1998/namespace' not found.
[ERROR] xml Error<https://ci-builds.apache.org/job/POI/job/POI-DSL-Maven/ws/sonar/ooxml-schema/target/schemas/shared-math.xsd>:413:9: error: src-resolve: attribute 'space@http://www.w3.org/XML/1998/namespace' not found.
[ERROR]
[ERROR] -> [Help 1]
[ERROR]
[ERROR] To see the full stack trace of the errors, re-run Maven with the -e switch.
[ERROR] Re-run Maven using the -X switch to enable full debug logging.
[ERROR]
[ERROR] For more information about the errors and possible solutions, please read the following articles:
[ERROR] [Help 1] http://cwiki.apache.org/confluence/display/MAVEN/MojoExecutionException
[ERROR]
[ERROR] After correcting the problems, you can resume the build with the command
[ERROR]   mvn <args> -rf :poi-ooxml-schema
Build step 'Invoke top-level Maven targets' marked build as failure
Recording test results

---------------------------------------------------------------------
To unsubscribe, e-mail: [hidden email]
For additional commands, e-mail: [hidden email]

Reply | Threaded
Open this post in threaded view
|

Build failed in Jenkins: POI » POI-DSL-Maven #38

Apache Jenkins Server
See <https://ci-builds.apache.org/job/POI/job/POI-DSL-Maven/38/display/redirect?page=changes>

Changes:

[Andreas Beeker] Ignore test on no-scratchpad run


------------------------------------------
[...truncated 815.74 KB...]
                        Length is 0 (0x0)
                        Compressed is false
                        Stream is org.apache.poi.hdgf.streams.UnknownStream
                        First few bytes are []
                Stream at 0 (0x0)
                        Type is 0 (0x0)
                        Format is 0 (0x0)
                        Length is 0 (0x0)
                        Compressed is false
                        Stream is org.apache.poi.hdgf.streams.UnknownStream
                        First few bytes are []
                Stream at 35161 (0x8959)
                        Type is 69 (0x45)
                        Format is 82 (0x52)
                        Length is 13 (0xd)
                        DC.Length is 72 (0x48)
                        Compressed is true
                        Stream is org.apache.poi.hdgf.streams.PointerContainingStream
                        First few bytes are [60, 0, 0, 0, 0, 0, 0, 0, 0, 0, 0, 0, 0, 0, 0, 0, 0, 0, 0, 0, 0, 0, 0, 0, 0, 0, 0, 0, 0, 0, 0, 0, 0, 0, 0, 0, 0, 0, 0, 0, 0, 0, 0, 0, 0, 0, 0, 0, 0, 0, 0, 0, 0, 0, 0, 0, 0, 0, 0, 0, 0, 0, 0, 0, 0, 0, 0, 0, 0, 0, 0, 0]
                        Nbr of children 0 (0x0)
[INFO] Tests run: 1, Failures: 0, Errors: 0, Skipped: 0, Time elapsed: 1.246 s - in org.apache.poi.hdgf.dev.TestVSDDumper
[INFO] Running org.apache.poi.hdgf.chunks.TestChunks
[INFO] Tests run: 5, Failures: 0, Errors: 0, Skipped: 0, Time elapsed: 0.001 s - in org.apache.poi.hdgf.chunks.TestChunks
[INFO] Running org.apache.poi.hdgf.TestHDGFCore
[INFO] Tests run: 7, Failures: 0, Errors: 0, Skipped: 0, Time elapsed: 0.02 s - in org.apache.poi.hdgf.TestHDGFCore
[INFO] Running org.apache.poi.hsmf.TestNameIdChunks
[INFO] Tests run: 2, Failures: 0, Errors: 0, Skipped: 0, Time elapsed: 0.053 s - in org.apache.poi.hsmf.TestNameIdChunks
[INFO] Running org.apache.poi.hsmf.TestFixedSizedProperties
[INFO] Tests run: 7, Failures: 0, Errors: 0, Skipped: 0, Time elapsed: 0.059 s - in org.apache.poi.hsmf.TestFixedSizedProperties
[INFO] Running org.apache.poi.hsmf.Test7BitCodepage
[INFO] Tests run: 1, Failures: 0, Errors: 0, Skipped: 0, Time elapsed: 0.037 s - in org.apache.poi.hsmf.Test7BitCodepage
[INFO] Running org.apache.poi.hsmf.datatypes.TestTypes
[INFO] Tests run: 3, Failures: 0, Errors: 0, Skipped: 0, Time elapsed: 0.002 s - in org.apache.poi.hsmf.datatypes.TestTypes
[INFO] Running org.apache.poi.hsmf.datatypes.TestSorters
[INFO] Tests run: 2, Failures: 0, Errors: 0, Skipped: 0, Time elapsed: 0.002 s - in org.apache.poi.hsmf.datatypes.TestSorters
[INFO] Running org.apache.poi.hsmf.datatypes.TestChunkData
[INFO] Tests run: 6, Failures: 0, Errors: 0, Skipped: 0, Time elapsed: 0.001 s - in org.apache.poi.hsmf.datatypes.TestChunkData
[INFO] Running org.apache.poi.hsmf.datatypes.TestMAPIProperty
[INFO] Tests run: 3, Failures: 0, Errors: 0, Skipped: 0, Time elapsed: 0.001 s - in org.apache.poi.hsmf.datatypes.TestMAPIProperty
[INFO] Running org.apache.poi.hsmf.TestBlankFileRead
[INFO] Tests run: 7, Failures: 0, Errors: 0, Skipped: 0, Time elapsed: 0.007 s - in org.apache.poi.hsmf.TestBlankFileRead
[INFO] Running org.apache.poi.hsmf.TestSimpleFileRead
[INFO] Tests run: 9, Failures: 0, Errors: 0, Skipped: 0, Time elapsed: 0.052 s - in org.apache.poi.hsmf.TestSimpleFileRead
[INFO] Running org.apache.poi.hsmf.extractor.TestOutlookTextExtractor
[INFO] Tests run: 8, Failures: 0, Errors: 0, Skipped: 0, Time elapsed: 0.145 s - in org.apache.poi.hsmf.extractor.TestOutlookTextExtractor
[INFO] Running org.apache.poi.hsmf.TestExtractEmbeddedMSG
[INFO] Tests run: 1, Failures: 0, Errors: 0, Skipped: 0, Time elapsed: 0.009 s - in org.apache.poi.hsmf.TestExtractEmbeddedMSG
[INFO] Running org.apache.poi.hsmf.TestMessageSubmissionChunk
[INFO] Tests run: 2, Failures: 0, Errors: 0, Skipped: 0, Time elapsed: 0.006 s - in org.apache.poi.hsmf.TestMessageSubmissionChunk
[INFO] Running org.apache.poi.hsmf.TestOutlook30FileRead
[INFO] Tests run: 9, Failures: 0, Errors: 0, Skipped: 0, Time elapsed: 0.092 s - in org.apache.poi.hsmf.TestOutlook30FileRead
[INFO] Running org.apache.poi.hsmf.TestFileWithAttachmentsRead
[INFO] Tests run: 4, Failures: 0, Errors: 0, Skipped: 0, Time elapsed: 0.002 s - in org.apache.poi.hsmf.TestFileWithAttachmentsRead
[INFO] Running org.apache.poi.hsmf.parsers.TestPOIFSChunkParser
[INFO] Tests run: 6, Failures: 0, Errors: 0, Skipped: 0, Time elapsed: 0.078 s - in org.apache.poi.hsmf.parsers.TestPOIFSChunkParser
[INFO] Running org.apache.poi.hsmf.TestBasics
[INFO] Tests run: 9, Failures: 0, Errors: 0, Skipped: 0, Time elapsed: 0.154 s - in org.apache.poi.hsmf.TestBasics
[INFO] Running org.apache.poi.hsmf.TestMessageSubmissionChunkY2KRead
[INFO] Tests run: 3, Failures: 0, Errors: 0, Skipped: 0, Time elapsed: 0.008 s - in org.apache.poi.hsmf.TestMessageSubmissionChunkY2KRead
[INFO] Running org.apache.poi.hwmf.TestHwmfParsing
[WARNING] Tests run: 5, Failures: 0, Errors: 0, Skipped: 1, Time elapsed: 0.021 s - in org.apache.poi.hwmf.TestHwmfParsing
[INFO] Running org.apache.poi.hmef.TestCompressedRTF
[INFO] Tests run: 4, Failures: 0, Errors: 0, Skipped: 0, Time elapsed: 0.021 s - in org.apache.poi.hmef.TestCompressedRTF
[INFO] Running org.apache.poi.hmef.TestBugs
[INFO] Tests run: 3, Failures: 0, Errors: 0, Skipped: 0, Time elapsed: 0.006 s - in org.apache.poi.hmef.TestBugs
[INFO] Running org.apache.poi.hmef.TestAttachments
[INFO] Tests run: 4, Failures: 0, Errors: 0, Skipped: 0, Time elapsed: 0.003 s - in org.apache.poi.hmef.TestAttachments
[INFO] Running org.apache.poi.hmef.extractor.TestHMEFContentsExtractor
Extracting...
Extraction completed
[INFO] Tests run: 3, Failures: 0, Errors: 0, Skipped: 0, Time elapsed: 0.01 s - in org.apache.poi.hmef.extractor.TestHMEFContentsExtractor
[INFO] Running org.apache.poi.hmef.dev.TestHMEFDumper
[INFO] Tests run: 3, Failures: 0, Errors: 0, Skipped: 0, Time elapsed: 0.02 s - in org.apache.poi.hmef.dev.TestHMEFDumper
[INFO] Running org.apache.poi.hmef.TestHMEFMessage
[INFO] Tests run: 9, Failures: 0, Errors: 0, Skipped: 0, Time elapsed: 0.014 s - in org.apache.poi.hmef.TestHMEFMessage
[INFO] Running org.apache.poi.hmef.attribute.TestMAPIAttributes
[INFO] Tests run: 4, Failures: 0, Errors: 0, Skipped: 0, Time elapsed: 0.009 s - in org.apache.poi.hmef.attribute.TestMAPIAttributes
[INFO] Running org.apache.poi.hmef.attribute.TestTNEFAttributes
[INFO] Tests run: 6, Failures: 0, Errors: 0, Skipped: 0, Time elapsed: 0.012 s - in org.apache.poi.hmef.attribute.TestTNEFAttributes
[INFO]
[INFO] Results:
[INFO]
[WARNING] Tests run: 3089, Failures: 0, Errors: 0, Skipped: 5
[INFO]
[INFO]
[INFO] --- jacoco-maven-plugin:0.8.6:report (report) @ poi-scratchpad ---
[INFO] Loading execution data file <https://ci-builds.apache.org/job/POI/job/POI-DSL-Maven/ws/sonar/scratchpad/target/jacoco.exec>
[INFO] Analyzed bundle 'Apache POI Scratchpad package' with 875 classes
[INFO]
[INFO] --- maven-jar-plugin:2.4:jar (default-jar) @ poi-scratchpad ---
[INFO] Building jar: <https://ci-builds.apache.org/job/POI/job/POI-DSL-Maven/ws/sonar/scratchpad/target/poi-scratchpad-5.0.0-SNAPSHOT.jar>
[INFO]
[INFO] ------------------< org.apache.poi:poi-ooxml-schema >-------------------
[INFO] Building Apache POI - Openxmlformats Schema package 5.0.0-SNAPSHOT [4/10]
[INFO] --------------------------------[ jar ]---------------------------------
[INFO]
[INFO] --- jacoco-maven-plugin:0.8.6:prepare-agent (default) @ poi-ooxml-schema ---
[INFO] argLine set to -javaagent:<https://ci-builds.apache.org/job/POI/job/POI-DSL-Maven/ws/.repository/org/jacoco/org.jacoco.agent/0.8.6/org.jacoco.agent-0.8.6-runtime.jar=destfile=/home/jenkins/workspace/POI/POI-DSL-Maven/sonar/ooxml-schema/target/jacoco.exec> -Xmx1024m
[INFO]
[INFO] --- download-maven-plugin:1.5.0:wget (download-xsds) @ poi-ooxml-schema ---
[INFO] Got from cache: <https://ci-builds.apache.org/job/POI/job/POI-DSL-Maven/ws/.repository/.cache/download-maven-plugin/Office%20Open%20XML%201st%20edition%20Part%204%20(PDF).zip_c501e12cb3c66007e0f51e41db066eac>
[INFO]
[INFO] --- maven-antrun-plugin:1.8:run (copy-xmltype-and-xsdconfig) @ poi-ooxml-schema ---
[INFO] Executing tasks

main:
     [copy] Copying 6 files to <https://ci-builds.apache.org/job/POI/job/POI-DSL-Maven/ws/sonar/ooxml-schema/target/schemas>
[INFO] Executed tasks
[INFO]
[INFO] --- maven-antrun-plugin:1.8:run (unzip-schema) @ poi-ooxml-schema ---
[INFO] Executing tasks

main:
     [echo] unzip schemas
    [unzip] Expanding: <https://ci-builds.apache.org/job/POI/job/POI-DSL-Maven/ws/sonar/ooxml-schema/target/OfficeOpenXML-XMLSchema.zip> into <https://ci-builds.apache.org/job/POI/job/POI-DSL-Maven/ws/sonar/ooxml-schema/target/schemas>
     [copy] Copying 1 file to <https://ci-builds.apache.org/job/POI/job/POI-DSL-Maven/ws/sonar/ooxml-schema/target/schemas>
[INFO] Executed tasks
[INFO]
[INFO] --- xmlbeans-maven-plugin:2.3.3:xmlbeans (default) @ poi-ooxml-schema ---
[INFO] ------------------------------------------------------------------------
[INFO] Reactor Summary for Apache POI - the Java API for Microsoft Documents 5.0.0-SNAPSHOT:
[INFO]
[INFO] Apache POI - the Java API for Microsoft Documents .. SUCCESS [  0.750 s]
[INFO] Apache POI Main package ............................ SUCCESS [04:12 min]
[INFO] Apache POI Scratchpad package ...................... SUCCESS [ 27.568 s]
[INFO] Apache POI - Openxmlformats Schema package ......... FAILURE [  6.592 s]
[INFO] Apache POI - Openxmlformats Encryption Schema package SKIPPED
[INFO] Apache POI - Openxmlformats Security-Schema package  SKIPPED
[INFO] Apache POI OOXML package ........................... SKIPPED
[INFO] Apache POI ExcelAnt package ........................ SKIPPED
[INFO] Apache POI Examples package ........................ SKIPPED
[INFO] Apache POI integration test ........................ SKIPPED
[INFO] ------------------------------------------------------------------------
[INFO] BUILD FAILURE
[INFO] ------------------------------------------------------------------------
[INFO] Total time:  04:47 min
[INFO] Finished at: 2020-10-19T20:37:30Z
[INFO] ------------------------------------------------------------------------
[ERROR] Failed to execute goal org.codehaus.mojo:xmlbeans-maven-plugin:2.3.3:xmlbeans (default) on project poi-ooxml-schema: XmlBeans compile failed:
[ERROR]  xml ErrorLoading schema file <https://ci-builds.apache.org/job/POI/job/POI-DSL-Maven/ws/sonar/ooxml-schema/target/schemas/sml-sharedWorkbookRevisions.xsd>
[ERROR] xml ErrorLoading schema file <https://ci-builds.apache.org/job/POI/job/POI-DSL-Maven/ws/sonar/ooxml-schema/target/schemas/dml-shapeStyle.xsd>
[ERROR] xml ErrorLoading schema file <https://ci-builds.apache.org/job/POI/job/POI-DSL-Maven/ws/sonar/ooxml-schema/target/schemas/vml-main.xsd>
[ERROR] xml ErrorLoading schema file <https://ci-builds.apache.org/job/POI/job/POI-DSL-Maven/ws/sonar/ooxml-schema/target/schemas/pml-userDefinedTags.xsd>
[ERROR] xml ErrorLoading schema file <https://ci-builds.apache.org/job/POI/job/POI-DSL-Maven/ws/sonar/ooxml-schema/target/schemas/dml-shape3DCamera.xsd>
[ERROR] xml ErrorLoading schema file <https://ci-builds.apache.org/job/POI/job/POI-DSL-Maven/ws/sonar/ooxml-schema/target/schemas/sml-volatileDependencies.xsd>
[ERROR] xml ErrorLoading schema file <https://ci-builds.apache.org/job/POI/job/POI-DSL-Maven/ws/sonar/ooxml-schema/target/schemas/dml-gvml.xsd>
[ERROR] xml ErrorLoading schema file <https://ci-builds.apache.org/job/POI/job/POI-DSL-Maven/ws/sonar/ooxml-schema/target/schemas/wml.xsd>
[ERROR] xml ErrorLoading schema file <https://ci-builds.apache.org/job/POI/job/POI-DSL-Maven/ws/sonar/ooxml-schema/target/schemas/dml-graphicalObject.xsd>
[ERROR] xml ErrorLoading schema file <https://ci-builds.apache.org/job/POI/job/POI-DSL-Maven/ws/sonar/ooxml-schema/target/schemas/dml-diagramLayoutVariables.xsd>
[ERROR] xml ErrorLoading schema file <https://ci-builds.apache.org/job/POI/job/POI-DSL-Maven/ws/sonar/ooxml-schema/target/schemas/dml-shape3DStyles.xsd>
[ERROR] xml ErrorLoading schema file <https://ci-builds.apache.org/job/POI/job/POI-DSL-Maven/ws/sonar/ooxml-schema/target/schemas/dml-styleDefaults.xsd>
[ERROR] xml ErrorLoading schema file <https://ci-builds.apache.org/job/POI/job/POI-DSL-Maven/ws/sonar/ooxml-schema/target/schemas/shared-customXmlDataProperties.xsd>
[ERROR] xml ErrorLoading schema file <https://ci-builds.apache.org/job/POI/job/POI-DSL-Maven/ws/sonar/ooxml-schema/target/schemas/dml-documentProperties.xsd>
[ERROR] xml ErrorLoading schema file <https://ci-builds.apache.org/job/POI/job/POI-DSL-Maven/ws/sonar/ooxml-schema/target/schemas/xmldsig-core-schema.xsd>
[ERROR] xml ErrorLoading schema file <https://ci-builds.apache.org/job/POI/job/POI-DSL-Maven/ws/sonar/ooxml-schema/target/schemas/dml-textRun.xsd>
[ERROR] xml ErrorLoading schema file <https://ci-builds.apache.org/job/POI/job/POI-DSL-Maven/ws/sonar/ooxml-schema/target/schemas/dml-textCharacter.xsd>
[ERROR] xml ErrorLoading schema file <https://ci-builds.apache.org/job/POI/job/POI-DSL-Maven/ws/sonar/ooxml-schema/target/schemas/dml-audioVideo.xsd>
[ERROR] xml ErrorLoading schema file <https://ci-builds.apache.org/job/POI/job/POI-DSL-Maven/ws/sonar/ooxml-schema/target/schemas/dml-shape3DLighting.xsd>
[ERROR] xml ErrorLoading schema file <https://ci-builds.apache.org/job/POI/job/POI-DSL-Maven/ws/sonar/ooxml-schema/target/schemas/dml-diagramDataModel.xsd>
[ERROR] xml ErrorLoading schema file <https://ci-builds.apache.org/job/POI/job/POI-DSL-Maven/ws/sonar/ooxml-schema/target/schemas/sml-singleCellTable.xsd>
[ERROR] xml ErrorLoading schema file <https://ci-builds.apache.org/job/POI/job/POI-DSL-Maven/ws/sonar/ooxml-schema/target/schemas/pml-animationInfo.xsd>
[ERROR] xml ErrorLoading schema file <https://ci-builds.apache.org/job/POI/job/POI-DSL-Maven/ws/sonar/ooxml-schema/target/schemas/dml-baseTypes.xsd>
[ERROR] xml ErrorLoading schema file <https://ci-builds.apache.org/job/POI/job/POI-DSL-Maven/ws/sonar/ooxml-schema/target/schemas/pml-presentationProperties.xsd>
[ERROR] xml ErrorLoading schema file <https://ci-builds.apache.org/job/POI/job/POI-DSL-Maven/ws/sonar/ooxml-schema/target/schemas/markup-compatibility.xsd>
[ERROR] xml ErrorLoading schema file <https://ci-builds.apache.org/job/POI/job/POI-DSL-Maven/ws/sonar/ooxml-schema/target/schemas/vmlDrawing.xsd>
[ERROR] xml ErrorLoading schema file <https://ci-builds.apache.org/job/POI/job/POI-DSL-Maven/ws/sonar/ooxml-schema/target/schemas/dml-shapeProperties.xsd>
[ERROR] xml ErrorLoading schema file <https://ci-builds.apache.org/job/POI/job/POI-DSL-Maven/ws/sonar/ooxml-schema/target/schemas/sml-calculationChain.xsd>
[ERROR] xml ErrorLoading schema file <https://ci-builds.apache.org/job/POI/job/POI-DSL-Maven/ws/sonar/ooxml-schema/target/schemas/dml-picture.xsd>
[ERROR] xml ErrorLoading schema file <https://ci-builds.apache.org/job/POI/job/POI-DSL-Maven/ws/sonar/ooxml-schema/target/schemas/dml-diagramElementPropertySet.xsd>
[ERROR] xml ErrorLoading schema file <https://ci-builds.apache.org/job/POI/job/POI-DSL-Maven/ws/sonar/ooxml-schema/target/schemas/dml-shape3DScene.xsd>
[ERROR] xml ErrorLoading schema file <https://ci-builds.apache.org/job/POI/job/POI-DSL-Maven/ws/sonar/ooxml-schema/target/schemas/sml-sharedWorkbookUserNames.xsd>
[ERROR] xml ErrorLoading schema file <https://ci-builds.apache.org/job/POI/job/POI-DSL-Maven/ws/sonar/ooxml-schema/target/schemas/pml-viewProperties.xsd>
[ERROR] xml ErrorLoading schema file <https://ci-builds.apache.org/job/POI/job/POI-DSL-Maven/ws/sonar/ooxml-schema/target/schemas/sml-workbook.xsd>
[ERROR] xml ErrorLoading schema file <https://ci-builds.apache.org/job/POI/job/POI-DSL-Maven/ws/sonar/ooxml-schema/target/schemas/shared-relationshipReference.xsd>
[ERROR] xml ErrorLoading schema file <https://ci-builds.apache.org/job/POI/job/POI-DSL-Maven/ws/sonar/ooxml-schema/target/schemas/dml-table.xsd>
[ERROR] xml ErrorLoading schema file <https://ci-builds.apache.org/job/POI/job/POI-DSL-Maven/ws/sonar/ooxml-schema/target/schemas/dml-graphicalObjectFormat.xsd>
[ERROR] xml ErrorLoading schema file <https://ci-builds.apache.org/job/POI/job/POI-DSL-Maven/ws/sonar/ooxml-schema/target/schemas/vml-officeDrawing.xsd>
[ERROR] xml ErrorLoading schema file <https://ci-builds.apache.org/job/POI/job/POI-DSL-Maven/ws/sonar/ooxml-schema/target/schemas/dml-diagramTypes.xsd>
[ERROR] xml ErrorLoading schema file <https://ci-builds.apache.org/job/POI/job/POI-DSL-Maven/ws/sonar/ooxml-schema/target/schemas/shared-customXmlSchemaProperties.xsd>
[ERROR] xml ErrorLoading schema file <https://ci-builds.apache.org/job/POI/job/POI-DSL-Maven/ws/sonar/ooxml-schema/target/schemas/sml-queryTable.xsd>
[ERROR] xml ErrorLoading schema file <https://ci-builds.apache.org/job/POI/job/POI-DSL-Maven/ws/sonar/ooxml-schema/target/schemas/sml-supplementaryWorkbooks.xsd>
[ERROR] xml ErrorLoading schema file <https://ci-builds.apache.org/job/POI/job/POI-DSL-Maven/ws/sonar/ooxml-schema/target/schemas/pml-embedding.xsd>
[ERROR] xml ErrorLoading schema file <https://ci-builds.apache.org/job/POI/job/POI-DSL-Maven/ws/sonar/ooxml-schema/target/schemas/sml-pivotTable.xsd>
[ERROR] xml ErrorLoading schema file <https://ci-builds.apache.org/job/POI/job/POI-DSL-Maven/ws/sonar/ooxml-schema/target/schemas/dml-shape3DScenePlane.xsd>
[ERROR] xml ErrorLoading schema file <https://ci-builds.apache.org/job/POI/job/POI-DSL-Maven/ws/sonar/ooxml-schema/target/schemas/sml-comments.xsd>
[ERROR] xml ErrorLoading schema file <https://ci-builds.apache.org/job/POI/job/POI-DSL-Maven/ws/sonar/ooxml-schema/target/schemas/sml-sheet.xsd>
[ERROR] xml ErrorLoading schema file <https://ci-builds.apache.org/job/POI/job/POI-DSL-Maven/ws/sonar/ooxml-schema/target/schemas/dml-chart.xsd>
[ERROR] xml ErrorLoading schema file <https://ci-builds.apache.org/job/POI/job/POI-DSL-Maven/ws/sonar/ooxml-schema/target/schemas/sml-customXmlMappings.xsd>
[ERROR] xml ErrorLoading schema file <https://ci-builds.apache.org/job/POI/job/POI-DSL-Maven/ws/sonar/ooxml-schema/target/schemas/sml-pivotTableShared.xsd>
[ERROR] xml ErrorLoading schema file <https://ci-builds.apache.org/job/POI/job/POI-DSL-Maven/ws/sonar/ooxml-schema/target/schemas/dml-textBullet.xsd>
[ERROR] xml ErrorLoading schema file <https://ci-builds.apache.org/job/POI/job/POI-DSL-Maven/ws/sonar/ooxml-schema/target/schemas/shared-documentPropertiesVariantTypes.xsd>
[ERROR] xml ErrorLoading schema file <https://ci-builds.apache.org/job/POI/job/POI-DSL-Maven/ws/sonar/ooxml-schema/target/schemas/dml-stylesheet.xsd>
[ERROR] xml ErrorLoading schema file <https://ci-builds.apache.org/job/POI/job/POI-DSL-Maven/ws/sonar/ooxml-schema/target/schemas/pml-slideSynchronizationData.xsd>
[ERROR] xml ErrorLoading schema file <https://ci-builds.apache.org/job/POI/job/POI-DSL-Maven/ws/sonar/ooxml-schema/target/schemas/dml-compatibility.xsd>
[ERROR] xml ErrorLoading schema file <https://ci-builds.apache.org/job/POI/job/POI-DSL-Maven/ws/sonar/ooxml-schema/target/schemas/vml-wordprocessingDrawing.xsd>
[ERROR] xml ErrorLoading schema file <https://ci-builds.apache.org/job/POI/job/POI-DSL-Maven/ws/sonar/ooxml-schema/target/schemas/dml-shapeGeometry.xsd>
[ERROR] xml ErrorLoading schema file <https://ci-builds.apache.org/job/POI/job/POI-DSL-Maven/ws/sonar/ooxml-schema/target/schemas/sml-sheetMetadata.xsd>
[ERROR] xml ErrorLoading schema file <https://ci-builds.apache.org/job/POI/job/POI-DSL-Maven/ws/sonar/ooxml-schema/target/schemas/dml-shapeLineProperties.xsd>
[ERROR] xml ErrorLoading schema file <https://ci-builds.apache.org/job/POI/job/POI-DSL-Maven/ws/sonar/ooxml-schema/target/schemas/vml-spreadsheetDrawing.xsd>
[ERROR] xml ErrorLoading schema file <https://ci-builds.apache.org/job/POI/job/POI-DSL-Maven/ws/sonar/ooxml-schema/target/schemas/dml-lockedCanvas.xsd>
[ERROR] xml ErrorLoading schema file <https://ci-builds.apache.org/job/POI/job/POI-DSL-Maven/ws/sonar/ooxml-schema/target/schemas/shared-math.xsd>
[ERROR] xml ErrorLoading schema file <https://ci-builds.apache.org/job/POI/job/POI-DSL-Maven/ws/sonar/ooxml-schema/target/schemas/dml-text.xsd>
[ERROR] xml ErrorLoading schema file <https://ci-builds.apache.org/job/POI/job/POI-DSL-Maven/ws/sonar/ooxml-schema/target/schemas/shared-bibliography.xsd>
[ERROR] xml ErrorLoading schema file <https://ci-builds.apache.org/job/POI/job/POI-DSL-Maven/ws/sonar/ooxml-schema/target/schemas/pml-slide.xsd>
[ERROR] xml ErrorLoading schema file <https://ci-builds.apache.org/job/POI/job/POI-DSL-Maven/ws/sonar/ooxml-schema/target/schemas/dml-diagramColorTransform.xsd>
[ERROR] xml ErrorLoading schema file <https://ci-builds.apache.org/job/POI/job/POI-DSL-Maven/ws/sonar/ooxml-schema/target/schemas/sml-table.xsd>
[ERROR] xml ErrorLoading schema file <https://ci-builds.apache.org/job/POI/job/POI-DSL-Maven/ws/sonar/ooxml-schema/target/schemas/dml-graphicalObjectAnimation.xsd>
[ERROR] xml ErrorLoading schema file <https://ci-builds.apache.org/job/POI/job/POI-DSL-Maven/ws/sonar/ooxml-schema/target/schemas/pml-comments.xsd>
[ERROR] xml ErrorLoading schema file <https://ci-builds.apache.org/job/POI/job/POI-DSL-Maven/ws/sonar/ooxml-schema/target/schemas/shared-documentPropertiesExtended.xsd>
[ERROR] xml ErrorLoading schema file <https://ci-builds.apache.org/job/POI/job/POI-DSL-Maven/ws/sonar/ooxml-schema/target/schemas/sml-sharedStringTable.xsd>
[ERROR] xml ErrorLoading schema file <https://ci-builds.apache.org/job/POI/job/POI-DSL-Maven/ws/sonar/ooxml-schema/target/schemas/dml-spreadsheetDrawing.xsd>
[ERROR] xml ErrorLoading schema file <https://ci-builds.apache.org/job/POI/job/POI-DSL-Maven/ws/sonar/ooxml-schema/target/schemas/sml-baseTypes.xsd>
[ERROR] xml ErrorLoading schema file <https://ci-builds.apache.org/job/POI/job/POI-DSL-Maven/ws/sonar/ooxml-schema/target/schemas/sml-styles.xsd>
[ERROR] xml ErrorLoading schema file <https://ci-builds.apache.org/job/POI/job/POI-DSL-Maven/ws/sonar/ooxml-schema/target/schemas/vml-presentationDrawing.xsd>
[ERROR] xml ErrorLoading schema file <https://ci-builds.apache.org/job/POI/job/POI-DSL-Maven/ws/sonar/ooxml-schema/target/schemas/dml-baseStylesheet.xsd>
[ERROR] xml ErrorLoading schema file <https://ci-builds.apache.org/job/POI/job/POI-DSL-Maven/ws/sonar/ooxml-schema/target/schemas/dml-tableStyle.xsd>
[ERROR] xml ErrorLoading schema file <https://ci-builds.apache.org/job/POI/job/POI-DSL-Maven/ws/sonar/ooxml-schema/target/schemas/pml-baseTypes.xsd>
[ERROR] xml ErrorLoading schema file <https://ci-builds.apache.org/job/POI/job/POI-DSL-Maven/ws/sonar/ooxml-schema/target/schemas/shared-documentPropertiesCustom.xsd>
[ERROR] xml ErrorLoading schema file <https://ci-builds.apache.org/job/POI/job/POI-DSL-Maven/ws/sonar/ooxml-schema/target/schemas/dml-diagramDefinition.xsd>
[ERROR] xml ErrorLoading schema file <https://ci-builds.apache.org/job/POI/job/POI-DSL-Maven/ws/sonar/ooxml-schema/target/schemas/dml-shapeEffects.xsd>
[ERROR] xml ErrorLoading schema file <https://ci-builds.apache.org/job/POI/job/POI-DSL-Maven/ws/sonar/ooxml-schema/target/schemas/dml-shapeMiscellaneous.xsd>
[ERROR] xml ErrorLoading schema file <https://ci-builds.apache.org/job/POI/job/POI-DSL-Maven/ws/sonar/ooxml-schema/target/schemas/sml-autoFilter.xsd>
[ERROR] xml ErrorLoading schema file <https://ci-builds.apache.org/job/POI/job/POI-DSL-Maven/ws/sonar/ooxml-schema/target/schemas/dml-chartDrawing.xsd>
[ERROR] xml ErrorLoading schema file <https://ci-builds.apache.org/job/POI/job/POI-DSL-Maven/ws/sonar/ooxml-schema/target/schemas/dml-diagramStyleDefinition.xsd>
[ERROR] xml ErrorLoading schema file <https://ci-builds.apache.org/job/POI/job/POI-DSL-Maven/ws/sonar/ooxml-schema/target/schemas/shared-additionalCharacteristics.xsd>
[ERROR] xml ErrorLoading schema file <https://ci-builds.apache.org/job/POI/job/POI-DSL-Maven/ws/sonar/ooxml-schema/target/schemas/dml-textParagraph.xsd>
[ERROR] xml ErrorLoading schema file <https://ci-builds.apache.org/job/POI/job/POI-DSL-Maven/ws/sonar/ooxml-schema/target/schemas/pml-presentation.xsd>
[ERROR] xml ErrorLoading schema file <https://ci-builds.apache.org/job/POI/job/POI-DSL-Maven/ws/sonar/ooxml-schema/target/schemas/visio.xsd>
[ERROR] xml ErrorLoading schema file <https://ci-builds.apache.org/job/POI/job/POI-DSL-Maven/ws/sonar/ooxml-schema/target/schemas/dml-wordprocessingDrawing.xsd>
[ERROR] xml ErrorLoading schema file <https://ci-builds.apache.org/job/POI/job/POI-DSL-Maven/ws/sonar/ooxml-schema/target/schemas/sml-externalConnections.xsd>
[ERROR] xml ErrorLoading config file <https://ci-builds.apache.org/job/POI/job/POI-DSL-Maven/ws/sonar/ooxml-schema/../../src/ooxml/resources/org/apache/poi/poifs/crypt/encryptionCertificate.xsdconfig>
[ERROR] xml ErrorLoading config file <https://ci-builds.apache.org/job/POI/job/POI-DSL-Maven/ws/sonar/ooxml-schema/../../src/ooxml/resources/org/apache/poi/poifs/crypt/encryptionInfo.xsdconfig>
[ERROR] xml ErrorLoading config file <https://ci-builds.apache.org/job/POI/job/POI-DSL-Maven/ws/sonar/ooxml-schema/../../src/ooxml/resources/org/apache/poi/poifs/crypt/encryptionPassword.xsdconfig>
[ERROR] xml ErrorLoading config file <https://ci-builds.apache.org/job/POI/job/POI-DSL-Maven/ws/sonar/ooxml-schema/../../src/ooxml/resources/org/apache/poi/schemas/ooxmlSchemas.xsdconfig>
[ERROR] xml Error<https://ci-builds.apache.org/job/POI/job/POI-DSL-Maven/ws/sonar/ooxml-schema/target/schemas/wml.xsd>:5537:9: error: src-resolve: attribute 'space@http://www.w3.org/XML/1998/namespace' not found.
[ERROR] xml Error<https://ci-builds.apache.org/job/POI/job/POI-DSL-Maven/ws/sonar/ooxml-schema/target/schemas/shared-math.xsd>:413:9: error: src-resolve: attribute 'space@http://www.w3.org/XML/1998/namespace' not found.
[ERROR]
[ERROR] -> [Help 1]
[ERROR]
[ERROR] To see the full stack trace of the errors, re-run Maven with the -e switch.
[ERROR] Re-run Maven using the -X switch to enable full debug logging.
[ERROR]
[ERROR] For more information about the errors and possible solutions, please read the following articles:
[ERROR] [Help 1] http://cwiki.apache.org/confluence/display/MAVEN/MojoExecutionException
[ERROR]
[ERROR] After correcting the problems, you can resume the build with the command
[ERROR]   mvn <args> -rf :poi-ooxml-schema
Build step 'Invoke top-level Maven targets' marked build as failure
Recording test results

---------------------------------------------------------------------
To unsubscribe, e-mail: [hidden email]
For additional commands, e-mail: [hidden email]

Reply | Threaded
Open this post in threaded view
|

Build failed in Jenkins: POI » POI-DSL-Maven #39

Apache Jenkins Server
See <https://ci-builds.apache.org/job/POI/job/POI-DSL-Maven/39/display/redirect?page=changes>

Changes:

[Andreas Beeker] update ant/maven values, builds@ decided to rename those

[Andreas Beeker] update jdk values, remove jdk 1.6


------------------------------------------
[...truncated 815.75 KB...]
                        Length is 0 (0x0)
                        Compressed is false
                        Stream is org.apache.poi.hdgf.streams.UnknownStream
                        First few bytes are []
                Stream at 0 (0x0)
                        Type is 0 (0x0)
                        Format is 0 (0x0)
                        Length is 0 (0x0)
                        Compressed is false
                        Stream is org.apache.poi.hdgf.streams.UnknownStream
                        First few bytes are []
                Stream at 35161 (0x8959)
                        Type is 69 (0x45)
                        Format is 82 (0x52)
                        Length is 13 (0xd)
                        DC.Length is 72 (0x48)
                        Compressed is true
                        Stream is org.apache.poi.hdgf.streams.PointerContainingStream
                        First few bytes are [60, 0, 0, 0, 0, 0, 0, 0, 0, 0, 0, 0, 0, 0, 0, 0, 0, 0, 0, 0, 0, 0, 0, 0, 0, 0, 0, 0, 0, 0, 0, 0, 0, 0, 0, 0, 0, 0, 0, 0, 0, 0, 0, 0, 0, 0, 0, 0, 0, 0, 0, 0, 0, 0, 0, 0, 0, 0, 0, 0, 0, 0, 0, 0, 0, 0, 0, 0, 0, 0, 0, 0]
                        Nbr of children 0 (0x0)
[INFO] Tests run: 1, Failures: 0, Errors: 0, Skipped: 0, Time elapsed: 1.244 s - in org.apache.poi.hdgf.dev.TestVSDDumper
[INFO] Running org.apache.poi.hdgf.chunks.TestChunks
[INFO] Tests run: 5, Failures: 0, Errors: 0, Skipped: 0, Time elapsed: 0.001 s - in org.apache.poi.hdgf.chunks.TestChunks
[INFO] Running org.apache.poi.hdgf.TestHDGFCore
[INFO] Tests run: 7, Failures: 0, Errors: 0, Skipped: 0, Time elapsed: 0.001 s - in org.apache.poi.hdgf.TestHDGFCore
[INFO] Running org.apache.poi.hsmf.TestNameIdChunks
[INFO] Tests run: 2, Failures: 0, Errors: 0, Skipped: 0, Time elapsed: 0.038 s - in org.apache.poi.hsmf.TestNameIdChunks
[INFO] Running org.apache.poi.hsmf.TestFixedSizedProperties
[INFO] Tests run: 7, Failures: 0, Errors: 0, Skipped: 0, Time elapsed: 0.044 s - in org.apache.poi.hsmf.TestFixedSizedProperties
[INFO] Running org.apache.poi.hsmf.Test7BitCodepage
[INFO] Tests run: 1, Failures: 0, Errors: 0, Skipped: 0, Time elapsed: 0.027 s - in org.apache.poi.hsmf.Test7BitCodepage
[INFO] Running org.apache.poi.hsmf.datatypes.TestTypes
[INFO] Tests run: 3, Failures: 0, Errors: 0, Skipped: 0, Time elapsed: 0.001 s - in org.apache.poi.hsmf.datatypes.TestTypes
[INFO] Running org.apache.poi.hsmf.datatypes.TestSorters
[INFO] Tests run: 2, Failures: 0, Errors: 0, Skipped: 0, Time elapsed: 0.001 s - in org.apache.poi.hsmf.datatypes.TestSorters
[INFO] Running org.apache.poi.hsmf.datatypes.TestChunkData
[INFO] Tests run: 6, Failures: 0, Errors: 0, Skipped: 0, Time elapsed: 0.001 s - in org.apache.poi.hsmf.datatypes.TestChunkData
[INFO] Running org.apache.poi.hsmf.datatypes.TestMAPIProperty
[INFO] Tests run: 3, Failures: 0, Errors: 0, Skipped: 0, Time elapsed: 0.001 s - in org.apache.poi.hsmf.datatypes.TestMAPIProperty
[INFO] Running org.apache.poi.hsmf.TestBlankFileRead
[INFO] Tests run: 7, Failures: 0, Errors: 0, Skipped: 0, Time elapsed: 0.001 s - in org.apache.poi.hsmf.TestBlankFileRead
[INFO] Running org.apache.poi.hsmf.TestSimpleFileRead
[INFO] Tests run: 9, Failures: 0, Errors: 0, Skipped: 0, Time elapsed: 0.026 s - in org.apache.poi.hsmf.TestSimpleFileRead
[INFO] Running org.apache.poi.hsmf.extractor.TestOutlookTextExtractor
[INFO] Tests run: 8, Failures: 0, Errors: 0, Skipped: 0, Time elapsed: 0.115 s - in org.apache.poi.hsmf.extractor.TestOutlookTextExtractor
[INFO] Running org.apache.poi.hsmf.TestExtractEmbeddedMSG
[INFO] Tests run: 1, Failures: 0, Errors: 0, Skipped: 0, Time elapsed: 0.006 s - in org.apache.poi.hsmf.TestExtractEmbeddedMSG
[INFO] Running org.apache.poi.hsmf.TestMessageSubmissionChunk
[INFO] Tests run: 2, Failures: 0, Errors: 0, Skipped: 0, Time elapsed: 0.006 s - in org.apache.poi.hsmf.TestMessageSubmissionChunk
[INFO] Running org.apache.poi.hsmf.TestOutlook30FileRead
[INFO] Tests run: 9, Failures: 0, Errors: 0, Skipped: 0, Time elapsed: 0.073 s - in org.apache.poi.hsmf.TestOutlook30FileRead
[INFO] Running org.apache.poi.hsmf.TestFileWithAttachmentsRead
[INFO] Tests run: 4, Failures: 0, Errors: 0, Skipped: 0, Time elapsed: 0.002 s - in org.apache.poi.hsmf.TestFileWithAttachmentsRead
[INFO] Running org.apache.poi.hsmf.parsers.TestPOIFSChunkParser
[INFO] Tests run: 6, Failures: 0, Errors: 0, Skipped: 0, Time elapsed: 0.076 s - in org.apache.poi.hsmf.parsers.TestPOIFSChunkParser
[INFO] Running org.apache.poi.hsmf.TestBasics
[INFO] Tests run: 9, Failures: 0, Errors: 0, Skipped: 0, Time elapsed: 0.171 s - in org.apache.poi.hsmf.TestBasics
[INFO] Running org.apache.poi.hsmf.TestMessageSubmissionChunkY2KRead
[INFO] Tests run: 3, Failures: 0, Errors: 0, Skipped: 0, Time elapsed: 0.011 s - in org.apache.poi.hsmf.TestMessageSubmissionChunkY2KRead
[INFO] Running org.apache.poi.hwmf.TestHwmfParsing
[WARNING] Tests run: 5, Failures: 0, Errors: 0, Skipped: 1, Time elapsed: 0.013 s - in org.apache.poi.hwmf.TestHwmfParsing
[INFO] Running org.apache.poi.hmef.TestCompressedRTF
[INFO] Tests run: 4, Failures: 0, Errors: 0, Skipped: 0, Time elapsed: 0.016 s - in org.apache.poi.hmef.TestCompressedRTF
[INFO] Running org.apache.poi.hmef.TestBugs
[INFO] Tests run: 3, Failures: 0, Errors: 0, Skipped: 0, Time elapsed: 0.006 s - in org.apache.poi.hmef.TestBugs
[INFO] Running org.apache.poi.hmef.TestAttachments
[INFO] Tests run: 4, Failures: 0, Errors: 0, Skipped: 0, Time elapsed: 0.002 s - in org.apache.poi.hmef.TestAttachments
[INFO] Running org.apache.poi.hmef.extractor.TestHMEFContentsExtractor
Extracting...
Extraction completed
[INFO] Tests run: 3, Failures: 0, Errors: 0, Skipped: 0, Time elapsed: 0.009 s - in org.apache.poi.hmef.extractor.TestHMEFContentsExtractor
[INFO] Running org.apache.poi.hmef.dev.TestHMEFDumper
[INFO] Tests run: 3, Failures: 0, Errors: 0, Skipped: 0, Time elapsed: 0.019 s - in org.apache.poi.hmef.dev.TestHMEFDumper
[INFO] Running org.apache.poi.hmef.TestHMEFMessage
[INFO] Tests run: 9, Failures: 0, Errors: 0, Skipped: 0, Time elapsed: 0.008 s - in org.apache.poi.hmef.TestHMEFMessage
[INFO] Running org.apache.poi.hmef.attribute.TestMAPIAttributes
[INFO] Tests run: 4, Failures: 0, Errors: 0, Skipped: 0, Time elapsed: 0.009 s - in org.apache.poi.hmef.attribute.TestMAPIAttributes
[INFO] Running org.apache.poi.hmef.attribute.TestTNEFAttributes
[INFO] Tests run: 6, Failures: 0, Errors: 0, Skipped: 0, Time elapsed: 0.008 s - in org.apache.poi.hmef.attribute.TestTNEFAttributes
[INFO]
[INFO] Results:
[INFO]
[WARNING] Tests run: 3089, Failures: 0, Errors: 0, Skipped: 5
[INFO]
[INFO]
[INFO] --- jacoco-maven-plugin:0.8.6:report (report) @ poi-scratchpad ---
[INFO] Loading execution data file <https://ci-builds.apache.org/job/POI/job/POI-DSL-Maven/ws/sonar/scratchpad/target/jacoco.exec>
[INFO] Analyzed bundle 'Apache POI Scratchpad package' with 875 classes
[INFO]
[INFO] --- maven-jar-plugin:2.4:jar (default-jar) @ poi-scratchpad ---
[INFO] Building jar: <https://ci-builds.apache.org/job/POI/job/POI-DSL-Maven/ws/sonar/scratchpad/target/poi-scratchpad-5.0.0-SNAPSHOT.jar>
[INFO]
[INFO] ------------------< org.apache.poi:poi-ooxml-schema >-------------------
[INFO] Building Apache POI - Openxmlformats Schema package 5.0.0-SNAPSHOT [4/10]
[INFO] --------------------------------[ jar ]---------------------------------
[INFO]
[INFO] --- jacoco-maven-plugin:0.8.6:prepare-agent (default) @ poi-ooxml-schema ---
[INFO] argLine set to -javaagent:<https://ci-builds.apache.org/job/POI/job/POI-DSL-Maven/ws/.repository/org/jacoco/org.jacoco.agent/0.8.6/org.jacoco.agent-0.8.6-runtime.jar=destfile=/home/jenkins/workspace/POI/POI-DSL-Maven/sonar/ooxml-schema/target/jacoco.exec> -Xmx1024m
[INFO]
[INFO] --- download-maven-plugin:1.5.0:wget (download-xsds) @ poi-ooxml-schema ---
[INFO] Got from cache: <https://ci-builds.apache.org/job/POI/job/POI-DSL-Maven/ws/.repository/.cache/download-maven-plugin/Office%20Open%20XML%201st%20edition%20Part%204%20(PDF).zip_c501e12cb3c66007e0f51e41db066eac>
[INFO]
[INFO] --- maven-antrun-plugin:1.8:run (copy-xmltype-and-xsdconfig) @ poi-ooxml-schema ---
[INFO] Executing tasks

main:
     [copy] Copying 6 files to <https://ci-builds.apache.org/job/POI/job/POI-DSL-Maven/ws/sonar/ooxml-schema/target/schemas>
[INFO] Executed tasks
[INFO]
[INFO] --- maven-antrun-plugin:1.8:run (unzip-schema) @ poi-ooxml-schema ---
[INFO] Executing tasks

main:
     [echo] unzip schemas
    [unzip] Expanding: <https://ci-builds.apache.org/job/POI/job/POI-DSL-Maven/ws/sonar/ooxml-schema/target/OfficeOpenXML-XMLSchema.zip> into <https://ci-builds.apache.org/job/POI/job/POI-DSL-Maven/ws/sonar/ooxml-schema/target/schemas>
     [copy] Copying 1 file to <https://ci-builds.apache.org/job/POI/job/POI-DSL-Maven/ws/sonar/ooxml-schema/target/schemas>
[INFO] Executed tasks
[INFO]
[INFO] --- xmlbeans-maven-plugin:2.3.3:xmlbeans (default) @ poi-ooxml-schema ---
[INFO] ------------------------------------------------------------------------
[INFO] Reactor Summary for Apache POI - the Java API for Microsoft Documents 5.0.0-SNAPSHOT:
[INFO]
[INFO] Apache POI - the Java API for Microsoft Documents .. SUCCESS [  0.748 s]
[INFO] Apache POI Main package ............................ SUCCESS [03:48 min]
[INFO] Apache POI Scratchpad package ...................... SUCCESS [ 24.539 s]
[INFO] Apache POI - Openxmlformats Schema package ......... FAILURE [  5.909 s]
[INFO] Apache POI - Openxmlformats Encryption Schema package SKIPPED
[INFO] Apache POI - Openxmlformats Security-Schema package  SKIPPED
[INFO] Apache POI OOXML package ........................... SKIPPED
[INFO] Apache POI ExcelAnt package ........................ SKIPPED
[INFO] Apache POI Examples package ........................ SKIPPED
[INFO] Apache POI integration test ........................ SKIPPED
[INFO] ------------------------------------------------------------------------
[INFO] BUILD FAILURE
[INFO] ------------------------------------------------------------------------
[INFO] Total time:  04:20 min
[INFO] Finished at: 2020-10-20T00:37:01Z
[INFO] ------------------------------------------------------------------------
[ERROR] Failed to execute goal org.codehaus.mojo:xmlbeans-maven-plugin:2.3.3:xmlbeans (default) on project poi-ooxml-schema: XmlBeans compile failed:
[ERROR]  xml ErrorLoading schema file <https://ci-builds.apache.org/job/POI/job/POI-DSL-Maven/ws/sonar/ooxml-schema/target/schemas/sml-sharedWorkbookRevisions.xsd>
[ERROR] xml ErrorLoading schema file <https://ci-builds.apache.org/job/POI/job/POI-DSL-Maven/ws/sonar/ooxml-schema/target/schemas/dml-shapeStyle.xsd>
[ERROR] xml ErrorLoading schema file <https://ci-builds.apache.org/job/POI/job/POI-DSL-Maven/ws/sonar/ooxml-schema/target/schemas/vml-main.xsd>
[ERROR] xml ErrorLoading schema file <https://ci-builds.apache.org/job/POI/job/POI-DSL-Maven/ws/sonar/ooxml-schema/target/schemas/pml-userDefinedTags.xsd>
[ERROR] xml ErrorLoading schema file <https://ci-builds.apache.org/job/POI/job/POI-DSL-Maven/ws/sonar/ooxml-schema/target/schemas/dml-shape3DCamera.xsd>
[ERROR] xml ErrorLoading schema file <https://ci-builds.apache.org/job/POI/job/POI-DSL-Maven/ws/sonar/ooxml-schema/target/schemas/sml-volatileDependencies.xsd>
[ERROR] xml ErrorLoading schema file <https://ci-builds.apache.org/job/POI/job/POI-DSL-Maven/ws/sonar/ooxml-schema/target/schemas/dml-gvml.xsd>
[ERROR] xml ErrorLoading schema file <https://ci-builds.apache.org/job/POI/job/POI-DSL-Maven/ws/sonar/ooxml-schema/target/schemas/wml.xsd>
[ERROR] xml ErrorLoading schema file <https://ci-builds.apache.org/job/POI/job/POI-DSL-Maven/ws/sonar/ooxml-schema/target/schemas/dml-graphicalObject.xsd>
[ERROR] xml ErrorLoading schema file <https://ci-builds.apache.org/job/POI/job/POI-DSL-Maven/ws/sonar/ooxml-schema/target/schemas/dml-diagramLayoutVariables.xsd>
[ERROR] xml ErrorLoading schema file <https://ci-builds.apache.org/job/POI/job/POI-DSL-Maven/ws/sonar/ooxml-schema/target/schemas/dml-shape3DStyles.xsd>
[ERROR] xml ErrorLoading schema file <https://ci-builds.apache.org/job/POI/job/POI-DSL-Maven/ws/sonar/ooxml-schema/target/schemas/dml-styleDefaults.xsd>
[ERROR] xml ErrorLoading schema file <https://ci-builds.apache.org/job/POI/job/POI-DSL-Maven/ws/sonar/ooxml-schema/target/schemas/shared-customXmlDataProperties.xsd>
[ERROR] xml ErrorLoading schema file <https://ci-builds.apache.org/job/POI/job/POI-DSL-Maven/ws/sonar/ooxml-schema/target/schemas/dml-documentProperties.xsd>
[ERROR] xml ErrorLoading schema file <https://ci-builds.apache.org/job/POI/job/POI-DSL-Maven/ws/sonar/ooxml-schema/target/schemas/xmldsig-core-schema.xsd>
[ERROR] xml ErrorLoading schema file <https://ci-builds.apache.org/job/POI/job/POI-DSL-Maven/ws/sonar/ooxml-schema/target/schemas/dml-textRun.xsd>
[ERROR] xml ErrorLoading schema file <https://ci-builds.apache.org/job/POI/job/POI-DSL-Maven/ws/sonar/ooxml-schema/target/schemas/dml-textCharacter.xsd>
[ERROR] xml ErrorLoading schema file <https://ci-builds.apache.org/job/POI/job/POI-DSL-Maven/ws/sonar/ooxml-schema/target/schemas/dml-audioVideo.xsd>
[ERROR] xml ErrorLoading schema file <https://ci-builds.apache.org/job/POI/job/POI-DSL-Maven/ws/sonar/ooxml-schema/target/schemas/dml-shape3DLighting.xsd>
[ERROR] xml ErrorLoading schema file <https://ci-builds.apache.org/job/POI/job/POI-DSL-Maven/ws/sonar/ooxml-schema/target/schemas/dml-diagramDataModel.xsd>
[ERROR] xml ErrorLoading schema file <https://ci-builds.apache.org/job/POI/job/POI-DSL-Maven/ws/sonar/ooxml-schema/target/schemas/sml-singleCellTable.xsd>
[ERROR] xml ErrorLoading schema file <https://ci-builds.apache.org/job/POI/job/POI-DSL-Maven/ws/sonar/ooxml-schema/target/schemas/pml-animationInfo.xsd>
[ERROR] xml ErrorLoading schema file <https://ci-builds.apache.org/job/POI/job/POI-DSL-Maven/ws/sonar/ooxml-schema/target/schemas/dml-baseTypes.xsd>
[ERROR] xml ErrorLoading schema file <https://ci-builds.apache.org/job/POI/job/POI-DSL-Maven/ws/sonar/ooxml-schema/target/schemas/pml-presentationProperties.xsd>
[ERROR] xml ErrorLoading schema file <https://ci-builds.apache.org/job/POI/job/POI-DSL-Maven/ws/sonar/ooxml-schema/target/schemas/markup-compatibility.xsd>
[ERROR] xml ErrorLoading schema file <https://ci-builds.apache.org/job/POI/job/POI-DSL-Maven/ws/sonar/ooxml-schema/target/schemas/vmlDrawing.xsd>
[ERROR] xml ErrorLoading schema file <https://ci-builds.apache.org/job/POI/job/POI-DSL-Maven/ws/sonar/ooxml-schema/target/schemas/dml-shapeProperties.xsd>
[ERROR] xml ErrorLoading schema file <https://ci-builds.apache.org/job/POI/job/POI-DSL-Maven/ws/sonar/ooxml-schema/target/schemas/sml-calculationChain.xsd>
[ERROR] xml ErrorLoading schema file <https://ci-builds.apache.org/job/POI/job/POI-DSL-Maven/ws/sonar/ooxml-schema/target/schemas/dml-picture.xsd>
[ERROR] xml ErrorLoading schema file <https://ci-builds.apache.org/job/POI/job/POI-DSL-Maven/ws/sonar/ooxml-schema/target/schemas/dml-diagramElementPropertySet.xsd>
[ERROR] xml ErrorLoading schema file <https://ci-builds.apache.org/job/POI/job/POI-DSL-Maven/ws/sonar/ooxml-schema/target/schemas/dml-shape3DScene.xsd>
[ERROR] xml ErrorLoading schema file <https://ci-builds.apache.org/job/POI/job/POI-DSL-Maven/ws/sonar/ooxml-schema/target/schemas/sml-sharedWorkbookUserNames.xsd>
[ERROR] xml ErrorLoading schema file <https://ci-builds.apache.org/job/POI/job/POI-DSL-Maven/ws/sonar/ooxml-schema/target/schemas/pml-viewProperties.xsd>
[ERROR] xml ErrorLoading schema file <https://ci-builds.apache.org/job/POI/job/POI-DSL-Maven/ws/sonar/ooxml-schema/target/schemas/sml-workbook.xsd>
[ERROR] xml ErrorLoading schema file <https://ci-builds.apache.org/job/POI/job/POI-DSL-Maven/ws/sonar/ooxml-schema/target/schemas/shared-relationshipReference.xsd>
[ERROR] xml ErrorLoading schema file <https://ci-builds.apache.org/job/POI/job/POI-DSL-Maven/ws/sonar/ooxml-schema/target/schemas/dml-table.xsd>
[ERROR] xml ErrorLoading schema file <https://ci-builds.apache.org/job/POI/job/POI-DSL-Maven/ws/sonar/ooxml-schema/target/schemas/dml-graphicalObjectFormat.xsd>
[ERROR] xml ErrorLoading schema file <https://ci-builds.apache.org/job/POI/job/POI-DSL-Maven/ws/sonar/ooxml-schema/target/schemas/vml-officeDrawing.xsd>
[ERROR] xml ErrorLoading schema file <https://ci-builds.apache.org/job/POI/job/POI-DSL-Maven/ws/sonar/ooxml-schema/target/schemas/dml-diagramTypes.xsd>
[ERROR] xml ErrorLoading schema file <https://ci-builds.apache.org/job/POI/job/POI-DSL-Maven/ws/sonar/ooxml-schema/target/schemas/shared-customXmlSchemaProperties.xsd>
[ERROR] xml ErrorLoading schema file <https://ci-builds.apache.org/job/POI/job/POI-DSL-Maven/ws/sonar/ooxml-schema/target/schemas/sml-queryTable.xsd>
[ERROR] xml ErrorLoading schema file <https://ci-builds.apache.org/job/POI/job/POI-DSL-Maven/ws/sonar/ooxml-schema/target/schemas/sml-supplementaryWorkbooks.xsd>
[ERROR] xml ErrorLoading schema file <https://ci-builds.apache.org/job/POI/job/POI-DSL-Maven/ws/sonar/ooxml-schema/target/schemas/pml-embedding.xsd>
[ERROR] xml ErrorLoading schema file <https://ci-builds.apache.org/job/POI/job/POI-DSL-Maven/ws/sonar/ooxml-schema/target/schemas/sml-pivotTable.xsd>
[ERROR] xml ErrorLoading schema file <https://ci-builds.apache.org/job/POI/job/POI-DSL-Maven/ws/sonar/ooxml-schema/target/schemas/dml-shape3DScenePlane.xsd>
[ERROR] xml ErrorLoading schema file <https://ci-builds.apache.org/job/POI/job/POI-DSL-Maven/ws/sonar/ooxml-schema/target/schemas/sml-comments.xsd>
[ERROR] xml ErrorLoading schema file <https://ci-builds.apache.org/job/POI/job/POI-DSL-Maven/ws/sonar/ooxml-schema/target/schemas/sml-sheet.xsd>
[ERROR] xml ErrorLoading schema file <https://ci-builds.apache.org/job/POI/job/POI-DSL-Maven/ws/sonar/ooxml-schema/target/schemas/dml-chart.xsd>
[ERROR] xml ErrorLoading schema file <https://ci-builds.apache.org/job/POI/job/POI-DSL-Maven/ws/sonar/ooxml-schema/target/schemas/sml-customXmlMappings.xsd>
[ERROR] xml ErrorLoading schema file <https://ci-builds.apache.org/job/POI/job/POI-DSL-Maven/ws/sonar/ooxml-schema/target/schemas/sml-pivotTableShared.xsd>
[ERROR] xml ErrorLoading schema file <https://ci-builds.apache.org/job/POI/job/POI-DSL-Maven/ws/sonar/ooxml-schema/target/schemas/dml-textBullet.xsd>
[ERROR] xml ErrorLoading schema file <https://ci-builds.apache.org/job/POI/job/POI-DSL-Maven/ws/sonar/ooxml-schema/target/schemas/shared-documentPropertiesVariantTypes.xsd>
[ERROR] xml ErrorLoading schema file <https://ci-builds.apache.org/job/POI/job/POI-DSL-Maven/ws/sonar/ooxml-schema/target/schemas/dml-stylesheet.xsd>
[ERROR] xml ErrorLoading schema file <https://ci-builds.apache.org/job/POI/job/POI-DSL-Maven/ws/sonar/ooxml-schema/target/schemas/pml-slideSynchronizationData.xsd>
[ERROR] xml ErrorLoading schema file <https://ci-builds.apache.org/job/POI/job/POI-DSL-Maven/ws/sonar/ooxml-schema/target/schemas/dml-compatibility.xsd>
[ERROR] xml ErrorLoading schema file <https://ci-builds.apache.org/job/POI/job/POI-DSL-Maven/ws/sonar/ooxml-schema/target/schemas/vml-wordprocessingDrawing.xsd>
[ERROR] xml ErrorLoading schema file <https://ci-builds.apache.org/job/POI/job/POI-DSL-Maven/ws/sonar/ooxml-schema/target/schemas/dml-shapeGeometry.xsd>
[ERROR] xml ErrorLoading schema file <https://ci-builds.apache.org/job/POI/job/POI-DSL-Maven/ws/sonar/ooxml-schema/target/schemas/sml-sheetMetadata.xsd>
[ERROR] xml ErrorLoading schema file <https://ci-builds.apache.org/job/POI/job/POI-DSL-Maven/ws/sonar/ooxml-schema/target/schemas/dml-shapeLineProperties.xsd>
[ERROR] xml ErrorLoading schema file <https://ci-builds.apache.org/job/POI/job/POI-DSL-Maven/ws/sonar/ooxml-schema/target/schemas/vml-spreadsheetDrawing.xsd>
[ERROR] xml ErrorLoading schema file <https://ci-builds.apache.org/job/POI/job/POI-DSL-Maven/ws/sonar/ooxml-schema/target/schemas/dml-lockedCanvas.xsd>
[ERROR] xml ErrorLoading schema file <https://ci-builds.apache.org/job/POI/job/POI-DSL-Maven/ws/sonar/ooxml-schema/target/schemas/shared-math.xsd>
[ERROR] xml ErrorLoading schema file <https://ci-builds.apache.org/job/POI/job/POI-DSL-Maven/ws/sonar/ooxml-schema/target/schemas/dml-text.xsd>
[ERROR] xml ErrorLoading schema file <https://ci-builds.apache.org/job/POI/job/POI-DSL-Maven/ws/sonar/ooxml-schema/target/schemas/shared-bibliography.xsd>
[ERROR] xml ErrorLoading schema file <https://ci-builds.apache.org/job/POI/job/POI-DSL-Maven/ws/sonar/ooxml-schema/target/schemas/pml-slide.xsd>
[ERROR] xml ErrorLoading schema file <https://ci-builds.apache.org/job/POI/job/POI-DSL-Maven/ws/sonar/ooxml-schema/target/schemas/dml-diagramColorTransform.xsd>
[ERROR] xml ErrorLoading schema file <https://ci-builds.apache.org/job/POI/job/POI-DSL-Maven/ws/sonar/ooxml-schema/target/schemas/sml-table.xsd>
[ERROR] xml ErrorLoading schema file <https://ci-builds.apache.org/job/POI/job/POI-DSL-Maven/ws/sonar/ooxml-schema/target/schemas/dml-graphicalObjectAnimation.xsd>
[ERROR] xml ErrorLoading schema file <https://ci-builds.apache.org/job/POI/job/POI-DSL-Maven/ws/sonar/ooxml-schema/target/schemas/pml-comments.xsd>
[ERROR] xml ErrorLoading schema file <https://ci-builds.apache.org/job/POI/job/POI-DSL-Maven/ws/sonar/ooxml-schema/target/schemas/shared-documentPropertiesExtended.xsd>
[ERROR] xml ErrorLoading schema file <https://ci-builds.apache.org/job/POI/job/POI-DSL-Maven/ws/sonar/ooxml-schema/target/schemas/sml-sharedStringTable.xsd>
[ERROR] xml ErrorLoading schema file <https://ci-builds.apache.org/job/POI/job/POI-DSL-Maven/ws/sonar/ooxml-schema/target/schemas/dml-spreadsheetDrawing.xsd>
[ERROR] xml ErrorLoading schema file <https://ci-builds.apache.org/job/POI/job/POI-DSL-Maven/ws/sonar/ooxml-schema/target/schemas/sml-baseTypes.xsd>
[ERROR] xml ErrorLoading schema file <https://ci-builds.apache.org/job/POI/job/POI-DSL-Maven/ws/sonar/ooxml-schema/target/schemas/sml-styles.xsd>
[ERROR] xml ErrorLoading schema file <https://ci-builds.apache.org/job/POI/job/POI-DSL-Maven/ws/sonar/ooxml-schema/target/schemas/vml-presentationDrawing.xsd>
[ERROR] xml ErrorLoading schema file <https://ci-builds.apache.org/job/POI/job/POI-DSL-Maven/ws/sonar/ooxml-schema/target/schemas/dml-baseStylesheet.xsd>
[ERROR] xml ErrorLoading schema file <https://ci-builds.apache.org/job/POI/job/POI-DSL-Maven/ws/sonar/ooxml-schema/target/schemas/dml-tableStyle.xsd>
[ERROR] xml ErrorLoading schema file <https://ci-builds.apache.org/job/POI/job/POI-DSL-Maven/ws/sonar/ooxml-schema/target/schemas/pml-baseTypes.xsd>
[ERROR] xml ErrorLoading schema file <https://ci-builds.apache.org/job/POI/job/POI-DSL-Maven/ws/sonar/ooxml-schema/target/schemas/shared-documentPropertiesCustom.xsd>
[ERROR] xml ErrorLoading schema file <https://ci-builds.apache.org/job/POI/job/POI-DSL-Maven/ws/sonar/ooxml-schema/target/schemas/dml-diagramDefinition.xsd>
[ERROR] xml ErrorLoading schema file <https://ci-builds.apache.org/job/POI/job/POI-DSL-Maven/ws/sonar/ooxml-schema/target/schemas/dml-shapeEffects.xsd>
[ERROR] xml ErrorLoading schema file <https://ci-builds.apache.org/job/POI/job/POI-DSL-Maven/ws/sonar/ooxml-schema/target/schemas/dml-shapeMiscellaneous.xsd>
[ERROR] xml ErrorLoading schema file <https://ci-builds.apache.org/job/POI/job/POI-DSL-Maven/ws/sonar/ooxml-schema/target/schemas/sml-autoFilter.xsd>
[ERROR] xml ErrorLoading schema file <https://ci-builds.apache.org/job/POI/job/POI-DSL-Maven/ws/sonar/ooxml-schema/target/schemas/dml-chartDrawing.xsd>
[ERROR] xml ErrorLoading schema file <https://ci-builds.apache.org/job/POI/job/POI-DSL-Maven/ws/sonar/ooxml-schema/target/schemas/dml-diagramStyleDefinition.xsd>
[ERROR] xml ErrorLoading schema file <https://ci-builds.apache.org/job/POI/job/POI-DSL-Maven/ws/sonar/ooxml-schema/target/schemas/shared-additionalCharacteristics.xsd>
[ERROR] xml ErrorLoading schema file <https://ci-builds.apache.org/job/POI/job/POI-DSL-Maven/ws/sonar/ooxml-schema/target/schemas/dml-textParagraph.xsd>
[ERROR] xml ErrorLoading schema file <https://ci-builds.apache.org/job/POI/job/POI-DSL-Maven/ws/sonar/ooxml-schema/target/schemas/pml-presentation.xsd>
[ERROR] xml ErrorLoading schema file <https://ci-builds.apache.org/job/POI/job/POI-DSL-Maven/ws/sonar/ooxml-schema/target/schemas/visio.xsd>
[ERROR] xml ErrorLoading schema file <https://ci-builds.apache.org/job/POI/job/POI-DSL-Maven/ws/sonar/ooxml-schema/target/schemas/dml-wordprocessingDrawing.xsd>
[ERROR] xml ErrorLoading schema file <https://ci-builds.apache.org/job/POI/job/POI-DSL-Maven/ws/sonar/ooxml-schema/target/schemas/sml-externalConnections.xsd>
[ERROR] xml ErrorLoading config file <https://ci-builds.apache.org/job/POI/job/POI-DSL-Maven/ws/sonar/ooxml-schema/../../src/ooxml/resources/org/apache/poi/poifs/crypt/encryptionCertificate.xsdconfig>
[ERROR] xml ErrorLoading config file <https://ci-builds.apache.org/job/POI/job/POI-DSL-Maven/ws/sonar/ooxml-schema/../../src/ooxml/resources/org/apache/poi/poifs/crypt/encryptionInfo.xsdconfig>
[ERROR] xml ErrorLoading config file <https://ci-builds.apache.org/job/POI/job/POI-DSL-Maven/ws/sonar/ooxml-schema/../../src/ooxml/resources/org/apache/poi/poifs/crypt/encryptionPassword.xsdconfig>
[ERROR] xml ErrorLoading config file <https://ci-builds.apache.org/job/POI/job/POI-DSL-Maven/ws/sonar/ooxml-schema/../../src/ooxml/resources/org/apache/poi/schemas/ooxmlSchemas.xsdconfig>
[ERROR] xml Error<https://ci-builds.apache.org/job/POI/job/POI-DSL-Maven/ws/sonar/ooxml-schema/target/schemas/wml.xsd>:5537:9: error: src-resolve: attribute 'space@http://www.w3.org/XML/1998/namespace' not found.
[ERROR] xml Error<https://ci-builds.apache.org/job/POI/job/POI-DSL-Maven/ws/sonar/ooxml-schema/target/schemas/shared-math.xsd>:413:9: error: src-resolve: attribute 'space@http://www.w3.org/XML/1998/namespace' not found.
[ERROR]
[ERROR] -> [Help 1]
[ERROR]
[ERROR] To see the full stack trace of the errors, re-run Maven with the -e switch.
[ERROR] Re-run Maven using the -X switch to enable full debug logging.
[ERROR]
[ERROR] For more information about the errors and possible solutions, please read the following articles:
[ERROR] [Help 1] http://cwiki.apache.org/confluence/display/MAVEN/MojoExecutionException
[ERROR]
[ERROR] After correcting the problems, you can resume the build with the command
[ERROR]   mvn <args> -rf :poi-ooxml-schema
Build step 'Invoke top-level Maven targets' marked build as failure
Recording test results

---------------------------------------------------------------------
To unsubscribe, e-mail: [hidden email]
For additional commands, e-mail: [hidden email]

Reply | Threaded
Open this post in threaded view
|

Build failed in Jenkins: POI » POI-DSL-Maven #40

Apache Jenkins Server
See <https://ci-builds.apache.org/job/POI/job/POI-DSL-Maven/40/display/redirect?page=changes>

Changes:

[PJ Fanning] reformat

[PJ Fanning] [github-193] Change TRUNC implementation to use MathX. Thanks to Jacob Harris. This closes #193

[PJ Fanning] xmlbeans jar location


------------------------------------------
[...truncated 815.96 KB...]
                        Length is 0 (0x0)
                        Compressed is false
                        Stream is org.apache.poi.hdgf.streams.UnknownStream
                        First few bytes are []
                Stream at 0 (0x0)
                        Type is 0 (0x0)
                        Format is 0 (0x0)
                        Length is 0 (0x0)
                        Compressed is false
                        Stream is org.apache.poi.hdgf.streams.UnknownStream
                        First few bytes are []
                Stream at 35161 (0x8959)
                        Type is 69 (0x45)
                        Format is 82 (0x52)
                        Length is 13 (0xd)
                        DC.Length is 72 (0x48)
                        Compressed is true
                        Stream is org.apache.poi.hdgf.streams.PointerContainingStream
                        First few bytes are [60, 0, 0, 0, 0, 0, 0, 0, 0, 0, 0, 0, 0, 0, 0, 0, 0, 0, 0, 0, 0, 0, 0, 0, 0, 0, 0, 0, 0, 0, 0, 0, 0, 0, 0, 0, 0, 0, 0, 0, 0, 0, 0, 0, 0, 0, 0, 0, 0, 0, 0, 0, 0, 0, 0, 0, 0, 0, 0, 0, 0, 0, 0, 0, 0, 0, 0, 0, 0, 0, 0, 0]
                        Nbr of children 0 (0x0)
[INFO] Tests run: 1, Failures: 0, Errors: 0, Skipped: 0, Time elapsed: 1.428 s - in org.apache.poi.hdgf.dev.TestVSDDumper
[INFO] Running org.apache.poi.hdgf.chunks.TestChunks
[INFO] Tests run: 5, Failures: 0, Errors: 0, Skipped: 0, Time elapsed: 0.001 s - in org.apache.poi.hdgf.chunks.TestChunks
[INFO] Running org.apache.poi.hdgf.TestHDGFCore
[INFO] Tests run: 7, Failures: 0, Errors: 0, Skipped: 0, Time elapsed: 0.037 s - in org.apache.poi.hdgf.TestHDGFCore
[INFO] Running org.apache.poi.hsmf.TestNameIdChunks
[INFO] Tests run: 2, Failures: 0, Errors: 0, Skipped: 0, Time elapsed: 0.064 s - in org.apache.poi.hsmf.TestNameIdChunks
[INFO] Running org.apache.poi.hsmf.TestFixedSizedProperties
[INFO] Tests run: 7, Failures: 0, Errors: 0, Skipped: 0, Time elapsed: 0.064 s - in org.apache.poi.hsmf.TestFixedSizedProperties
[INFO] Running org.apache.poi.hsmf.Test7BitCodepage
[INFO] Tests run: 1, Failures: 0, Errors: 0, Skipped: 0, Time elapsed: 0.034 s - in org.apache.poi.hsmf.Test7BitCodepage
[INFO] Running org.apache.poi.hsmf.datatypes.TestTypes
[INFO] Tests run: 3, Failures: 0, Errors: 0, Skipped: 0, Time elapsed: 0.001 s - in org.apache.poi.hsmf.datatypes.TestTypes
[INFO] Running org.apache.poi.hsmf.datatypes.TestSorters
[INFO] Tests run: 2, Failures: 0, Errors: 0, Skipped: 0, Time elapsed: 0.001 s - in org.apache.poi.hsmf.datatypes.TestSorters
[INFO] Running org.apache.poi.hsmf.datatypes.TestChunkData
[INFO] Tests run: 6, Failures: 0, Errors: 0, Skipped: 0, Time elapsed: 0.001 s - in org.apache.poi.hsmf.datatypes.TestChunkData
[INFO] Running org.apache.poi.hsmf.datatypes.TestMAPIProperty
[INFO] Tests run: 3, Failures: 0, Errors: 0, Skipped: 0, Time elapsed: 0 s - in org.apache.poi.hsmf.datatypes.TestMAPIProperty
[INFO] Running org.apache.poi.hsmf.TestBlankFileRead
[INFO] Tests run: 7, Failures: 0, Errors: 0, Skipped: 0, Time elapsed: 0.008 s - in org.apache.poi.hsmf.TestBlankFileRead
[INFO] Running org.apache.poi.hsmf.TestSimpleFileRead
[INFO] Tests run: 9, Failures: 0, Errors: 0, Skipped: 0, Time elapsed: 0.051 s - in org.apache.poi.hsmf.TestSimpleFileRead
[INFO] Running org.apache.poi.hsmf.extractor.TestOutlookTextExtractor
[INFO] Tests run: 8, Failures: 0, Errors: 0, Skipped: 0, Time elapsed: 0.118 s - in org.apache.poi.hsmf.extractor.TestOutlookTextExtractor
[INFO] Running org.apache.poi.hsmf.TestExtractEmbeddedMSG
[INFO] Tests run: 1, Failures: 0, Errors: 0, Skipped: 0, Time elapsed: 0.009 s - in org.apache.poi.hsmf.TestExtractEmbeddedMSG
[INFO] Running org.apache.poi.hsmf.TestMessageSubmissionChunk
[INFO] Tests run: 2, Failures: 0, Errors: 0, Skipped: 0, Time elapsed: 0.008 s - in org.apache.poi.hsmf.TestMessageSubmissionChunk
[INFO] Running org.apache.poi.hsmf.TestOutlook30FileRead
[INFO] Tests run: 9, Failures: 0, Errors: 0, Skipped: 0, Time elapsed: 0.08 s - in org.apache.poi.hsmf.TestOutlook30FileRead
[INFO] Running org.apache.poi.hsmf.TestFileWithAttachmentsRead
[INFO] Tests run: 4, Failures: 0, Errors: 0, Skipped: 0, Time elapsed: 0.001 s - in org.apache.poi.hsmf.TestFileWithAttachmentsRead
[INFO] Running org.apache.poi.hsmf.parsers.TestPOIFSChunkParser
[INFO] Tests run: 6, Failures: 0, Errors: 0, Skipped: 0, Time elapsed: 0.083 s - in org.apache.poi.hsmf.parsers.TestPOIFSChunkParser
[INFO] Running org.apache.poi.hsmf.TestBasics
[INFO] Tests run: 9, Failures: 0, Errors: 0, Skipped: 0, Time elapsed: 0.152 s - in org.apache.poi.hsmf.TestBasics
[INFO] Running org.apache.poi.hsmf.TestMessageSubmissionChunkY2KRead
[INFO] Tests run: 3, Failures: 0, Errors: 0, Skipped: 0, Time elapsed: 0.008 s - in org.apache.poi.hsmf.TestMessageSubmissionChunkY2KRead
[INFO] Running org.apache.poi.hwmf.TestHwmfParsing
[WARNING] Tests run: 5, Failures: 0, Errors: 0, Skipped: 1, Time elapsed: 0.014 s - in org.apache.poi.hwmf.TestHwmfParsing
[INFO] Running org.apache.poi.hmef.TestCompressedRTF
[INFO] Tests run: 4, Failures: 0, Errors: 0, Skipped: 0, Time elapsed: 0.021 s - in org.apache.poi.hmef.TestCompressedRTF
[INFO] Running org.apache.poi.hmef.TestBugs
[INFO] Tests run: 3, Failures: 0, Errors: 0, Skipped: 0, Time elapsed: 0.007 s - in org.apache.poi.hmef.TestBugs
[INFO] Running org.apache.poi.hmef.TestAttachments
[INFO] Tests run: 4, Failures: 0, Errors: 0, Skipped: 0, Time elapsed: 0.003 s - in org.apache.poi.hmef.TestAttachments
[INFO] Running org.apache.poi.hmef.extractor.TestHMEFContentsExtractor
Extracting...
Extraction completed
[INFO] Tests run: 3, Failures: 0, Errors: 0, Skipped: 0, Time elapsed: 0.009 s - in org.apache.poi.hmef.extractor.TestHMEFContentsExtractor
[INFO] Running org.apache.poi.hmef.dev.TestHMEFDumper
[INFO] Tests run: 3, Failures: 0, Errors: 0, Skipped: 0, Time elapsed: 0.021 s - in org.apache.poi.hmef.dev.TestHMEFDumper
[INFO] Running org.apache.poi.hmef.TestHMEFMessage
[INFO] Tests run: 9, Failures: 0, Errors: 0, Skipped: 0, Time elapsed: 0.016 s - in org.apache.poi.hmef.TestHMEFMessage
[INFO] Running org.apache.poi.hmef.attribute.TestMAPIAttributes
[INFO] Tests run: 4, Failures: 0, Errors: 0, Skipped: 0, Time elapsed: 0.006 s - in org.apache.poi.hmef.attribute.TestMAPIAttributes
[INFO] Running org.apache.poi.hmef.attribute.TestTNEFAttributes
[INFO] Tests run: 6, Failures: 0, Errors: 0, Skipped: 0, Time elapsed: 0.01 s - in org.apache.poi.hmef.attribute.TestTNEFAttributes
[INFO]
[INFO] Results:
[INFO]
[WARNING] Tests run: 3089, Failures: 0, Errors: 0, Skipped: 5
[INFO]
[INFO]
[INFO] --- jacoco-maven-plugin:0.8.6:report (report) @ poi-scratchpad ---
[INFO] Loading execution data file <https://ci-builds.apache.org/job/POI/job/POI-DSL-Maven/ws/sonar/scratchpad/target/jacoco.exec>
[INFO] Analyzed bundle 'Apache POI Scratchpad package' with 875 classes
[INFO]
[INFO] --- maven-jar-plugin:2.4:jar (default-jar) @ poi-scratchpad ---
[INFO] Building jar: <https://ci-builds.apache.org/job/POI/job/POI-DSL-Maven/ws/sonar/scratchpad/target/poi-scratchpad-5.0.0-SNAPSHOT.jar>
[INFO]
[INFO] ------------------< org.apache.poi:poi-ooxml-schema >-------------------
[INFO] Building Apache POI - Openxmlformats Schema package 5.0.0-SNAPSHOT [4/10]
[INFO] --------------------------------[ jar ]---------------------------------
[INFO]
[INFO] --- jacoco-maven-plugin:0.8.6:prepare-agent (default) @ poi-ooxml-schema ---
[INFO] argLine set to -javaagent:<https://ci-builds.apache.org/job/POI/job/POI-DSL-Maven/ws/.repository/org/jacoco/org.jacoco.agent/0.8.6/org.jacoco.agent-0.8.6-runtime.jar=destfile=/home/jenkins/workspace/POI/POI-DSL-Maven/sonar/ooxml-schema/target/jacoco.exec> -Xmx1024m
[INFO]
[INFO] --- download-maven-plugin:1.5.0:wget (download-xsds) @ poi-ooxml-schema ---
[INFO] Got from cache: <https://ci-builds.apache.org/job/POI/job/POI-DSL-Maven/ws/.repository/.cache/download-maven-plugin/Office%20Open%20XML%201st%20edition%20Part%204%20(PDF).zip_c501e12cb3c66007e0f51e41db066eac>
[INFO]
[INFO] --- maven-antrun-plugin:1.8:run (copy-xmltype-and-xsdconfig) @ poi-ooxml-schema ---
[INFO] Executing tasks

main:
     [copy] Copying 6 files to <https://ci-builds.apache.org/job/POI/job/POI-DSL-Maven/ws/sonar/ooxml-schema/target/schemas>
[INFO] Executed tasks
[INFO]
[INFO] --- maven-antrun-plugin:1.8:run (unzip-schema) @ poi-ooxml-schema ---
[INFO] Executing tasks

main:
     [echo] unzip schemas
    [unzip] Expanding: <https://ci-builds.apache.org/job/POI/job/POI-DSL-Maven/ws/sonar/ooxml-schema/target/OfficeOpenXML-XMLSchema.zip> into <https://ci-builds.apache.org/job/POI/job/POI-DSL-Maven/ws/sonar/ooxml-schema/target/schemas>
     [copy] Copying 1 file to <https://ci-builds.apache.org/job/POI/job/POI-DSL-Maven/ws/sonar/ooxml-schema/target/schemas>
[INFO] Executed tasks
[INFO]
[INFO] --- xmlbeans-maven-plugin:2.3.3:xmlbeans (default) @ poi-ooxml-schema ---
[INFO] ------------------------------------------------------------------------
[INFO] Reactor Summary for Apache POI - the Java API for Microsoft Documents 5.0.0-SNAPSHOT:
[INFO]
[INFO] Apache POI - the Java API for Microsoft Documents .. SUCCESS [  0.799 s]
[INFO] Apache POI Main package ............................ SUCCESS [04:21 min]
[INFO] Apache POI Scratchpad package ...................... SUCCESS [ 29.198 s]
[INFO] Apache POI - Openxmlformats Schema package ......... FAILURE [  7.021 s]
[INFO] Apache POI - Openxmlformats Encryption Schema package SKIPPED
[INFO] Apache POI - Openxmlformats Security-Schema package  SKIPPED
[INFO] Apache POI OOXML package ........................... SKIPPED
[INFO] Apache POI ExcelAnt package ........................ SKIPPED
[INFO] Apache POI Examples package ........................ SKIPPED
[INFO] Apache POI integration test ........................ SKIPPED
[INFO] ------------------------------------------------------------------------
[INFO] BUILD FAILURE
[INFO] ------------------------------------------------------------------------
[INFO] Total time:  04:58 min
[INFO] Finished at: 2020-10-20T16:41:21Z
[INFO] ------------------------------------------------------------------------
[ERROR] Failed to execute goal org.codehaus.mojo:xmlbeans-maven-plugin:2.3.3:xmlbeans (default) on project poi-ooxml-schema: XmlBeans compile failed:
[ERROR]  xml ErrorLoading schema file <https://ci-builds.apache.org/job/POI/job/POI-DSL-Maven/ws/sonar/ooxml-schema/target/schemas/sml-sharedWorkbookRevisions.xsd>
[ERROR] xml ErrorLoading schema file <https://ci-builds.apache.org/job/POI/job/POI-DSL-Maven/ws/sonar/ooxml-schema/target/schemas/dml-shapeStyle.xsd>
[ERROR] xml ErrorLoading schema file <https://ci-builds.apache.org/job/POI/job/POI-DSL-Maven/ws/sonar/ooxml-schema/target/schemas/vml-main.xsd>
[ERROR] xml ErrorLoading schema file <https://ci-builds.apache.org/job/POI/job/POI-DSL-Maven/ws/sonar/ooxml-schema/target/schemas/pml-userDefinedTags.xsd>
[ERROR] xml ErrorLoading schema file <https://ci-builds.apache.org/job/POI/job/POI-DSL-Maven/ws/sonar/ooxml-schema/target/schemas/dml-shape3DCamera.xsd>
[ERROR] xml ErrorLoading schema file <https://ci-builds.apache.org/job/POI/job/POI-DSL-Maven/ws/sonar/ooxml-schema/target/schemas/sml-volatileDependencies.xsd>
[ERROR] xml ErrorLoading schema file <https://ci-builds.apache.org/job/POI/job/POI-DSL-Maven/ws/sonar/ooxml-schema/target/schemas/dml-gvml.xsd>
[ERROR] xml ErrorLoading schema file <https://ci-builds.apache.org/job/POI/job/POI-DSL-Maven/ws/sonar/ooxml-schema/target/schemas/wml.xsd>
[ERROR] xml ErrorLoading schema file <https://ci-builds.apache.org/job/POI/job/POI-DSL-Maven/ws/sonar/ooxml-schema/target/schemas/dml-graphicalObject.xsd>
[ERROR] xml ErrorLoading schema file <https://ci-builds.apache.org/job/POI/job/POI-DSL-Maven/ws/sonar/ooxml-schema/target/schemas/dml-diagramLayoutVariables.xsd>
[ERROR] xml ErrorLoading schema file <https://ci-builds.apache.org/job/POI/job/POI-DSL-Maven/ws/sonar/ooxml-schema/target/schemas/dml-shape3DStyles.xsd>
[ERROR] xml ErrorLoading schema file <https://ci-builds.apache.org/job/POI/job/POI-DSL-Maven/ws/sonar/ooxml-schema/target/schemas/dml-styleDefaults.xsd>
[ERROR] xml ErrorLoading schema file <https://ci-builds.apache.org/job/POI/job/POI-DSL-Maven/ws/sonar/ooxml-schema/target/schemas/shared-customXmlDataProperties.xsd>
[ERROR] xml ErrorLoading schema file <https://ci-builds.apache.org/job/POI/job/POI-DSL-Maven/ws/sonar/ooxml-schema/target/schemas/dml-documentProperties.xsd>
[ERROR] xml ErrorLoading schema file <https://ci-builds.apache.org/job/POI/job/POI-DSL-Maven/ws/sonar/ooxml-schema/target/schemas/xmldsig-core-schema.xsd>
[ERROR] xml ErrorLoading schema file <https://ci-builds.apache.org/job/POI/job/POI-DSL-Maven/ws/sonar/ooxml-schema/target/schemas/dml-textRun.xsd>
[ERROR] xml ErrorLoading schema file <https://ci-builds.apache.org/job/POI/job/POI-DSL-Maven/ws/sonar/ooxml-schema/target/schemas/dml-textCharacter.xsd>
[ERROR] xml ErrorLoading schema file <https://ci-builds.apache.org/job/POI/job/POI-DSL-Maven/ws/sonar/ooxml-schema/target/schemas/dml-audioVideo.xsd>
[ERROR] xml ErrorLoading schema file <https://ci-builds.apache.org/job/POI/job/POI-DSL-Maven/ws/sonar/ooxml-schema/target/schemas/dml-shape3DLighting.xsd>
[ERROR] xml ErrorLoading schema file <https://ci-builds.apache.org/job/POI/job/POI-DSL-Maven/ws/sonar/ooxml-schema/target/schemas/dml-diagramDataModel.xsd>
[ERROR] xml ErrorLoading schema file <https://ci-builds.apache.org/job/POI/job/POI-DSL-Maven/ws/sonar/ooxml-schema/target/schemas/sml-singleCellTable.xsd>
[ERROR] xml ErrorLoading schema file <https://ci-builds.apache.org/job/POI/job/POI-DSL-Maven/ws/sonar/ooxml-schema/target/schemas/pml-animationInfo.xsd>
[ERROR] xml ErrorLoading schema file <https://ci-builds.apache.org/job/POI/job/POI-DSL-Maven/ws/sonar/ooxml-schema/target/schemas/dml-baseTypes.xsd>
[ERROR] xml ErrorLoading schema file <https://ci-builds.apache.org/job/POI/job/POI-DSL-Maven/ws/sonar/ooxml-schema/target/schemas/pml-presentationProperties.xsd>
[ERROR] xml ErrorLoading schema file <https://ci-builds.apache.org/job/POI/job/POI-DSL-Maven/ws/sonar/ooxml-schema/target/schemas/markup-compatibility.xsd>
[ERROR] xml ErrorLoading schema file <https://ci-builds.apache.org/job/POI/job/POI-DSL-Maven/ws/sonar/ooxml-schema/target/schemas/vmlDrawing.xsd>
[ERROR] xml ErrorLoading schema file <https://ci-builds.apache.org/job/POI/job/POI-DSL-Maven/ws/sonar/ooxml-schema/target/schemas/dml-shapeProperties.xsd>
[ERROR] xml ErrorLoading schema file <https://ci-builds.apache.org/job/POI/job/POI-DSL-Maven/ws/sonar/ooxml-schema/target/schemas/sml-calculationChain.xsd>
[ERROR] xml ErrorLoading schema file <https://ci-builds.apache.org/job/POI/job/POI-DSL-Maven/ws/sonar/ooxml-schema/target/schemas/dml-picture.xsd>
[ERROR] xml ErrorLoading schema file <https://ci-builds.apache.org/job/POI/job/POI-DSL-Maven/ws/sonar/ooxml-schema/target/schemas/dml-diagramElementPropertySet.xsd>
[ERROR] xml ErrorLoading schema file <https://ci-builds.apache.org/job/POI/job/POI-DSL-Maven/ws/sonar/ooxml-schema/target/schemas/dml-shape3DScene.xsd>
[ERROR] xml ErrorLoading schema file <https://ci-builds.apache.org/job/POI/job/POI-DSL-Maven/ws/sonar/ooxml-schema/target/schemas/sml-sharedWorkbookUserNames.xsd>
[ERROR] xml ErrorLoading schema file <https://ci-builds.apache.org/job/POI/job/POI-DSL-Maven/ws/sonar/ooxml-schema/target/schemas/pml-viewProperties.xsd>
[ERROR] xml ErrorLoading schema file <https://ci-builds.apache.org/job/POI/job/POI-DSL-Maven/ws/sonar/ooxml-schema/target/schemas/sml-workbook.xsd>
[ERROR] xml ErrorLoading schema file <https://ci-builds.apache.org/job/POI/job/POI-DSL-Maven/ws/sonar/ooxml-schema/target/schemas/shared-relationshipReference.xsd>
[ERROR] xml ErrorLoading schema file <https://ci-builds.apache.org/job/POI/job/POI-DSL-Maven/ws/sonar/ooxml-schema/target/schemas/dml-table.xsd>
[ERROR] xml ErrorLoading schema file <https://ci-builds.apache.org/job/POI/job/POI-DSL-Maven/ws/sonar/ooxml-schema/target/schemas/dml-graphicalObjectFormat.xsd>
[ERROR] xml ErrorLoading schema file <https://ci-builds.apache.org/job/POI/job/POI-DSL-Maven/ws/sonar/ooxml-schema/target/schemas/vml-officeDrawing.xsd>
[ERROR] xml ErrorLoading schema file <https://ci-builds.apache.org/job/POI/job/POI-DSL-Maven/ws/sonar/ooxml-schema/target/schemas/dml-diagramTypes.xsd>
[ERROR] xml ErrorLoading schema file <https://ci-builds.apache.org/job/POI/job/POI-DSL-Maven/ws/sonar/ooxml-schema/target/schemas/shared-customXmlSchemaProperties.xsd>
[ERROR] xml ErrorLoading schema file <https://ci-builds.apache.org/job/POI/job/POI-DSL-Maven/ws/sonar/ooxml-schema/target/schemas/sml-queryTable.xsd>
[ERROR] xml ErrorLoading schema file <https://ci-builds.apache.org/job/POI/job/POI-DSL-Maven/ws/sonar/ooxml-schema/target/schemas/sml-supplementaryWorkbooks.xsd>
[ERROR] xml ErrorLoading schema file <https://ci-builds.apache.org/job/POI/job/POI-DSL-Maven/ws/sonar/ooxml-schema/target/schemas/pml-embedding.xsd>
[ERROR] xml ErrorLoading schema file <https://ci-builds.apache.org/job/POI/job/POI-DSL-Maven/ws/sonar/ooxml-schema/target/schemas/sml-pivotTable.xsd>
[ERROR] xml ErrorLoading schema file <https://ci-builds.apache.org/job/POI/job/POI-DSL-Maven/ws/sonar/ooxml-schema/target/schemas/dml-shape3DScenePlane.xsd>
[ERROR] xml ErrorLoading schema file <https://ci-builds.apache.org/job/POI/job/POI-DSL-Maven/ws/sonar/ooxml-schema/target/schemas/sml-comments.xsd>
[ERROR] xml ErrorLoading schema file <https://ci-builds.apache.org/job/POI/job/POI-DSL-Maven/ws/sonar/ooxml-schema/target/schemas/sml-sheet.xsd>
[ERROR] xml ErrorLoading schema file <https://ci-builds.apache.org/job/POI/job/POI-DSL-Maven/ws/sonar/ooxml-schema/target/schemas/dml-chart.xsd>
[ERROR] xml ErrorLoading schema file <https://ci-builds.apache.org/job/POI/job/POI-DSL-Maven/ws/sonar/ooxml-schema/target/schemas/sml-customXmlMappings.xsd>
[ERROR] xml ErrorLoading schema file <https://ci-builds.apache.org/job/POI/job/POI-DSL-Maven/ws/sonar/ooxml-schema/target/schemas/sml-pivotTableShared.xsd>
[ERROR] xml ErrorLoading schema file <https://ci-builds.apache.org/job/POI/job/POI-DSL-Maven/ws/sonar/ooxml-schema/target/schemas/dml-textBullet.xsd>
[ERROR] xml ErrorLoading schema file <https://ci-builds.apache.org/job/POI/job/POI-DSL-Maven/ws/sonar/ooxml-schema/target/schemas/shared-documentPropertiesVariantTypes.xsd>
[ERROR] xml ErrorLoading schema file <https://ci-builds.apache.org/job/POI/job/POI-DSL-Maven/ws/sonar/ooxml-schema/target/schemas/dml-stylesheet.xsd>
[ERROR] xml ErrorLoading schema file <https://ci-builds.apache.org/job/POI/job/POI-DSL-Maven/ws/sonar/ooxml-schema/target/schemas/pml-slideSynchronizationData.xsd>
[ERROR] xml ErrorLoading schema file <https://ci-builds.apache.org/job/POI/job/POI-DSL-Maven/ws/sonar/ooxml-schema/target/schemas/dml-compatibility.xsd>
[ERROR] xml ErrorLoading schema file <https://ci-builds.apache.org/job/POI/job/POI-DSL-Maven/ws/sonar/ooxml-schema/target/schemas/vml-wordprocessingDrawing.xsd>
[ERROR] xml ErrorLoading schema file <https://ci-builds.apache.org/job/POI/job/POI-DSL-Maven/ws/sonar/ooxml-schema/target/schemas/dml-shapeGeometry.xsd>
[ERROR] xml ErrorLoading schema file <https://ci-builds.apache.org/job/POI/job/POI-DSL-Maven/ws/sonar/ooxml-schema/target/schemas/sml-sheetMetadata.xsd>
[ERROR] xml ErrorLoading schema file <https://ci-builds.apache.org/job/POI/job/POI-DSL-Maven/ws/sonar/ooxml-schema/target/schemas/dml-shapeLineProperties.xsd>
[ERROR] xml ErrorLoading schema file <https://ci-builds.apache.org/job/POI/job/POI-DSL-Maven/ws/sonar/ooxml-schema/target/schemas/vml-spreadsheetDrawing.xsd>
[ERROR] xml ErrorLoading schema file <https://ci-builds.apache.org/job/POI/job/POI-DSL-Maven/ws/sonar/ooxml-schema/target/schemas/dml-lockedCanvas.xsd>
[ERROR] xml ErrorLoading schema file <https://ci-builds.apache.org/job/POI/job/POI-DSL-Maven/ws/sonar/ooxml-schema/target/schemas/shared-math.xsd>
[ERROR] xml ErrorLoading schema file <https://ci-builds.apache.org/job/POI/job/POI-DSL-Maven/ws/sonar/ooxml-schema/target/schemas/dml-text.xsd>
[ERROR] xml ErrorLoading schema file <https://ci-builds.apache.org/job/POI/job/POI-DSL-Maven/ws/sonar/ooxml-schema/target/schemas/shared-bibliography.xsd>
[ERROR] xml ErrorLoading schema file <https://ci-builds.apache.org/job/POI/job/POI-DSL-Maven/ws/sonar/ooxml-schema/target/schemas/pml-slide.xsd>
[ERROR] xml ErrorLoading schema file <https://ci-builds.apache.org/job/POI/job/POI-DSL-Maven/ws/sonar/ooxml-schema/target/schemas/dml-diagramColorTransform.xsd>
[ERROR] xml ErrorLoading schema file <https://ci-builds.apache.org/job/POI/job/POI-DSL-Maven/ws/sonar/ooxml-schema/target/schemas/sml-table.xsd>
[ERROR] xml ErrorLoading schema file <https://ci-builds.apache.org/job/POI/job/POI-DSL-Maven/ws/sonar/ooxml-schema/target/schemas/dml-graphicalObjectAnimation.xsd>
[ERROR] xml ErrorLoading schema file <https://ci-builds.apache.org/job/POI/job/POI-DSL-Maven/ws/sonar/ooxml-schema/target/schemas/pml-comments.xsd>
[ERROR] xml ErrorLoading schema file <https://ci-builds.apache.org/job/POI/job/POI-DSL-Maven/ws/sonar/ooxml-schema/target/schemas/shared-documentPropertiesExtended.xsd>
[ERROR] xml ErrorLoading schema file <https://ci-builds.apache.org/job/POI/job/POI-DSL-Maven/ws/sonar/ooxml-schema/target/schemas/sml-sharedStringTable.xsd>
[ERROR] xml ErrorLoading schema file <https://ci-builds.apache.org/job/POI/job/POI-DSL-Maven/ws/sonar/ooxml-schema/target/schemas/dml-spreadsheetDrawing.xsd>
[ERROR] xml ErrorLoading schema file <https://ci-builds.apache.org/job/POI/job/POI-DSL-Maven/ws/sonar/ooxml-schema/target/schemas/sml-baseTypes.xsd>
[ERROR] xml ErrorLoading schema file <https://ci-builds.apache.org/job/POI/job/POI-DSL-Maven/ws/sonar/ooxml-schema/target/schemas/sml-styles.xsd>
[ERROR] xml ErrorLoading schema file <https://ci-builds.apache.org/job/POI/job/POI-DSL-Maven/ws/sonar/ooxml-schema/target/schemas/vml-presentationDrawing.xsd>
[ERROR] xml ErrorLoading schema file <https://ci-builds.apache.org/job/POI/job/POI-DSL-Maven/ws/sonar/ooxml-schema/target/schemas/dml-baseStylesheet.xsd>
[ERROR] xml ErrorLoading schema file <https://ci-builds.apache.org/job/POI/job/POI-DSL-Maven/ws/sonar/ooxml-schema/target/schemas/dml-tableStyle.xsd>
[ERROR] xml ErrorLoading schema file <https://ci-builds.apache.org/job/POI/job/POI-DSL-Maven/ws/sonar/ooxml-schema/target/schemas/pml-baseTypes.xsd>
[ERROR] xml ErrorLoading schema file <https://ci-builds.apache.org/job/POI/job/POI-DSL-Maven/ws/sonar/ooxml-schema/target/schemas/shared-documentPropertiesCustom.xsd>
[ERROR] xml ErrorLoading schema file <https://ci-builds.apache.org/job/POI/job/POI-DSL-Maven/ws/sonar/ooxml-schema/target/schemas/dml-diagramDefinition.xsd>
[ERROR] xml ErrorLoading schema file <https://ci-builds.apache.org/job/POI/job/POI-DSL-Maven/ws/sonar/ooxml-schema/target/schemas/dml-shapeEffects.xsd>
[ERROR] xml ErrorLoading schema file <https://ci-builds.apache.org/job/POI/job/POI-DSL-Maven/ws/sonar/ooxml-schema/target/schemas/dml-shapeMiscellaneous.xsd>
[ERROR] xml ErrorLoading schema file <https://ci-builds.apache.org/job/POI/job/POI-DSL-Maven/ws/sonar/ooxml-schema/target/schemas/sml-autoFilter.xsd>
[ERROR] xml ErrorLoading schema file <https://ci-builds.apache.org/job/POI/job/POI-DSL-Maven/ws/sonar/ooxml-schema/target/schemas/dml-chartDrawing.xsd>
[ERROR] xml ErrorLoading schema file <https://ci-builds.apache.org/job/POI/job/POI-DSL-Maven/ws/sonar/ooxml-schema/target/schemas/dml-diagramStyleDefinition.xsd>
[ERROR] xml ErrorLoading schema file <https://ci-builds.apache.org/job/POI/job/POI-DSL-Maven/ws/sonar/ooxml-schema/target/schemas/shared-additionalCharacteristics.xsd>
[ERROR] xml ErrorLoading schema file <https://ci-builds.apache.org/job/POI/job/POI-DSL-Maven/ws/sonar/ooxml-schema/target/schemas/dml-textParagraph.xsd>
[ERROR] xml ErrorLoading schema file <https://ci-builds.apache.org/job/POI/job/POI-DSL-Maven/ws/sonar/ooxml-schema/target/schemas/pml-presentation.xsd>
[ERROR] xml ErrorLoading schema file <https://ci-builds.apache.org/job/POI/job/POI-DSL-Maven/ws/sonar/ooxml-schema/target/schemas/visio.xsd>
[ERROR] xml ErrorLoading schema file <https://ci-builds.apache.org/job/POI/job/POI-DSL-Maven/ws/sonar/ooxml-schema/target/schemas/dml-wordprocessingDrawing.xsd>
[ERROR] xml ErrorLoading schema file <https://ci-builds.apache.org/job/POI/job/POI-DSL-Maven/ws/sonar/ooxml-schema/target/schemas/sml-externalConnections.xsd>
[ERROR] xml ErrorLoading config file <https://ci-builds.apache.org/job/POI/job/POI-DSL-Maven/ws/sonar/ooxml-schema/../../src/ooxml/resources/org/apache/poi/poifs/crypt/encryptionCertificate.xsdconfig>
[ERROR] xml ErrorLoading config file <https://ci-builds.apache.org/job/POI/job/POI-DSL-Maven/ws/sonar/ooxml-schema/../../src/ooxml/resources/org/apache/poi/poifs/crypt/encryptionInfo.xsdconfig>
[ERROR] xml ErrorLoading config file <https://ci-builds.apache.org/job/POI/job/POI-DSL-Maven/ws/sonar/ooxml-schema/../../src/ooxml/resources/org/apache/poi/poifs/crypt/encryptionPassword.xsdconfig>
[ERROR] xml ErrorLoading config file <https://ci-builds.apache.org/job/POI/job/POI-DSL-Maven/ws/sonar/ooxml-schema/../../src/ooxml/resources/org/apache/poi/schemas/ooxmlSchemas.xsdconfig>
[ERROR] xml Error<https://ci-builds.apache.org/job/POI/job/POI-DSL-Maven/ws/sonar/ooxml-schema/target/schemas/wml.xsd>:5537:9: error: src-resolve: attribute 'space@http://www.w3.org/XML/1998/namespace' not found.
[ERROR] xml Error<https://ci-builds.apache.org/job/POI/job/POI-DSL-Maven/ws/sonar/ooxml-schema/target/schemas/shared-math.xsd>:413:9: error: src-resolve: attribute 'space@http://www.w3.org/XML/1998/namespace' not found.
[ERROR]
[ERROR] -> [Help 1]
[ERROR]
[ERROR] To see the full stack trace of the errors, re-run Maven with the -e switch.
[ERROR] Re-run Maven using the -X switch to enable full debug logging.
[ERROR]
[ERROR] For more information about the errors and possible solutions, please read the following articles:
[ERROR] [Help 1] http://cwiki.apache.org/confluence/display/MAVEN/MojoExecutionException
[ERROR]
[ERROR] After correcting the problems, you can resume the build with the command
[ERROR]   mvn <args> -rf :poi-ooxml-schema
Build step 'Invoke top-level Maven targets' marked build as failure
Recording test results

---------------------------------------------------------------------
To unsubscribe, e-mail: [hidden email]
For additional commands, e-mail: [hidden email]

Reply | Threaded
Open this post in threaded view
|

Build failed in Jenkins: POI » POI-DSL-Maven #41

Apache Jenkins Server
See <https://ci-builds.apache.org/job/POI/job/POI-DSL-Maven/41/display/redirect?page=changes>

Changes:

[Andreas Beeker] Handle errors from GraalVM native mode runs - UnsupportedFeature on setting Sax features together with missing ErrorMessages from the java.xml module

[PJ Fanning] update change docs


------------------------------------------
[...truncated 815.88 KB...]
                        Length is 0 (0x0)
                        Compressed is false
                        Stream is org.apache.poi.hdgf.streams.UnknownStream
                        First few bytes are []
                Stream at 0 (0x0)
                        Type is 0 (0x0)
                        Format is 0 (0x0)
                        Length is 0 (0x0)
                        Compressed is false
                        Stream is org.apache.poi.hdgf.streams.UnknownStream
                        First few bytes are []
                Stream at 35161 (0x8959)
                        Type is 69 (0x45)
                        Format is 82 (0x52)
                        Length is 13 (0xd)
                        DC.Length is 72 (0x48)
                        Compressed is true
                        Stream is org.apache.poi.hdgf.streams.PointerContainingStream
                        First few bytes are [60, 0, 0, 0, 0, 0, 0, 0, 0, 0, 0, 0, 0, 0, 0, 0, 0, 0, 0, 0, 0, 0, 0, 0, 0, 0, 0, 0, 0, 0, 0, 0, 0, 0, 0, 0, 0, 0, 0, 0, 0, 0, 0, 0, 0, 0, 0, 0, 0, 0, 0, 0, 0, 0, 0, 0, 0, 0, 0, 0, 0, 0, 0, 0, 0, 0, 0, 0, 0, 0, 0, 0]
                        Nbr of children 0 (0x0)
[INFO] Tests run: 1, Failures: 0, Errors: 0, Skipped: 0, Time elapsed: 1.627 s - in org.apache.poi.hdgf.dev.TestVSDDumper
[INFO] Running org.apache.poi.hdgf.chunks.TestChunks
[INFO] Tests run: 5, Failures: 0, Errors: 0, Skipped: 0, Time elapsed: 0.002 s - in org.apache.poi.hdgf.chunks.TestChunks
[INFO] Running org.apache.poi.hdgf.TestHDGFCore
[INFO] Tests run: 7, Failures: 0, Errors: 0, Skipped: 0, Time elapsed: 0.008 s - in org.apache.poi.hdgf.TestHDGFCore
[INFO] Running org.apache.poi.hsmf.TestNameIdChunks
[INFO] Tests run: 2, Failures: 0, Errors: 0, Skipped: 0, Time elapsed: 0.043 s - in org.apache.poi.hsmf.TestNameIdChunks
[INFO] Running org.apache.poi.hsmf.TestFixedSizedProperties
[INFO] Tests run: 7, Failures: 0, Errors: 0, Skipped: 0, Time elapsed: 0.046 s - in org.apache.poi.hsmf.TestFixedSizedProperties
[INFO] Running org.apache.poi.hsmf.Test7BitCodepage
[INFO] Tests run: 1, Failures: 0, Errors: 0, Skipped: 0, Time elapsed: 0.029 s - in org.apache.poi.hsmf.Test7BitCodepage
[INFO] Running org.apache.poi.hsmf.datatypes.TestTypes
[INFO] Tests run: 3, Failures: 0, Errors: 0, Skipped: 0, Time elapsed: 0.004 s - in org.apache.poi.hsmf.datatypes.TestTypes
[INFO] Running org.apache.poi.hsmf.datatypes.TestSorters
[INFO] Tests run: 2, Failures: 0, Errors: 0, Skipped: 0, Time elapsed: 0.001 s - in org.apache.poi.hsmf.datatypes.TestSorters
[INFO] Running org.apache.poi.hsmf.datatypes.TestChunkData
[INFO] Tests run: 6, Failures: 0, Errors: 0, Skipped: 0, Time elapsed: 0.001 s - in org.apache.poi.hsmf.datatypes.TestChunkData
[INFO] Running org.apache.poi.hsmf.datatypes.TestMAPIProperty
[INFO] Tests run: 3, Failures: 0, Errors: 0, Skipped: 0, Time elapsed: 0.001 s - in org.apache.poi.hsmf.datatypes.TestMAPIProperty
[INFO] Running org.apache.poi.hsmf.TestBlankFileRead
[INFO] Tests run: 7, Failures: 0, Errors: 0, Skipped: 0, Time elapsed: 0.001 s - in org.apache.poi.hsmf.TestBlankFileRead
[INFO] Running org.apache.poi.hsmf.TestSimpleFileRead
[INFO] Tests run: 9, Failures: 0, Errors: 0, Skipped: 0, Time elapsed: 0.013 s - in org.apache.poi.hsmf.TestSimpleFileRead
[INFO] Running org.apache.poi.hsmf.extractor.TestOutlookTextExtractor
[INFO] Tests run: 8, Failures: 0, Errors: 0, Skipped: 0, Time elapsed: 0.116 s - in org.apache.poi.hsmf.extractor.TestOutlookTextExtractor
[INFO] Running org.apache.poi.hsmf.TestExtractEmbeddedMSG
[INFO] Tests run: 1, Failures: 0, Errors: 0, Skipped: 0, Time elapsed: 0.005 s - in org.apache.poi.hsmf.TestExtractEmbeddedMSG
[INFO] Running org.apache.poi.hsmf.TestMessageSubmissionChunk
[INFO] Tests run: 2, Failures: 0, Errors: 0, Skipped: 0, Time elapsed: 0.006 s - in org.apache.poi.hsmf.TestMessageSubmissionChunk
[INFO] Running org.apache.poi.hsmf.TestOutlook30FileRead
[INFO] Tests run: 9, Failures: 0, Errors: 0, Skipped: 0, Time elapsed: 0.078 s - in org.apache.poi.hsmf.TestOutlook30FileRead
[INFO] Running org.apache.poi.hsmf.TestFileWithAttachmentsRead
[INFO] Tests run: 4, Failures: 0, Errors: 0, Skipped: 0, Time elapsed: 0.002 s - in org.apache.poi.hsmf.TestFileWithAttachmentsRead
[INFO] Running org.apache.poi.hsmf.parsers.TestPOIFSChunkParser
[INFO] Tests run: 6, Failures: 0, Errors: 0, Skipped: 0, Time elapsed: 0.07 s - in org.apache.poi.hsmf.parsers.TestPOIFSChunkParser
[INFO] Running org.apache.poi.hsmf.TestBasics
[INFO] Tests run: 9, Failures: 0, Errors: 0, Skipped: 0, Time elapsed: 0.163 s - in org.apache.poi.hsmf.TestBasics
[INFO] Running org.apache.poi.hsmf.TestMessageSubmissionChunkY2KRead
[INFO] Tests run: 3, Failures: 0, Errors: 0, Skipped: 0, Time elapsed: 0.007 s - in org.apache.poi.hsmf.TestMessageSubmissionChunkY2KRead
[INFO] Running org.apache.poi.hwmf.TestHwmfParsing
[WARNING] Tests run: 5, Failures: 0, Errors: 0, Skipped: 1, Time elapsed: 0.013 s - in org.apache.poi.hwmf.TestHwmfParsing
[INFO] Running org.apache.poi.hmef.TestCompressedRTF
[INFO] Tests run: 4, Failures: 0, Errors: 0, Skipped: 0, Time elapsed: 0.015 s - in org.apache.poi.hmef.TestCompressedRTF
[INFO] Running org.apache.poi.hmef.TestBugs
[INFO] Tests run: 3, Failures: 0, Errors: 0, Skipped: 0, Time elapsed: 0.007 s - in org.apache.poi.hmef.TestBugs
[INFO] Running org.apache.poi.hmef.TestAttachments
[INFO] Tests run: 4, Failures: 0, Errors: 0, Skipped: 0, Time elapsed: 0.001 s - in org.apache.poi.hmef.TestAttachments
[INFO] Running org.apache.poi.hmef.extractor.TestHMEFContentsExtractor
Extracting...
Extraction completed
[INFO] Tests run: 3, Failures: 0, Errors: 0, Skipped: 0, Time elapsed: 0.009 s - in org.apache.poi.hmef.extractor.TestHMEFContentsExtractor
[INFO] Running org.apache.poi.hmef.dev.TestHMEFDumper
[INFO] Tests run: 3, Failures: 0, Errors: 0, Skipped: 0, Time elapsed: 0.026 s - in org.apache.poi.hmef.dev.TestHMEFDumper
[INFO] Running org.apache.poi.hmef.TestHMEFMessage
[INFO] Tests run: 9, Failures: 0, Errors: 0, Skipped: 0, Time elapsed: 0.013 s - in org.apache.poi.hmef.TestHMEFMessage
[INFO] Running org.apache.poi.hmef.attribute.TestMAPIAttributes
[INFO] Tests run: 4, Failures: 0, Errors: 0, Skipped: 0, Time elapsed: 0.007 s - in org.apache.poi.hmef.attribute.TestMAPIAttributes
[INFO] Running org.apache.poi.hmef.attribute.TestTNEFAttributes
[INFO] Tests run: 6, Failures: 0, Errors: 0, Skipped: 0, Time elapsed: 0.009 s - in org.apache.poi.hmef.attribute.TestTNEFAttributes
[INFO]
[INFO] Results:
[INFO]
[WARNING] Tests run: 3089, Failures: 0, Errors: 0, Skipped: 5
[INFO]
[INFO]
[INFO] --- jacoco-maven-plugin:0.8.6:report (report) @ poi-scratchpad ---
[INFO] Loading execution data file <https://ci-builds.apache.org/job/POI/job/POI-DSL-Maven/ws/sonar/scratchpad/target/jacoco.exec>
[INFO] Analyzed bundle 'Apache POI Scratchpad package' with 875 classes
[INFO]
[INFO] --- maven-jar-plugin:2.4:jar (default-jar) @ poi-scratchpad ---
[INFO] Building jar: <https://ci-builds.apache.org/job/POI/job/POI-DSL-Maven/ws/sonar/scratchpad/target/poi-scratchpad-5.0.0-SNAPSHOT.jar>
[INFO]
[INFO] ------------------< org.apache.poi:poi-ooxml-schema >-------------------
[INFO] Building Apache POI - Openxmlformats Schema package 5.0.0-SNAPSHOT [4/10]
[INFO] --------------------------------[ jar ]---------------------------------
[INFO]
[INFO] --- jacoco-maven-plugin:0.8.6:prepare-agent (default) @ poi-ooxml-schema ---
[INFO] argLine set to -javaagent:<https://ci-builds.apache.org/job/POI/job/POI-DSL-Maven/ws/.repository/org/jacoco/org.jacoco.agent/0.8.6/org.jacoco.agent-0.8.6-runtime.jar=destfile=/home/jenkins/workspace/POI/POI-DSL-Maven/sonar/ooxml-schema/target/jacoco.exec> -Xmx1024m
[INFO]
[INFO] --- download-maven-plugin:1.5.0:wget (download-xsds) @ poi-ooxml-schema ---
[INFO] Got from cache: <https://ci-builds.apache.org/job/POI/job/POI-DSL-Maven/ws/.repository/.cache/download-maven-plugin/Office%20Open%20XML%201st%20edition%20Part%204%20(PDF).zip_c501e12cb3c66007e0f51e41db066eac>
[INFO]
[INFO] --- maven-antrun-plugin:1.8:run (copy-xmltype-and-xsdconfig) @ poi-ooxml-schema ---
[INFO] Executing tasks

main:
     [copy] Copying 6 files to <https://ci-builds.apache.org/job/POI/job/POI-DSL-Maven/ws/sonar/ooxml-schema/target/schemas>
[INFO] Executed tasks
[INFO]
[INFO] --- maven-antrun-plugin:1.8:run (unzip-schema) @ poi-ooxml-schema ---
[INFO] Executing tasks

main:
     [echo] unzip schemas
    [unzip] Expanding: <https://ci-builds.apache.org/job/POI/job/POI-DSL-Maven/ws/sonar/ooxml-schema/target/OfficeOpenXML-XMLSchema.zip> into <https://ci-builds.apache.org/job/POI/job/POI-DSL-Maven/ws/sonar/ooxml-schema/target/schemas>
     [copy] Copying 1 file to <https://ci-builds.apache.org/job/POI/job/POI-DSL-Maven/ws/sonar/ooxml-schema/target/schemas>
[INFO] Executed tasks
[INFO]
[INFO] --- xmlbeans-maven-plugin:2.3.3:xmlbeans (default) @ poi-ooxml-schema ---
[INFO] ------------------------------------------------------------------------
[INFO] Reactor Summary for Apache POI - the Java API for Microsoft Documents 5.0.0-SNAPSHOT:
[INFO]
[INFO] Apache POI - the Java API for Microsoft Documents .. SUCCESS [  0.762 s]
[INFO] Apache POI Main package ............................ SUCCESS [04:10 min]
[INFO] Apache POI Scratchpad package ...................... SUCCESS [ 28.614 s]
[INFO] Apache POI - Openxmlformats Schema package ......... FAILURE [  6.401 s]
[INFO] Apache POI - Openxmlformats Encryption Schema package SKIPPED
[INFO] Apache POI - Openxmlformats Security-Schema package  SKIPPED
[INFO] Apache POI OOXML package ........................... SKIPPED
[INFO] Apache POI ExcelAnt package ........................ SKIPPED
[INFO] Apache POI Examples package ........................ SKIPPED
[INFO] Apache POI integration test ........................ SKIPPED
[INFO] ------------------------------------------------------------------------
[INFO] BUILD FAILURE
[INFO] ------------------------------------------------------------------------
[INFO] Total time:  04:46 min
[INFO] Finished at: 2020-10-20T20:37:29Z
[INFO] ------------------------------------------------------------------------
[ERROR] Failed to execute goal org.codehaus.mojo:xmlbeans-maven-plugin:2.3.3:xmlbeans (default) on project poi-ooxml-schema: XmlBeans compile failed:
[ERROR]  xml ErrorLoading schema file <https://ci-builds.apache.org/job/POI/job/POI-DSL-Maven/ws/sonar/ooxml-schema/target/schemas/sml-sharedWorkbookRevisions.xsd>
[ERROR] xml ErrorLoading schema file <https://ci-builds.apache.org/job/POI/job/POI-DSL-Maven/ws/sonar/ooxml-schema/target/schemas/dml-shapeStyle.xsd>
[ERROR] xml ErrorLoading schema file <https://ci-builds.apache.org/job/POI/job/POI-DSL-Maven/ws/sonar/ooxml-schema/target/schemas/vml-main.xsd>
[ERROR] xml ErrorLoading schema file <https://ci-builds.apache.org/job/POI/job/POI-DSL-Maven/ws/sonar/ooxml-schema/target/schemas/pml-userDefinedTags.xsd>
[ERROR] xml ErrorLoading schema file <https://ci-builds.apache.org/job/POI/job/POI-DSL-Maven/ws/sonar/ooxml-schema/target/schemas/dml-shape3DCamera.xsd>
[ERROR] xml ErrorLoading schema file <https://ci-builds.apache.org/job/POI/job/POI-DSL-Maven/ws/sonar/ooxml-schema/target/schemas/sml-volatileDependencies.xsd>
[ERROR] xml ErrorLoading schema file <https://ci-builds.apache.org/job/POI/job/POI-DSL-Maven/ws/sonar/ooxml-schema/target/schemas/dml-gvml.xsd>
[ERROR] xml ErrorLoading schema file <https://ci-builds.apache.org/job/POI/job/POI-DSL-Maven/ws/sonar/ooxml-schema/target/schemas/wml.xsd>
[ERROR] xml ErrorLoading schema file <https://ci-builds.apache.org/job/POI/job/POI-DSL-Maven/ws/sonar/ooxml-schema/target/schemas/dml-graphicalObject.xsd>
[ERROR] xml ErrorLoading schema file <https://ci-builds.apache.org/job/POI/job/POI-DSL-Maven/ws/sonar/ooxml-schema/target/schemas/dml-diagramLayoutVariables.xsd>
[ERROR] xml ErrorLoading schema file <https://ci-builds.apache.org/job/POI/job/POI-DSL-Maven/ws/sonar/ooxml-schema/target/schemas/dml-shape3DStyles.xsd>
[ERROR] xml ErrorLoading schema file <https://ci-builds.apache.org/job/POI/job/POI-DSL-Maven/ws/sonar/ooxml-schema/target/schemas/dml-styleDefaults.xsd>
[ERROR] xml ErrorLoading schema file <https://ci-builds.apache.org/job/POI/job/POI-DSL-Maven/ws/sonar/ooxml-schema/target/schemas/shared-customXmlDataProperties.xsd>
[ERROR] xml ErrorLoading schema file <https://ci-builds.apache.org/job/POI/job/POI-DSL-Maven/ws/sonar/ooxml-schema/target/schemas/dml-documentProperties.xsd>
[ERROR] xml ErrorLoading schema file <https://ci-builds.apache.org/job/POI/job/POI-DSL-Maven/ws/sonar/ooxml-schema/target/schemas/xmldsig-core-schema.xsd>
[ERROR] xml ErrorLoading schema file <https://ci-builds.apache.org/job/POI/job/POI-DSL-Maven/ws/sonar/ooxml-schema/target/schemas/dml-textRun.xsd>
[ERROR] xml ErrorLoading schema file <https://ci-builds.apache.org/job/POI/job/POI-DSL-Maven/ws/sonar/ooxml-schema/target/schemas/dml-textCharacter.xsd>
[ERROR] xml ErrorLoading schema file <https://ci-builds.apache.org/job/POI/job/POI-DSL-Maven/ws/sonar/ooxml-schema/target/schemas/dml-audioVideo.xsd>
[ERROR] xml ErrorLoading schema file <https://ci-builds.apache.org/job/POI/job/POI-DSL-Maven/ws/sonar/ooxml-schema/target/schemas/dml-shape3DLighting.xsd>
[ERROR] xml ErrorLoading schema file <https://ci-builds.apache.org/job/POI/job/POI-DSL-Maven/ws/sonar/ooxml-schema/target/schemas/dml-diagramDataModel.xsd>
[ERROR] xml ErrorLoading schema file <https://ci-builds.apache.org/job/POI/job/POI-DSL-Maven/ws/sonar/ooxml-schema/target/schemas/sml-singleCellTable.xsd>
[ERROR] xml ErrorLoading schema file <https://ci-builds.apache.org/job/POI/job/POI-DSL-Maven/ws/sonar/ooxml-schema/target/schemas/pml-animationInfo.xsd>
[ERROR] xml ErrorLoading schema file <https://ci-builds.apache.org/job/POI/job/POI-DSL-Maven/ws/sonar/ooxml-schema/target/schemas/dml-baseTypes.xsd>
[ERROR] xml ErrorLoading schema file <https://ci-builds.apache.org/job/POI/job/POI-DSL-Maven/ws/sonar/ooxml-schema/target/schemas/pml-presentationProperties.xsd>
[ERROR] xml ErrorLoading schema file <https://ci-builds.apache.org/job/POI/job/POI-DSL-Maven/ws/sonar/ooxml-schema/target/schemas/markup-compatibility.xsd>
[ERROR] xml ErrorLoading schema file <https://ci-builds.apache.org/job/POI/job/POI-DSL-Maven/ws/sonar/ooxml-schema/target/schemas/vmlDrawing.xsd>
[ERROR] xml ErrorLoading schema file <https://ci-builds.apache.org/job/POI/job/POI-DSL-Maven/ws/sonar/ooxml-schema/target/schemas/dml-shapeProperties.xsd>
[ERROR] xml ErrorLoading schema file <https://ci-builds.apache.org/job/POI/job/POI-DSL-Maven/ws/sonar/ooxml-schema/target/schemas/sml-calculationChain.xsd>
[ERROR] xml ErrorLoading schema file <https://ci-builds.apache.org/job/POI/job/POI-DSL-Maven/ws/sonar/ooxml-schema/target/schemas/dml-picture.xsd>
[ERROR] xml ErrorLoading schema file <https://ci-builds.apache.org/job/POI/job/POI-DSL-Maven/ws/sonar/ooxml-schema/target/schemas/dml-diagramElementPropertySet.xsd>
[ERROR] xml ErrorLoading schema file <https://ci-builds.apache.org/job/POI/job/POI-DSL-Maven/ws/sonar/ooxml-schema/target/schemas/dml-shape3DScene.xsd>
[ERROR] xml ErrorLoading schema file <https://ci-builds.apache.org/job/POI/job/POI-DSL-Maven/ws/sonar/ooxml-schema/target/schemas/sml-sharedWorkbookUserNames.xsd>
[ERROR] xml ErrorLoading schema file <https://ci-builds.apache.org/job/POI/job/POI-DSL-Maven/ws/sonar/ooxml-schema/target/schemas/pml-viewProperties.xsd>
[ERROR] xml ErrorLoading schema file <https://ci-builds.apache.org/job/POI/job/POI-DSL-Maven/ws/sonar/ooxml-schema/target/schemas/sml-workbook.xsd>
[ERROR] xml ErrorLoading schema file <https://ci-builds.apache.org/job/POI/job/POI-DSL-Maven/ws/sonar/ooxml-schema/target/schemas/shared-relationshipReference.xsd>
[ERROR] xml ErrorLoading schema file <https://ci-builds.apache.org/job/POI/job/POI-DSL-Maven/ws/sonar/ooxml-schema/target/schemas/dml-table.xsd>
[ERROR] xml ErrorLoading schema file <https://ci-builds.apache.org/job/POI/job/POI-DSL-Maven/ws/sonar/ooxml-schema/target/schemas/dml-graphicalObjectFormat.xsd>
[ERROR] xml ErrorLoading schema file <https://ci-builds.apache.org/job/POI/job/POI-DSL-Maven/ws/sonar/ooxml-schema/target/schemas/vml-officeDrawing.xsd>
[ERROR] xml ErrorLoading schema file <https://ci-builds.apache.org/job/POI/job/POI-DSL-Maven/ws/sonar/ooxml-schema/target/schemas/dml-diagramTypes.xsd>
[ERROR] xml ErrorLoading schema file <https://ci-builds.apache.org/job/POI/job/POI-DSL-Maven/ws/sonar/ooxml-schema/target/schemas/shared-customXmlSchemaProperties.xsd>
[ERROR] xml ErrorLoading schema file <https://ci-builds.apache.org/job/POI/job/POI-DSL-Maven/ws/sonar/ooxml-schema/target/schemas/sml-queryTable.xsd>
[ERROR] xml ErrorLoading schema file <https://ci-builds.apache.org/job/POI/job/POI-DSL-Maven/ws/sonar/ooxml-schema/target/schemas/sml-supplementaryWorkbooks.xsd>
[ERROR] xml ErrorLoading schema file <https://ci-builds.apache.org/job/POI/job/POI-DSL-Maven/ws/sonar/ooxml-schema/target/schemas/pml-embedding.xsd>
[ERROR] xml ErrorLoading schema file <https://ci-builds.apache.org/job/POI/job/POI-DSL-Maven/ws/sonar/ooxml-schema/target/schemas/sml-pivotTable.xsd>
[ERROR] xml ErrorLoading schema file <https://ci-builds.apache.org/job/POI/job/POI-DSL-Maven/ws/sonar/ooxml-schema/target/schemas/dml-shape3DScenePlane.xsd>
[ERROR] xml ErrorLoading schema file <https://ci-builds.apache.org/job/POI/job/POI-DSL-Maven/ws/sonar/ooxml-schema/target/schemas/sml-comments.xsd>
[ERROR] xml ErrorLoading schema file <https://ci-builds.apache.org/job/POI/job/POI-DSL-Maven/ws/sonar/ooxml-schema/target/schemas/sml-sheet.xsd>
[ERROR] xml ErrorLoading schema file <https://ci-builds.apache.org/job/POI/job/POI-DSL-Maven/ws/sonar/ooxml-schema/target/schemas/dml-chart.xsd>
[ERROR] xml ErrorLoading schema file <https://ci-builds.apache.org/job/POI/job/POI-DSL-Maven/ws/sonar/ooxml-schema/target/schemas/sml-customXmlMappings.xsd>
[ERROR] xml ErrorLoading schema file <https://ci-builds.apache.org/job/POI/job/POI-DSL-Maven/ws/sonar/ooxml-schema/target/schemas/sml-pivotTableShared.xsd>
[ERROR] xml ErrorLoading schema file <https://ci-builds.apache.org/job/POI/job/POI-DSL-Maven/ws/sonar/ooxml-schema/target/schemas/dml-textBullet.xsd>
[ERROR] xml ErrorLoading schema file <https://ci-builds.apache.org/job/POI/job/POI-DSL-Maven/ws/sonar/ooxml-schema/target/schemas/shared-documentPropertiesVariantTypes.xsd>
[ERROR] xml ErrorLoading schema file <https://ci-builds.apache.org/job/POI/job/POI-DSL-Maven/ws/sonar/ooxml-schema/target/schemas/dml-stylesheet.xsd>
[ERROR] xml ErrorLoading schema file <https://ci-builds.apache.org/job/POI/job/POI-DSL-Maven/ws/sonar/ooxml-schema/target/schemas/pml-slideSynchronizationData.xsd>
[ERROR] xml ErrorLoading schema file <https://ci-builds.apache.org/job/POI/job/POI-DSL-Maven/ws/sonar/ooxml-schema/target/schemas/dml-compatibility.xsd>
[ERROR] xml ErrorLoading schema file <https://ci-builds.apache.org/job/POI/job/POI-DSL-Maven/ws/sonar/ooxml-schema/target/schemas/vml-wordprocessingDrawing.xsd>
[ERROR] xml ErrorLoading schema file <https://ci-builds.apache.org/job/POI/job/POI-DSL-Maven/ws/sonar/ooxml-schema/target/schemas/dml-shapeGeometry.xsd>
[ERROR] xml ErrorLoading schema file <https://ci-builds.apache.org/job/POI/job/POI-DSL-Maven/ws/sonar/ooxml-schema/target/schemas/sml-sheetMetadata.xsd>
[ERROR] xml ErrorLoading schema file <https://ci-builds.apache.org/job/POI/job/POI-DSL-Maven/ws/sonar/ooxml-schema/target/schemas/dml-shapeLineProperties.xsd>
[ERROR] xml ErrorLoading schema file <https://ci-builds.apache.org/job/POI/job/POI-DSL-Maven/ws/sonar/ooxml-schema/target/schemas/vml-spreadsheetDrawing.xsd>
[ERROR] xml ErrorLoading schema file <https://ci-builds.apache.org/job/POI/job/POI-DSL-Maven/ws/sonar/ooxml-schema/target/schemas/dml-lockedCanvas.xsd>
[ERROR] xml ErrorLoading schema file <https://ci-builds.apache.org/job/POI/job/POI-DSL-Maven/ws/sonar/ooxml-schema/target/schemas/shared-math.xsd>
[ERROR] xml ErrorLoading schema file <https://ci-builds.apache.org/job/POI/job/POI-DSL-Maven/ws/sonar/ooxml-schema/target/schemas/dml-text.xsd>
[ERROR] xml ErrorLoading schema file <https://ci-builds.apache.org/job/POI/job/POI-DSL-Maven/ws/sonar/ooxml-schema/target/schemas/shared-bibliography.xsd>
[ERROR] xml ErrorLoading schema file <https://ci-builds.apache.org/job/POI/job/POI-DSL-Maven/ws/sonar/ooxml-schema/target/schemas/pml-slide.xsd>
[ERROR] xml ErrorLoading schema file <https://ci-builds.apache.org/job/POI/job/POI-DSL-Maven/ws/sonar/ooxml-schema/target/schemas/dml-diagramColorTransform.xsd>
[ERROR] xml ErrorLoading schema file <https://ci-builds.apache.org/job/POI/job/POI-DSL-Maven/ws/sonar/ooxml-schema/target/schemas/sml-table.xsd>
[ERROR] xml ErrorLoading schema file <https://ci-builds.apache.org/job/POI/job/POI-DSL-Maven/ws/sonar/ooxml-schema/target/schemas/dml-graphicalObjectAnimation.xsd>
[ERROR] xml ErrorLoading schema file <https://ci-builds.apache.org/job/POI/job/POI-DSL-Maven/ws/sonar/ooxml-schema/target/schemas/pml-comments.xsd>
[ERROR] xml ErrorLoading schema file <https://ci-builds.apache.org/job/POI/job/POI-DSL-Maven/ws/sonar/ooxml-schema/target/schemas/shared-documentPropertiesExtended.xsd>
[ERROR] xml ErrorLoading schema file <https://ci-builds.apache.org/job/POI/job/POI-DSL-Maven/ws/sonar/ooxml-schema/target/schemas/sml-sharedStringTable.xsd>
[ERROR] xml ErrorLoading schema file <https://ci-builds.apache.org/job/POI/job/POI-DSL-Maven/ws/sonar/ooxml-schema/target/schemas/dml-spreadsheetDrawing.xsd>
[ERROR] xml ErrorLoading schema file <https://ci-builds.apache.org/job/POI/job/POI-DSL-Maven/ws/sonar/ooxml-schema/target/schemas/sml-baseTypes.xsd>
[ERROR] xml ErrorLoading schema file <https://ci-builds.apache.org/job/POI/job/POI-DSL-Maven/ws/sonar/ooxml-schema/target/schemas/sml-styles.xsd>
[ERROR] xml ErrorLoading schema file <https://ci-builds.apache.org/job/POI/job/POI-DSL-Maven/ws/sonar/ooxml-schema/target/schemas/vml-presentationDrawing.xsd>
[ERROR] xml ErrorLoading schema file <https://ci-builds.apache.org/job/POI/job/POI-DSL-Maven/ws/sonar/ooxml-schema/target/schemas/dml-baseStylesheet.xsd>
[ERROR] xml ErrorLoading schema file <https://ci-builds.apache.org/job/POI/job/POI-DSL-Maven/ws/sonar/ooxml-schema/target/schemas/dml-tableStyle.xsd>
[ERROR] xml ErrorLoading schema file <https://ci-builds.apache.org/job/POI/job/POI-DSL-Maven/ws/sonar/ooxml-schema/target/schemas/pml-baseTypes.xsd>
[ERROR] xml ErrorLoading schema file <https://ci-builds.apache.org/job/POI/job/POI-DSL-Maven/ws/sonar/ooxml-schema/target/schemas/shared-documentPropertiesCustom.xsd>
[ERROR] xml ErrorLoading schema file <https://ci-builds.apache.org/job/POI/job/POI-DSL-Maven/ws/sonar/ooxml-schema/target/schemas/dml-diagramDefinition.xsd>
[ERROR] xml ErrorLoading schema file <https://ci-builds.apache.org/job/POI/job/POI-DSL-Maven/ws/sonar/ooxml-schema/target/schemas/dml-shapeEffects.xsd>
[ERROR] xml ErrorLoading schema file <https://ci-builds.apache.org/job/POI/job/POI-DSL-Maven/ws/sonar/ooxml-schema/target/schemas/dml-shapeMiscellaneous.xsd>
[ERROR] xml ErrorLoading schema file <https://ci-builds.apache.org/job/POI/job/POI-DSL-Maven/ws/sonar/ooxml-schema/target/schemas/sml-autoFilter.xsd>
[ERROR] xml ErrorLoading schema file <https://ci-builds.apache.org/job/POI/job/POI-DSL-Maven/ws/sonar/ooxml-schema/target/schemas/dml-chartDrawing.xsd>
[ERROR] xml ErrorLoading schema file <https://ci-builds.apache.org/job/POI/job/POI-DSL-Maven/ws/sonar/ooxml-schema/target/schemas/dml-diagramStyleDefinition.xsd>
[ERROR] xml ErrorLoading schema file <https://ci-builds.apache.org/job/POI/job/POI-DSL-Maven/ws/sonar/ooxml-schema/target/schemas/shared-additionalCharacteristics.xsd>
[ERROR] xml ErrorLoading schema file <https://ci-builds.apache.org/job/POI/job/POI-DSL-Maven/ws/sonar/ooxml-schema/target/schemas/dml-textParagraph.xsd>
[ERROR] xml ErrorLoading schema file <https://ci-builds.apache.org/job/POI/job/POI-DSL-Maven/ws/sonar/ooxml-schema/target/schemas/pml-presentation.xsd>
[ERROR] xml ErrorLoading schema file <https://ci-builds.apache.org/job/POI/job/POI-DSL-Maven/ws/sonar/ooxml-schema/target/schemas/visio.xsd>
[ERROR] xml ErrorLoading schema file <https://ci-builds.apache.org/job/POI/job/POI-DSL-Maven/ws/sonar/ooxml-schema/target/schemas/dml-wordprocessingDrawing.xsd>
[ERROR] xml ErrorLoading schema file <https://ci-builds.apache.org/job/POI/job/POI-DSL-Maven/ws/sonar/ooxml-schema/target/schemas/sml-externalConnections.xsd>
[ERROR] xml ErrorLoading config file <https://ci-builds.apache.org/job/POI/job/POI-DSL-Maven/ws/sonar/ooxml-schema/../../src/ooxml/resources/org/apache/poi/poifs/crypt/encryptionCertificate.xsdconfig>
[ERROR] xml ErrorLoading config file <https://ci-builds.apache.org/job/POI/job/POI-DSL-Maven/ws/sonar/ooxml-schema/../../src/ooxml/resources/org/apache/poi/poifs/crypt/encryptionInfo.xsdconfig>
[ERROR] xml ErrorLoading config file <https://ci-builds.apache.org/job/POI/job/POI-DSL-Maven/ws/sonar/ooxml-schema/../../src/ooxml/resources/org/apache/poi/poifs/crypt/encryptionPassword.xsdconfig>
[ERROR] xml ErrorLoading config file <https://ci-builds.apache.org/job/POI/job/POI-DSL-Maven/ws/sonar/ooxml-schema/../../src/ooxml/resources/org/apache/poi/schemas/ooxmlSchemas.xsdconfig>
[ERROR] xml Error<https://ci-builds.apache.org/job/POI/job/POI-DSL-Maven/ws/sonar/ooxml-schema/target/schemas/wml.xsd>:5537:9: error: src-resolve: attribute 'space@http://www.w3.org/XML/1998/namespace' not found.
[ERROR] xml Error<https://ci-builds.apache.org/job/POI/job/POI-DSL-Maven/ws/sonar/ooxml-schema/target/schemas/shared-math.xsd>:413:9: error: src-resolve: attribute 'space@http://www.w3.org/XML/1998/namespace' not found.
[ERROR]
[ERROR] -> [Help 1]
[ERROR]
[ERROR] To see the full stack trace of the errors, re-run Maven with the -e switch.
[ERROR] Re-run Maven using the -X switch to enable full debug logging.
[ERROR]
[ERROR] For more information about the errors and possible solutions, please read the following articles:
[ERROR] [Help 1] http://cwiki.apache.org/confluence/display/MAVEN/MojoExecutionException
[ERROR]
[ERROR] After correcting the problems, you can resume the build with the command
[ERROR]   mvn <args> -rf :poi-ooxml-schema
Build step 'Invoke top-level Maven targets' marked build as failure
Recording test results

---------------------------------------------------------------------
To unsubscribe, e-mail: [hidden email]
For additional commands, e-mail: [hidden email]

Reply | Threaded
Open this post in threaded view
|

Build failed in Jenkins: POI » POI-DSL-Maven #42

Apache Jenkins Server
See <https://ci-builds.apache.org/job/POI/job/POI-DSL-Maven/42/display/redirect?page=changes>

Changes:

[Andreas Beeker] add info about marlin rendering engine solving busy loop hangs


------------------------------------------
[...truncated 815.86 KB...]
                        Length is 0 (0x0)
                        Compressed is false
                        Stream is org.apache.poi.hdgf.streams.UnknownStream
                        First few bytes are []
                Stream at 0 (0x0)
                        Type is 0 (0x0)
                        Format is 0 (0x0)
                        Length is 0 (0x0)
                        Compressed is false
                        Stream is org.apache.poi.hdgf.streams.UnknownStream
                        First few bytes are []
                Stream at 35161 (0x8959)
                        Type is 69 (0x45)
                        Format is 82 (0x52)
                        Length is 13 (0xd)
                        DC.Length is 72 (0x48)
                        Compressed is true
                        Stream is org.apache.poi.hdgf.streams.PointerContainingStream
                        First few bytes are [60, 0, 0, 0, 0, 0, 0, 0, 0, 0, 0, 0, 0, 0, 0, 0, 0, 0, 0, 0, 0, 0, 0, 0, 0, 0, 0, 0, 0, 0, 0, 0, 0, 0, 0, 0, 0, 0, 0, 0, 0, 0, 0, 0, 0, 0, 0, 0, 0, 0, 0, 0, 0, 0, 0, 0, 0, 0, 0, 0, 0, 0, 0, 0, 0, 0, 0, 0, 0, 0, 0, 0]
                        Nbr of children 0 (0x0)
[INFO] Tests run: 1, Failures: 0, Errors: 0, Skipped: 0, Time elapsed: 1.166 s - in org.apache.poi.hdgf.dev.TestVSDDumper
[INFO] Running org.apache.poi.hdgf.chunks.TestChunks
[INFO] Tests run: 5, Failures: 0, Errors: 0, Skipped: 0, Time elapsed: 0 s - in org.apache.poi.hdgf.chunks.TestChunks
[INFO] Running org.apache.poi.hdgf.TestHDGFCore
[INFO] Tests run: 7, Failures: 0, Errors: 0, Skipped: 0, Time elapsed: 0.012 s - in org.apache.poi.hdgf.TestHDGFCore
[INFO] Running org.apache.poi.hsmf.TestNameIdChunks
[INFO] Tests run: 2, Failures: 0, Errors: 0, Skipped: 0, Time elapsed: 0.04 s - in org.apache.poi.hsmf.TestNameIdChunks
[INFO] Running org.apache.poi.hsmf.TestFixedSizedProperties
[INFO] Tests run: 7, Failures: 0, Errors: 0, Skipped: 0, Time elapsed: 0.048 s - in org.apache.poi.hsmf.TestFixedSizedProperties
[INFO] Running org.apache.poi.hsmf.Test7BitCodepage
[INFO] Tests run: 1, Failures: 0, Errors: 0, Skipped: 0, Time elapsed: 0.028 s - in org.apache.poi.hsmf.Test7BitCodepage
[INFO] Running org.apache.poi.hsmf.datatypes.TestTypes
[INFO] Tests run: 3, Failures: 0, Errors: 0, Skipped: 0, Time elapsed: 0.001 s - in org.apache.poi.hsmf.datatypes.TestTypes
[INFO] Running org.apache.poi.hsmf.datatypes.TestSorters
[INFO] Tests run: 2, Failures: 0, Errors: 0, Skipped: 0, Time elapsed: 0.002 s - in org.apache.poi.hsmf.datatypes.TestSorters
[INFO] Running org.apache.poi.hsmf.datatypes.TestChunkData
[INFO] Tests run: 6, Failures: 0, Errors: 0, Skipped: 0, Time elapsed: 0.001 s - in org.apache.poi.hsmf.datatypes.TestChunkData
[INFO] Running org.apache.poi.hsmf.datatypes.TestMAPIProperty
[INFO] Tests run: 3, Failures: 0, Errors: 0, Skipped: 0, Time elapsed: 0.002 s - in org.apache.poi.hsmf.datatypes.TestMAPIProperty
[INFO] Running org.apache.poi.hsmf.TestBlankFileRead
[INFO] Tests run: 7, Failures: 0, Errors: 0, Skipped: 0, Time elapsed: 0.001 s - in org.apache.poi.hsmf.TestBlankFileRead
[INFO] Running org.apache.poi.hsmf.TestSimpleFileRead
[INFO] Tests run: 9, Failures: 0, Errors: 0, Skipped: 0, Time elapsed: 0.029 s - in org.apache.poi.hsmf.TestSimpleFileRead
[INFO] Running org.apache.poi.hsmf.extractor.TestOutlookTextExtractor
[INFO] Tests run: 8, Failures: 0, Errors: 0, Skipped: 0, Time elapsed: 0.127 s - in org.apache.poi.hsmf.extractor.TestOutlookTextExtractor
[INFO] Running org.apache.poi.hsmf.TestExtractEmbeddedMSG
[INFO] Tests run: 1, Failures: 0, Errors: 0, Skipped: 0, Time elapsed: 0.006 s - in org.apache.poi.hsmf.TestExtractEmbeddedMSG
[INFO] Running org.apache.poi.hsmf.TestMessageSubmissionChunk
[INFO] Tests run: 2, Failures: 0, Errors: 0, Skipped: 0, Time elapsed: 0.006 s - in org.apache.poi.hsmf.TestMessageSubmissionChunk
[INFO] Running org.apache.poi.hsmf.TestOutlook30FileRead
[INFO] Tests run: 9, Failures: 0, Errors: 0, Skipped: 0, Time elapsed: 0.072 s - in org.apache.poi.hsmf.TestOutlook30FileRead
[INFO] Running org.apache.poi.hsmf.TestFileWithAttachmentsRead
[INFO] Tests run: 4, Failures: 0, Errors: 0, Skipped: 0, Time elapsed: 0.002 s - in org.apache.poi.hsmf.TestFileWithAttachmentsRead
[INFO] Running org.apache.poi.hsmf.parsers.TestPOIFSChunkParser
[INFO] Tests run: 6, Failures: 0, Errors: 0, Skipped: 0, Time elapsed: 0.072 s - in org.apache.poi.hsmf.parsers.TestPOIFSChunkParser
[INFO] Running org.apache.poi.hsmf.TestBasics
[INFO] Tests run: 9, Failures: 0, Errors: 0, Skipped: 0, Time elapsed: 0.21 s - in org.apache.poi.hsmf.TestBasics
[INFO] Running org.apache.poi.hsmf.TestMessageSubmissionChunkY2KRead
[INFO] Tests run: 3, Failures: 0, Errors: 0, Skipped: 0, Time elapsed: 0.012 s - in org.apache.poi.hsmf.TestMessageSubmissionChunkY2KRead
[INFO] Running org.apache.poi.hwmf.TestHwmfParsing
[WARNING] Tests run: 5, Failures: 0, Errors: 0, Skipped: 1, Time elapsed: 0.013 s - in org.apache.poi.hwmf.TestHwmfParsing
[INFO] Running org.apache.poi.hmef.TestCompressedRTF
[INFO] Tests run: 4, Failures: 0, Errors: 0, Skipped: 0, Time elapsed: 0.021 s - in org.apache.poi.hmef.TestCompressedRTF
[INFO] Running org.apache.poi.hmef.TestBugs
[INFO] Tests run: 3, Failures: 0, Errors: 0, Skipped: 0, Time elapsed: 0.005 s - in org.apache.poi.hmef.TestBugs
[INFO] Running org.apache.poi.hmef.TestAttachments
[INFO] Tests run: 4, Failures: 0, Errors: 0, Skipped: 0, Time elapsed: 0.002 s - in org.apache.poi.hmef.TestAttachments
[INFO] Running org.apache.poi.hmef.extractor.TestHMEFContentsExtractor
Extracting...
Extraction completed
[INFO] Tests run: 3, Failures: 0, Errors: 0, Skipped: 0, Time elapsed: 0.01 s - in org.apache.poi.hmef.extractor.TestHMEFContentsExtractor
[INFO] Running org.apache.poi.hmef.dev.TestHMEFDumper
[INFO] Tests run: 3, Failures: 0, Errors: 0, Skipped: 0, Time elapsed: 0.022 s - in org.apache.poi.hmef.dev.TestHMEFDumper
[INFO] Running org.apache.poi.hmef.TestHMEFMessage
[INFO] Tests run: 9, Failures: 0, Errors: 0, Skipped: 0, Time elapsed: 0.01 s - in org.apache.poi.hmef.TestHMEFMessage
[INFO] Running org.apache.poi.hmef.attribute.TestMAPIAttributes
[INFO] Tests run: 4, Failures: 0, Errors: 0, Skipped: 0, Time elapsed: 0.005 s - in org.apache.poi.hmef.attribute.TestMAPIAttributes
[INFO] Running org.apache.poi.hmef.attribute.TestTNEFAttributes
[INFO] Tests run: 6, Failures: 0, Errors: 0, Skipped: 0, Time elapsed: 0.008 s - in org.apache.poi.hmef.attribute.TestTNEFAttributes
[INFO]
[INFO] Results:
[INFO]
[WARNING] Tests run: 3089, Failures: 0, Errors: 0, Skipped: 5
[INFO]
[INFO]
[INFO] --- jacoco-maven-plugin:0.8.6:report (report) @ poi-scratchpad ---
[INFO] Loading execution data file <https://ci-builds.apache.org/job/POI/job/POI-DSL-Maven/ws/sonar/scratchpad/target/jacoco.exec>
[INFO] Analyzed bundle 'Apache POI Scratchpad package' with 875 classes
[INFO]
[INFO] --- maven-jar-plugin:2.4:jar (default-jar) @ poi-scratchpad ---
[INFO] Building jar: <https://ci-builds.apache.org/job/POI/job/POI-DSL-Maven/ws/sonar/scratchpad/target/poi-scratchpad-5.0.0-SNAPSHOT.jar>
[INFO]
[INFO] ------------------< org.apache.poi:poi-ooxml-schema >-------------------
[INFO] Building Apache POI - Openxmlformats Schema package 5.0.0-SNAPSHOT [4/10]
[INFO] --------------------------------[ jar ]---------------------------------
[INFO]
[INFO] --- jacoco-maven-plugin:0.8.6:prepare-agent (default) @ poi-ooxml-schema ---
[INFO] argLine set to -javaagent:<https://ci-builds.apache.org/job/POI/job/POI-DSL-Maven/ws/.repository/org/jacoco/org.jacoco.agent/0.8.6/org.jacoco.agent-0.8.6-runtime.jar=destfile=/home/jenkins/workspace/POI/POI-DSL-Maven/sonar/ooxml-schema/target/jacoco.exec> -Xmx1024m
[INFO]
[INFO] --- download-maven-plugin:1.5.0:wget (download-xsds) @ poi-ooxml-schema ---
[INFO] Got from cache: <https://ci-builds.apache.org/job/POI/job/POI-DSL-Maven/ws/.repository/.cache/download-maven-plugin/Office%20Open%20XML%201st%20edition%20Part%204%20(PDF).zip_c501e12cb3c66007e0f51e41db066eac>
[INFO]
[INFO] --- maven-antrun-plugin:1.8:run (copy-xmltype-and-xsdconfig) @ poi-ooxml-schema ---
[INFO] Executing tasks

main:
     [copy] Copying 6 files to <https://ci-builds.apache.org/job/POI/job/POI-DSL-Maven/ws/sonar/ooxml-schema/target/schemas>
[INFO] Executed tasks
[INFO]
[INFO] --- maven-antrun-plugin:1.8:run (unzip-schema) @ poi-ooxml-schema ---
[INFO] Executing tasks

main:
     [echo] unzip schemas
    [unzip] Expanding: <https://ci-builds.apache.org/job/POI/job/POI-DSL-Maven/ws/sonar/ooxml-schema/target/OfficeOpenXML-XMLSchema.zip> into <https://ci-builds.apache.org/job/POI/job/POI-DSL-Maven/ws/sonar/ooxml-schema/target/schemas>
     [copy] Copying 1 file to <https://ci-builds.apache.org/job/POI/job/POI-DSL-Maven/ws/sonar/ooxml-schema/target/schemas>
[INFO] Executed tasks
[INFO]
[INFO] --- xmlbeans-maven-plugin:2.3.3:xmlbeans (default) @ poi-ooxml-schema ---
[INFO] ------------------------------------------------------------------------
[INFO] Reactor Summary for Apache POI - the Java API for Microsoft Documents 5.0.0-SNAPSHOT:
[INFO]
[INFO] Apache POI - the Java API for Microsoft Documents .. SUCCESS [  0.746 s]
[INFO] Apache POI Main package ............................ SUCCESS [04:01 min]
[INFO] Apache POI Scratchpad package ...................... SUCCESS [ 26.157 s]
[INFO] Apache POI - Openxmlformats Schema package ......... FAILURE [  5.979 s]
[INFO] Apache POI - Openxmlformats Encryption Schema package SKIPPED
[INFO] Apache POI - Openxmlformats Security-Schema package  SKIPPED
[INFO] Apache POI OOXML package ........................... SKIPPED
[INFO] Apache POI ExcelAnt package ........................ SKIPPED
[INFO] Apache POI Examples package ........................ SKIPPED
[INFO] Apache POI integration test ........................ SKIPPED
[INFO] ------------------------------------------------------------------------
[INFO] BUILD FAILURE
[INFO] ------------------------------------------------------------------------
[INFO] Total time:  04:34 min
[INFO] Finished at: 2020-10-21T00:37:15Z
[INFO] ------------------------------------------------------------------------
[ERROR] Failed to execute goal org.codehaus.mojo:xmlbeans-maven-plugin:2.3.3:xmlbeans (default) on project poi-ooxml-schema: XmlBeans compile failed:
[ERROR]  xml ErrorLoading schema file <https://ci-builds.apache.org/job/POI/job/POI-DSL-Maven/ws/sonar/ooxml-schema/target/schemas/sml-sharedWorkbookRevisions.xsd>
[ERROR] xml ErrorLoading schema file <https://ci-builds.apache.org/job/POI/job/POI-DSL-Maven/ws/sonar/ooxml-schema/target/schemas/dml-shapeStyle.xsd>
[ERROR] xml ErrorLoading schema file <https://ci-builds.apache.org/job/POI/job/POI-DSL-Maven/ws/sonar/ooxml-schema/target/schemas/vml-main.xsd>
[ERROR] xml ErrorLoading schema file <https://ci-builds.apache.org/job/POI/job/POI-DSL-Maven/ws/sonar/ooxml-schema/target/schemas/pml-userDefinedTags.xsd>
[ERROR] xml ErrorLoading schema file <https://ci-builds.apache.org/job/POI/job/POI-DSL-Maven/ws/sonar/ooxml-schema/target/schemas/dml-shape3DCamera.xsd>
[ERROR] xml ErrorLoading schema file <https://ci-builds.apache.org/job/POI/job/POI-DSL-Maven/ws/sonar/ooxml-schema/target/schemas/sml-volatileDependencies.xsd>
[ERROR] xml ErrorLoading schema file <https://ci-builds.apache.org/job/POI/job/POI-DSL-Maven/ws/sonar/ooxml-schema/target/schemas/dml-gvml.xsd>
[ERROR] xml ErrorLoading schema file <https://ci-builds.apache.org/job/POI/job/POI-DSL-Maven/ws/sonar/ooxml-schema/target/schemas/wml.xsd>
[ERROR] xml ErrorLoading schema file <https://ci-builds.apache.org/job/POI/job/POI-DSL-Maven/ws/sonar/ooxml-schema/target/schemas/dml-graphicalObject.xsd>
[ERROR] xml ErrorLoading schema file <https://ci-builds.apache.org/job/POI/job/POI-DSL-Maven/ws/sonar/ooxml-schema/target/schemas/dml-diagramLayoutVariables.xsd>
[ERROR] xml ErrorLoading schema file <https://ci-builds.apache.org/job/POI/job/POI-DSL-Maven/ws/sonar/ooxml-schema/target/schemas/dml-shape3DStyles.xsd>
[ERROR] xml ErrorLoading schema file <https://ci-builds.apache.org/job/POI/job/POI-DSL-Maven/ws/sonar/ooxml-schema/target/schemas/dml-styleDefaults.xsd>
[ERROR] xml ErrorLoading schema file <https://ci-builds.apache.org/job/POI/job/POI-DSL-Maven/ws/sonar/ooxml-schema/target/schemas/shared-customXmlDataProperties.xsd>
[ERROR] xml ErrorLoading schema file <https://ci-builds.apache.org/job/POI/job/POI-DSL-Maven/ws/sonar/ooxml-schema/target/schemas/dml-documentProperties.xsd>
[ERROR] xml ErrorLoading schema file <https://ci-builds.apache.org/job/POI/job/POI-DSL-Maven/ws/sonar/ooxml-schema/target/schemas/xmldsig-core-schema.xsd>
[ERROR] xml ErrorLoading schema file <https://ci-builds.apache.org/job/POI/job/POI-DSL-Maven/ws/sonar/ooxml-schema/target/schemas/dml-textRun.xsd>
[ERROR] xml ErrorLoading schema file <https://ci-builds.apache.org/job/POI/job/POI-DSL-Maven/ws/sonar/ooxml-schema/target/schemas/dml-textCharacter.xsd>
[ERROR] xml ErrorLoading schema file <https://ci-builds.apache.org/job/POI/job/POI-DSL-Maven/ws/sonar/ooxml-schema/target/schemas/dml-audioVideo.xsd>
[ERROR] xml ErrorLoading schema file <https://ci-builds.apache.org/job/POI/job/POI-DSL-Maven/ws/sonar/ooxml-schema/target/schemas/dml-shape3DLighting.xsd>
[ERROR] xml ErrorLoading schema file <https://ci-builds.apache.org/job/POI/job/POI-DSL-Maven/ws/sonar/ooxml-schema/target/schemas/dml-diagramDataModel.xsd>
[ERROR] xml ErrorLoading schema file <https://ci-builds.apache.org/job/POI/job/POI-DSL-Maven/ws/sonar/ooxml-schema/target/schemas/sml-singleCellTable.xsd>
[ERROR] xml ErrorLoading schema file <https://ci-builds.apache.org/job/POI/job/POI-DSL-Maven/ws/sonar/ooxml-schema/target/schemas/pml-animationInfo.xsd>
[ERROR] xml ErrorLoading schema file <https://ci-builds.apache.org/job/POI/job/POI-DSL-Maven/ws/sonar/ooxml-schema/target/schemas/dml-baseTypes.xsd>
[ERROR] xml ErrorLoading schema file <https://ci-builds.apache.org/job/POI/job/POI-DSL-Maven/ws/sonar/ooxml-schema/target/schemas/pml-presentationProperties.xsd>
[ERROR] xml ErrorLoading schema file <https://ci-builds.apache.org/job/POI/job/POI-DSL-Maven/ws/sonar/ooxml-schema/target/schemas/markup-compatibility.xsd>
[ERROR] xml ErrorLoading schema file <https://ci-builds.apache.org/job/POI/job/POI-DSL-Maven/ws/sonar/ooxml-schema/target/schemas/vmlDrawing.xsd>
[ERROR] xml ErrorLoading schema file <https://ci-builds.apache.org/job/POI/job/POI-DSL-Maven/ws/sonar/ooxml-schema/target/schemas/dml-shapeProperties.xsd>
[ERROR] xml ErrorLoading schema file <https://ci-builds.apache.org/job/POI/job/POI-DSL-Maven/ws/sonar/ooxml-schema/target/schemas/sml-calculationChain.xsd>
[ERROR] xml ErrorLoading schema file <https://ci-builds.apache.org/job/POI/job/POI-DSL-Maven/ws/sonar/ooxml-schema/target/schemas/dml-picture.xsd>
[ERROR] xml ErrorLoading schema file <https://ci-builds.apache.org/job/POI/job/POI-DSL-Maven/ws/sonar/ooxml-schema/target/schemas/dml-diagramElementPropertySet.xsd>
[ERROR] xml ErrorLoading schema file <https://ci-builds.apache.org/job/POI/job/POI-DSL-Maven/ws/sonar/ooxml-schema/target/schemas/dml-shape3DScene.xsd>
[ERROR] xml ErrorLoading schema file <https://ci-builds.apache.org/job/POI/job/POI-DSL-Maven/ws/sonar/ooxml-schema/target/schemas/sml-sharedWorkbookUserNames.xsd>
[ERROR] xml ErrorLoading schema file <https://ci-builds.apache.org/job/POI/job/POI-DSL-Maven/ws/sonar/ooxml-schema/target/schemas/pml-viewProperties.xsd>
[ERROR] xml ErrorLoading schema file <https://ci-builds.apache.org/job/POI/job/POI-DSL-Maven/ws/sonar/ooxml-schema/target/schemas/sml-workbook.xsd>
[ERROR] xml ErrorLoading schema file <https://ci-builds.apache.org/job/POI/job/POI-DSL-Maven/ws/sonar/ooxml-schema/target/schemas/shared-relationshipReference.xsd>
[ERROR] xml ErrorLoading schema file <https://ci-builds.apache.org/job/POI/job/POI-DSL-Maven/ws/sonar/ooxml-schema/target/schemas/dml-table.xsd>
[ERROR] xml ErrorLoading schema file <https://ci-builds.apache.org/job/POI/job/POI-DSL-Maven/ws/sonar/ooxml-schema/target/schemas/dml-graphicalObjectFormat.xsd>
[ERROR] xml ErrorLoading schema file <https://ci-builds.apache.org/job/POI/job/POI-DSL-Maven/ws/sonar/ooxml-schema/target/schemas/vml-officeDrawing.xsd>
[ERROR] xml ErrorLoading schema file <https://ci-builds.apache.org/job/POI/job/POI-DSL-Maven/ws/sonar/ooxml-schema/target/schemas/dml-diagramTypes.xsd>
[ERROR] xml ErrorLoading schema file <https://ci-builds.apache.org/job/POI/job/POI-DSL-Maven/ws/sonar/ooxml-schema/target/schemas/shared-customXmlSchemaProperties.xsd>
[ERROR] xml ErrorLoading schema file <https://ci-builds.apache.org/job/POI/job/POI-DSL-Maven/ws/sonar/ooxml-schema/target/schemas/sml-queryTable.xsd>
[ERROR] xml ErrorLoading schema file <https://ci-builds.apache.org/job/POI/job/POI-DSL-Maven/ws/sonar/ooxml-schema/target/schemas/sml-supplementaryWorkbooks.xsd>
[ERROR] xml ErrorLoading schema file <https://ci-builds.apache.org/job/POI/job/POI-DSL-Maven/ws/sonar/ooxml-schema/target/schemas/pml-embedding.xsd>
[ERROR] xml ErrorLoading schema file <https://ci-builds.apache.org/job/POI/job/POI-DSL-Maven/ws/sonar/ooxml-schema/target/schemas/sml-pivotTable.xsd>
[ERROR] xml ErrorLoading schema file <https://ci-builds.apache.org/job/POI/job/POI-DSL-Maven/ws/sonar/ooxml-schema/target/schemas/dml-shape3DScenePlane.xsd>
[ERROR] xml ErrorLoading schema file <https://ci-builds.apache.org/job/POI/job/POI-DSL-Maven/ws/sonar/ooxml-schema/target/schemas/sml-comments.xsd>
[ERROR] xml ErrorLoading schema file <https://ci-builds.apache.org/job/POI/job/POI-DSL-Maven/ws/sonar/ooxml-schema/target/schemas/sml-sheet.xsd>
[ERROR] xml ErrorLoading schema file <https://ci-builds.apache.org/job/POI/job/POI-DSL-Maven/ws/sonar/ooxml-schema/target/schemas/dml-chart.xsd>
[ERROR] xml ErrorLoading schema file <https://ci-builds.apache.org/job/POI/job/POI-DSL-Maven/ws/sonar/ooxml-schema/target/schemas/sml-customXmlMappings.xsd>
[ERROR] xml ErrorLoading schema file <https://ci-builds.apache.org/job/POI/job/POI-DSL-Maven/ws/sonar/ooxml-schema/target/schemas/sml-pivotTableShared.xsd>
[ERROR] xml ErrorLoading schema file <https://ci-builds.apache.org/job/POI/job/POI-DSL-Maven/ws/sonar/ooxml-schema/target/schemas/dml-textBullet.xsd>
[ERROR] xml ErrorLoading schema file <https://ci-builds.apache.org/job/POI/job/POI-DSL-Maven/ws/sonar/ooxml-schema/target/schemas/shared-documentPropertiesVariantTypes.xsd>
[ERROR] xml ErrorLoading schema file <https://ci-builds.apache.org/job/POI/job/POI-DSL-Maven/ws/sonar/ooxml-schema/target/schemas/dml-stylesheet.xsd>
[ERROR] xml ErrorLoading schema file <https://ci-builds.apache.org/job/POI/job/POI-DSL-Maven/ws/sonar/ooxml-schema/target/schemas/pml-slideSynchronizationData.xsd>
[ERROR] xml ErrorLoading schema file <https://ci-builds.apache.org/job/POI/job/POI-DSL-Maven/ws/sonar/ooxml-schema/target/schemas/dml-compatibility.xsd>
[ERROR] xml ErrorLoading schema file <https://ci-builds.apache.org/job/POI/job/POI-DSL-Maven/ws/sonar/ooxml-schema/target/schemas/vml-wordprocessingDrawing.xsd>
[ERROR] xml ErrorLoading schema file <https://ci-builds.apache.org/job/POI/job/POI-DSL-Maven/ws/sonar/ooxml-schema/target/schemas/dml-shapeGeometry.xsd>
[ERROR] xml ErrorLoading schema file <https://ci-builds.apache.org/job/POI/job/POI-DSL-Maven/ws/sonar/ooxml-schema/target/schemas/sml-sheetMetadata.xsd>
[ERROR] xml ErrorLoading schema file <https://ci-builds.apache.org/job/POI/job/POI-DSL-Maven/ws/sonar/ooxml-schema/target/schemas/dml-shapeLineProperties.xsd>
[ERROR] xml ErrorLoading schema file <https://ci-builds.apache.org/job/POI/job/POI-DSL-Maven/ws/sonar/ooxml-schema/target/schemas/vml-spreadsheetDrawing.xsd>
[ERROR] xml ErrorLoading schema file <https://ci-builds.apache.org/job/POI/job/POI-DSL-Maven/ws/sonar/ooxml-schema/target/schemas/dml-lockedCanvas.xsd>
[ERROR] xml ErrorLoading schema file <https://ci-builds.apache.org/job/POI/job/POI-DSL-Maven/ws/sonar/ooxml-schema/target/schemas/shared-math.xsd>
[ERROR] xml ErrorLoading schema file <https://ci-builds.apache.org/job/POI/job/POI-DSL-Maven/ws/sonar/ooxml-schema/target/schemas/dml-text.xsd>
[ERROR] xml ErrorLoading schema file <https://ci-builds.apache.org/job/POI/job/POI-DSL-Maven/ws/sonar/ooxml-schema/target/schemas/shared-bibliography.xsd>
[ERROR] xml ErrorLoading schema file <https://ci-builds.apache.org/job/POI/job/POI-DSL-Maven/ws/sonar/ooxml-schema/target/schemas/pml-slide.xsd>
[ERROR] xml ErrorLoading schema file <https://ci-builds.apache.org/job/POI/job/POI-DSL-Maven/ws/sonar/ooxml-schema/target/schemas/dml-diagramColorTransform.xsd>
[ERROR] xml ErrorLoading schema file <https://ci-builds.apache.org/job/POI/job/POI-DSL-Maven/ws/sonar/ooxml-schema/target/schemas/sml-table.xsd>
[ERROR] xml ErrorLoading schema file <https://ci-builds.apache.org/job/POI/job/POI-DSL-Maven/ws/sonar/ooxml-schema/target/schemas/dml-graphicalObjectAnimation.xsd>
[ERROR] xml ErrorLoading schema file <https://ci-builds.apache.org/job/POI/job/POI-DSL-Maven/ws/sonar/ooxml-schema/target/schemas/pml-comments.xsd>
[ERROR] xml ErrorLoading schema file <https://ci-builds.apache.org/job/POI/job/POI-DSL-Maven/ws/sonar/ooxml-schema/target/schemas/shared-documentPropertiesExtended.xsd>
[ERROR] xml ErrorLoading schema file <https://ci-builds.apache.org/job/POI/job/POI-DSL-Maven/ws/sonar/ooxml-schema/target/schemas/sml-sharedStringTable.xsd>
[ERROR] xml ErrorLoading schema file <https://ci-builds.apache.org/job/POI/job/POI-DSL-Maven/ws/sonar/ooxml-schema/target/schemas/dml-spreadsheetDrawing.xsd>
[ERROR] xml ErrorLoading schema file <https://ci-builds.apache.org/job/POI/job/POI-DSL-Maven/ws/sonar/ooxml-schema/target/schemas/sml-baseTypes.xsd>
[ERROR] xml ErrorLoading schema file <https://ci-builds.apache.org/job/POI/job/POI-DSL-Maven/ws/sonar/ooxml-schema/target/schemas/sml-styles.xsd>
[ERROR] xml ErrorLoading schema file <https://ci-builds.apache.org/job/POI/job/POI-DSL-Maven/ws/sonar/ooxml-schema/target/schemas/vml-presentationDrawing.xsd>
[ERROR] xml ErrorLoading schema file <https://ci-builds.apache.org/job/POI/job/POI-DSL-Maven/ws/sonar/ooxml-schema/target/schemas/dml-baseStylesheet.xsd>
[ERROR] xml ErrorLoading schema file <https://ci-builds.apache.org/job/POI/job/POI-DSL-Maven/ws/sonar/ooxml-schema/target/schemas/dml-tableStyle.xsd>
[ERROR] xml ErrorLoading schema file <https://ci-builds.apache.org/job/POI/job/POI-DSL-Maven/ws/sonar/ooxml-schema/target/schemas/pml-baseTypes.xsd>
[ERROR] xml ErrorLoading schema file <https://ci-builds.apache.org/job/POI/job/POI-DSL-Maven/ws/sonar/ooxml-schema/target/schemas/shared-documentPropertiesCustom.xsd>
[ERROR] xml ErrorLoading schema file <https://ci-builds.apache.org/job/POI/job/POI-DSL-Maven/ws/sonar/ooxml-schema/target/schemas/dml-diagramDefinition.xsd>
[ERROR] xml ErrorLoading schema file <https://ci-builds.apache.org/job/POI/job/POI-DSL-Maven/ws/sonar/ooxml-schema/target/schemas/dml-shapeEffects.xsd>
[ERROR] xml ErrorLoading schema file <https://ci-builds.apache.org/job/POI/job/POI-DSL-Maven/ws/sonar/ooxml-schema/target/schemas/dml-shapeMiscellaneous.xsd>
[ERROR] xml ErrorLoading schema file <https://ci-builds.apache.org/job/POI/job/POI-DSL-Maven/ws/sonar/ooxml-schema/target/schemas/sml-autoFilter.xsd>
[ERROR] xml ErrorLoading schema file <https://ci-builds.apache.org/job/POI/job/POI-DSL-Maven/ws/sonar/ooxml-schema/target/schemas/dml-chartDrawing.xsd>
[ERROR] xml ErrorLoading schema file <https://ci-builds.apache.org/job/POI/job/POI-DSL-Maven/ws/sonar/ooxml-schema/target/schemas/dml-diagramStyleDefinition.xsd>
[ERROR] xml ErrorLoading schema file <https://ci-builds.apache.org/job/POI/job/POI-DSL-Maven/ws/sonar/ooxml-schema/target/schemas/shared-additionalCharacteristics.xsd>
[ERROR] xml ErrorLoading schema file <https://ci-builds.apache.org/job/POI/job/POI-DSL-Maven/ws/sonar/ooxml-schema/target/schemas/dml-textParagraph.xsd>
[ERROR] xml ErrorLoading schema file <https://ci-builds.apache.org/job/POI/job/POI-DSL-Maven/ws/sonar/ooxml-schema/target/schemas/pml-presentation.xsd>
[ERROR] xml ErrorLoading schema file <https://ci-builds.apache.org/job/POI/job/POI-DSL-Maven/ws/sonar/ooxml-schema/target/schemas/visio.xsd>
[ERROR] xml ErrorLoading schema file <https://ci-builds.apache.org/job/POI/job/POI-DSL-Maven/ws/sonar/ooxml-schema/target/schemas/dml-wordprocessingDrawing.xsd>
[ERROR] xml ErrorLoading schema file <https://ci-builds.apache.org/job/POI/job/POI-DSL-Maven/ws/sonar/ooxml-schema/target/schemas/sml-externalConnections.xsd>
[ERROR] xml ErrorLoading config file <https://ci-builds.apache.org/job/POI/job/POI-DSL-Maven/ws/sonar/ooxml-schema/../../src/ooxml/resources/org/apache/poi/poifs/crypt/encryptionCertificate.xsdconfig>
[ERROR] xml ErrorLoading config file <https://ci-builds.apache.org/job/POI/job/POI-DSL-Maven/ws/sonar/ooxml-schema/../../src/ooxml/resources/org/apache/poi/poifs/crypt/encryptionInfo.xsdconfig>
[ERROR] xml ErrorLoading config file <https://ci-builds.apache.org/job/POI/job/POI-DSL-Maven/ws/sonar/ooxml-schema/../../src/ooxml/resources/org/apache/poi/poifs/crypt/encryptionPassword.xsdconfig>
[ERROR] xml ErrorLoading config file <https://ci-builds.apache.org/job/POI/job/POI-DSL-Maven/ws/sonar/ooxml-schema/../../src/ooxml/resources/org/apache/poi/schemas/ooxmlSchemas.xsdconfig>
[ERROR] xml Error<https://ci-builds.apache.org/job/POI/job/POI-DSL-Maven/ws/sonar/ooxml-schema/target/schemas/wml.xsd>:5537:9: error: src-resolve: attribute 'space@http://www.w3.org/XML/1998/namespace' not found.
[ERROR] xml Error<https://ci-builds.apache.org/job/POI/job/POI-DSL-Maven/ws/sonar/ooxml-schema/target/schemas/shared-math.xsd>:413:9: error: src-resolve: attribute 'space@http://www.w3.org/XML/1998/namespace' not found.
[ERROR]
[ERROR] -> [Help 1]
[ERROR]
[ERROR] To see the full stack trace of the errors, re-run Maven with the -e switch.
[ERROR] Re-run Maven using the -X switch to enable full debug logging.
[ERROR]
[ERROR] For more information about the errors and possible solutions, please read the following articles:
[ERROR] [Help 1] http://cwiki.apache.org/confluence/display/MAVEN/MojoExecutionException
[ERROR]
[ERROR] After correcting the problems, you can resume the build with the command
[ERROR]   mvn <args> -rf :poi-ooxml-schema
Build step 'Invoke top-level Maven targets' marked build as failure
Recording test results

---------------------------------------------------------------------
To unsubscribe, e-mail: [hidden email]
For additional commands, e-mail: [hidden email]

Reply | Threaded
Open this post in threaded view
|

Build failed in Jenkins: POI » POI-DSL-Maven #43

Apache Jenkins Server
See <https://ci-builds.apache.org/job/POI/job/POI-DSL-Maven/43/display/redirect?page=changes>

Changes:

[PJ Fanning] update commons-codec

[PJ Fanning] update commons-codec


------------------------------------------
[...truncated 843.22 KB...]
                        Length is 0 (0x0)
                        Compressed is false
                        Stream is org.apache.poi.hdgf.streams.UnknownStream
                        First few bytes are []
                Stream at 0 (0x0)
                        Type is 0 (0x0)
                        Format is 0 (0x0)
                        Length is 0 (0x0)
                        Compressed is false
                        Stream is org.apache.poi.hdgf.streams.UnknownStream
                        First few bytes are []
                Stream at 35161 (0x8959)
                        Type is 69 (0x45)
                        Format is 82 (0x52)
                        Length is 13 (0xd)
                        DC.Length is 72 (0x48)
                        Compressed is true
                        Stream is org.apache.poi.hdgf.streams.PointerContainingStream
                        First few bytes are [60, 0, 0, 0, 0, 0, 0, 0, 0, 0, 0, 0, 0, 0, 0, 0, 0, 0, 0, 0, 0, 0, 0, 0, 0, 0, 0, 0, 0, 0, 0, 0, 0, 0, 0, 0, 0, 0, 0, 0, 0, 0, 0, 0, 0, 0, 0, 0, 0, 0, 0, 0, 0, 0, 0, 0, 0, 0, 0, 0, 0, 0, 0, 0, 0, 0, 0, 0, 0, 0, 0, 0]
                        Nbr of children 0 (0x0)
[INFO] Tests run: 1, Failures: 0, Errors: 0, Skipped: 0, Time elapsed: 1.149 s - in org.apache.poi.hdgf.dev.TestVSDDumper
[INFO] Running org.apache.poi.hdgf.chunks.TestChunks
[INFO] Tests run: 5, Failures: 0, Errors: 0, Skipped: 0, Time elapsed: 0.001 s - in org.apache.poi.hdgf.chunks.TestChunks
[INFO] Running org.apache.poi.hdgf.TestHDGFCore
[INFO] Tests run: 7, Failures: 0, Errors: 0, Skipped: 0, Time elapsed: 0.037 s - in org.apache.poi.hdgf.TestHDGFCore
[INFO] Running org.apache.poi.hsmf.TestNameIdChunks
[INFO] Tests run: 2, Failures: 0, Errors: 0, Skipped: 0, Time elapsed: 0.047 s - in org.apache.poi.hsmf.TestNameIdChunks
[INFO] Running org.apache.poi.hsmf.TestFixedSizedProperties
[INFO] Tests run: 7, Failures: 0, Errors: 0, Skipped: 0, Time elapsed: 0.053 s - in org.apache.poi.hsmf.TestFixedSizedProperties
[INFO] Running org.apache.poi.hsmf.Test7BitCodepage
[INFO] Tests run: 1, Failures: 0, Errors: 0, Skipped: 0, Time elapsed: 0.03 s - in org.apache.poi.hsmf.Test7BitCodepage
[INFO] Running org.apache.poi.hsmf.datatypes.TestTypes
[INFO] Tests run: 3, Failures: 0, Errors: 0, Skipped: 0, Time elapsed: 0.001 s - in org.apache.poi.hsmf.datatypes.TestTypes
[INFO] Running org.apache.poi.hsmf.datatypes.TestSorters
[INFO] Tests run: 2, Failures: 0, Errors: 0, Skipped: 0, Time elapsed: 0.001 s - in org.apache.poi.hsmf.datatypes.TestSorters
[INFO] Running org.apache.poi.hsmf.datatypes.TestChunkData
[INFO] Tests run: 6, Failures: 0, Errors: 0, Skipped: 0, Time elapsed: 0.001 s - in org.apache.poi.hsmf.datatypes.TestChunkData
[INFO] Running org.apache.poi.hsmf.datatypes.TestMAPIProperty
[INFO] Tests run: 3, Failures: 0, Errors: 0, Skipped: 0, Time elapsed: 0.001 s - in org.apache.poi.hsmf.datatypes.TestMAPIProperty
[INFO] Running org.apache.poi.hsmf.TestBlankFileRead
[INFO] Tests run: 7, Failures: 0, Errors: 0, Skipped: 0, Time elapsed: 0.003 s - in org.apache.poi.hsmf.TestBlankFileRead
[INFO] Running org.apache.poi.hsmf.TestSimpleFileRead
[INFO] Tests run: 9, Failures: 0, Errors: 0, Skipped: 0, Time elapsed: 0.034 s - in org.apache.poi.hsmf.TestSimpleFileRead
[INFO] Running org.apache.poi.hsmf.extractor.TestOutlookTextExtractor
[INFO] Tests run: 8, Failures: 0, Errors: 0, Skipped: 0, Time elapsed: 0.122 s - in org.apache.poi.hsmf.extractor.TestOutlookTextExtractor
[INFO] Running org.apache.poi.hsmf.TestExtractEmbeddedMSG
[INFO] Tests run: 1, Failures: 0, Errors: 0, Skipped: 0, Time elapsed: 0.009 s - in org.apache.poi.hsmf.TestExtractEmbeddedMSG
[INFO] Running org.apache.poi.hsmf.TestMessageSubmissionChunk
[INFO] Tests run: 2, Failures: 0, Errors: 0, Skipped: 0, Time elapsed: 0.007 s - in org.apache.poi.hsmf.TestMessageSubmissionChunk
[INFO] Running org.apache.poi.hsmf.TestOutlook30FileRead
[INFO] Tests run: 9, Failures: 0, Errors: 0, Skipped: 0, Time elapsed: 0.092 s - in org.apache.poi.hsmf.TestOutlook30FileRead
[INFO] Running org.apache.poi.hsmf.TestFileWithAttachmentsRead
[INFO] Tests run: 4, Failures: 0, Errors: 0, Skipped: 0, Time elapsed: 0.003 s - in org.apache.poi.hsmf.TestFileWithAttachmentsRead
[INFO] Running org.apache.poi.hsmf.parsers.TestPOIFSChunkParser
[INFO] Tests run: 6, Failures: 0, Errors: 0, Skipped: 0, Time elapsed: 0.071 s - in org.apache.poi.hsmf.parsers.TestPOIFSChunkParser
[INFO] Running org.apache.poi.hsmf.TestBasics
[INFO] Tests run: 9, Failures: 0, Errors: 0, Skipped: 0, Time elapsed: 0.177 s - in org.apache.poi.hsmf.TestBasics
[INFO] Running org.apache.poi.hsmf.TestMessageSubmissionChunkY2KRead
[INFO] Tests run: 3, Failures: 0, Errors: 0, Skipped: 0, Time elapsed: 0.009 s - in org.apache.poi.hsmf.TestMessageSubmissionChunkY2KRead
[INFO] Running org.apache.poi.hwmf.TestHwmfParsing
[WARNING] Tests run: 5, Failures: 0, Errors: 0, Skipped: 1, Time elapsed: 0.015 s - in org.apache.poi.hwmf.TestHwmfParsing
[INFO] Running org.apache.poi.hmef.TestCompressedRTF
[INFO] Tests run: 4, Failures: 0, Errors: 0, Skipped: 0, Time elapsed: 0.017 s - in org.apache.poi.hmef.TestCompressedRTF
[INFO] Running org.apache.poi.hmef.TestBugs
[INFO] Tests run: 3, Failures: 0, Errors: 0, Skipped: 0, Time elapsed: 0.007 s - in org.apache.poi.hmef.TestBugs
[INFO] Running org.apache.poi.hmef.TestAttachments
[INFO] Tests run: 4, Failures: 0, Errors: 0, Skipped: 0, Time elapsed: 0.002 s - in org.apache.poi.hmef.TestAttachments
[INFO] Running org.apache.poi.hmef.extractor.TestHMEFContentsExtractor
Extracting...
Extraction completed
[INFO] Tests run: 3, Failures: 0, Errors: 0, Skipped: 0, Time elapsed: 0.01 s - in org.apache.poi.hmef.extractor.TestHMEFContentsExtractor
[INFO] Running org.apache.poi.hmef.dev.TestHMEFDumper
[INFO] Tests run: 3, Failures: 0, Errors: 0, Skipped: 0, Time elapsed: 0.02 s - in org.apache.poi.hmef.dev.TestHMEFDumper
[INFO] Running org.apache.poi.hmef.TestHMEFMessage
[INFO] Tests run: 9, Failures: 0, Errors: 0, Skipped: 0, Time elapsed: 0.011 s - in org.apache.poi.hmef.TestHMEFMessage
[INFO] Running org.apache.poi.hmef.attribute.TestMAPIAttributes
[INFO] Tests run: 4, Failures: 0, Errors: 0, Skipped: 0, Time elapsed: 0.008 s - in org.apache.poi.hmef.attribute.TestMAPIAttributes
[INFO] Running org.apache.poi.hmef.attribute.TestTNEFAttributes
[INFO] Tests run: 6, Failures: 0, Errors: 0, Skipped: 0, Time elapsed: 0.009 s - in org.apache.poi.hmef.attribute.TestTNEFAttributes
[INFO]
[INFO] Results:
[INFO]
[WARNING] Tests run: 3089, Failures: 0, Errors: 0, Skipped: 5
[INFO]
[INFO]
[INFO] --- jacoco-maven-plugin:0.8.6:report (report) @ poi-scratchpad ---
[INFO] Loading execution data file <https://ci-builds.apache.org/job/POI/job/POI-DSL-Maven/ws/sonar/scratchpad/target/jacoco.exec>
[INFO] Analyzed bundle 'Apache POI Scratchpad package' with 875 classes
[INFO]
[INFO] --- maven-jar-plugin:2.4:jar (default-jar) @ poi-scratchpad ---
[INFO] Building jar: <https://ci-builds.apache.org/job/POI/job/POI-DSL-Maven/ws/sonar/scratchpad/target/poi-scratchpad-5.0.0-SNAPSHOT.jar>
[INFO]
[INFO] ------------------< org.apache.poi:poi-ooxml-schema >-------------------
[INFO] Building Apache POI - Openxmlformats Schema package 5.0.0-SNAPSHOT [4/10]
[INFO] --------------------------------[ jar ]---------------------------------
[INFO]
[INFO] --- jacoco-maven-plugin:0.8.6:prepare-agent (default) @ poi-ooxml-schema ---
[INFO] argLine set to -javaagent:<https://ci-builds.apache.org/job/POI/job/POI-DSL-Maven/ws/.repository/org/jacoco/org.jacoco.agent/0.8.6/org.jacoco.agent-0.8.6-runtime.jar=destfile=/home/jenkins/workspace/POI/POI-DSL-Maven/sonar/ooxml-schema/target/jacoco.exec> -Xmx1024m
[INFO]
[INFO] --- download-maven-plugin:1.5.0:wget (download-xsds) @ poi-ooxml-schema ---
[INFO] Got from cache: <https://ci-builds.apache.org/job/POI/job/POI-DSL-Maven/ws/.repository/.cache/download-maven-plugin/Office%20Open%20XML%201st%20edition%20Part%204%20(PDF).zip_c501e12cb3c66007e0f51e41db066eac>
[INFO]
[INFO] --- maven-antrun-plugin:1.8:run (copy-xmltype-and-xsdconfig) @ poi-ooxml-schema ---
[INFO] Executing tasks

main:
     [copy] Copying 6 files to <https://ci-builds.apache.org/job/POI/job/POI-DSL-Maven/ws/sonar/ooxml-schema/target/schemas>
[INFO] Executed tasks
[INFO]
[INFO] --- maven-antrun-plugin:1.8:run (unzip-schema) @ poi-ooxml-schema ---
[INFO] Executing tasks

main:
     [echo] unzip schemas
    [unzip] Expanding: <https://ci-builds.apache.org/job/POI/job/POI-DSL-Maven/ws/sonar/ooxml-schema/target/OfficeOpenXML-XMLSchema.zip> into <https://ci-builds.apache.org/job/POI/job/POI-DSL-Maven/ws/sonar/ooxml-schema/target/schemas>
     [copy] Copying 1 file to <https://ci-builds.apache.org/job/POI/job/POI-DSL-Maven/ws/sonar/ooxml-schema/target/schemas>
[INFO] Executed tasks
[INFO]
[INFO] --- xmlbeans-maven-plugin:2.3.3:xmlbeans (default) @ poi-ooxml-schema ---
[INFO] ------------------------------------------------------------------------
[INFO] Reactor Summary for Apache POI - the Java API for Microsoft Documents 5.0.0-SNAPSHOT:
[INFO]
[INFO] Apache POI - the Java API for Microsoft Documents .. SUCCESS [  3.852 s]
[INFO] Apache POI Main package ............................ SUCCESS [04:19 min]
[INFO] Apache POI Scratchpad package ...................... SUCCESS [ 27.825 s]
[INFO] Apache POI - Openxmlformats Schema package ......... FAILURE [  6.456 s]
[INFO] Apache POI - Openxmlformats Encryption Schema package SKIPPED
[INFO] Apache POI - Openxmlformats Security-Schema package  SKIPPED
[INFO] Apache POI OOXML package ........................... SKIPPED
[INFO] Apache POI ExcelAnt package ........................ SKIPPED
[INFO] Apache POI Examples package ........................ SKIPPED
[INFO] Apache POI integration test ........................ SKIPPED
[INFO] ------------------------------------------------------------------------
[INFO] BUILD FAILURE
[INFO] ------------------------------------------------------------------------
[INFO] Total time:  04:58 min
[INFO] Finished at: 2020-10-23T00:38:02Z
[INFO] ------------------------------------------------------------------------
[ERROR] Failed to execute goal org.codehaus.mojo:xmlbeans-maven-plugin:2.3.3:xmlbeans (default) on project poi-ooxml-schema: XmlBeans compile failed:
[ERROR]  xml ErrorLoading schema file <https://ci-builds.apache.org/job/POI/job/POI-DSL-Maven/ws/sonar/ooxml-schema/target/schemas/sml-sharedWorkbookRevisions.xsd>
[ERROR] xml ErrorLoading schema file <https://ci-builds.apache.org/job/POI/job/POI-DSL-Maven/ws/sonar/ooxml-schema/target/schemas/dml-shapeStyle.xsd>
[ERROR] xml ErrorLoading schema file <https://ci-builds.apache.org/job/POI/job/POI-DSL-Maven/ws/sonar/ooxml-schema/target/schemas/vml-main.xsd>
[ERROR] xml ErrorLoading schema file <https://ci-builds.apache.org/job/POI/job/POI-DSL-Maven/ws/sonar/ooxml-schema/target/schemas/pml-userDefinedTags.xsd>
[ERROR] xml ErrorLoading schema file <https://ci-builds.apache.org/job/POI/job/POI-DSL-Maven/ws/sonar/ooxml-schema/target/schemas/dml-shape3DCamera.xsd>
[ERROR] xml ErrorLoading schema file <https://ci-builds.apache.org/job/POI/job/POI-DSL-Maven/ws/sonar/ooxml-schema/target/schemas/sml-volatileDependencies.xsd>
[ERROR] xml ErrorLoading schema file <https://ci-builds.apache.org/job/POI/job/POI-DSL-Maven/ws/sonar/ooxml-schema/target/schemas/dml-gvml.xsd>
[ERROR] xml ErrorLoading schema file <https://ci-builds.apache.org/job/POI/job/POI-DSL-Maven/ws/sonar/ooxml-schema/target/schemas/wml.xsd>
[ERROR] xml ErrorLoading schema file <https://ci-builds.apache.org/job/POI/job/POI-DSL-Maven/ws/sonar/ooxml-schema/target/schemas/dml-graphicalObject.xsd>
[ERROR] xml ErrorLoading schema file <https://ci-builds.apache.org/job/POI/job/POI-DSL-Maven/ws/sonar/ooxml-schema/target/schemas/dml-diagramLayoutVariables.xsd>
[ERROR] xml ErrorLoading schema file <https://ci-builds.apache.org/job/POI/job/POI-DSL-Maven/ws/sonar/ooxml-schema/target/schemas/dml-shape3DStyles.xsd>
[ERROR] xml ErrorLoading schema file <https://ci-builds.apache.org/job/POI/job/POI-DSL-Maven/ws/sonar/ooxml-schema/target/schemas/dml-styleDefaults.xsd>
[ERROR] xml ErrorLoading schema file <https://ci-builds.apache.org/job/POI/job/POI-DSL-Maven/ws/sonar/ooxml-schema/target/schemas/shared-customXmlDataProperties.xsd>
[ERROR] xml ErrorLoading schema file <https://ci-builds.apache.org/job/POI/job/POI-DSL-Maven/ws/sonar/ooxml-schema/target/schemas/dml-documentProperties.xsd>
[ERROR] xml ErrorLoading schema file <https://ci-builds.apache.org/job/POI/job/POI-DSL-Maven/ws/sonar/ooxml-schema/target/schemas/xmldsig-core-schema.xsd>
[ERROR] xml ErrorLoading schema file <https://ci-builds.apache.org/job/POI/job/POI-DSL-Maven/ws/sonar/ooxml-schema/target/schemas/dml-textRun.xsd>
[ERROR] xml ErrorLoading schema file <https://ci-builds.apache.org/job/POI/job/POI-DSL-Maven/ws/sonar/ooxml-schema/target/schemas/dml-textCharacter.xsd>
[ERROR] xml ErrorLoading schema file <https://ci-builds.apache.org/job/POI/job/POI-DSL-Maven/ws/sonar/ooxml-schema/target/schemas/dml-audioVideo.xsd>
[ERROR] xml ErrorLoading schema file <https://ci-builds.apache.org/job/POI/job/POI-DSL-Maven/ws/sonar/ooxml-schema/target/schemas/dml-shape3DLighting.xsd>
[ERROR] xml ErrorLoading schema file <https://ci-builds.apache.org/job/POI/job/POI-DSL-Maven/ws/sonar/ooxml-schema/target/schemas/dml-diagramDataModel.xsd>
[ERROR] xml ErrorLoading schema file <https://ci-builds.apache.org/job/POI/job/POI-DSL-Maven/ws/sonar/ooxml-schema/target/schemas/sml-singleCellTable.xsd>
[ERROR] xml ErrorLoading schema file <https://ci-builds.apache.org/job/POI/job/POI-DSL-Maven/ws/sonar/ooxml-schema/target/schemas/pml-animationInfo.xsd>
[ERROR] xml ErrorLoading schema file <https://ci-builds.apache.org/job/POI/job/POI-DSL-Maven/ws/sonar/ooxml-schema/target/schemas/dml-baseTypes.xsd>
[ERROR] xml ErrorLoading schema file <https://ci-builds.apache.org/job/POI/job/POI-DSL-Maven/ws/sonar/ooxml-schema/target/schemas/pml-presentationProperties.xsd>
[ERROR] xml ErrorLoading schema file <https://ci-builds.apache.org/job/POI/job/POI-DSL-Maven/ws/sonar/ooxml-schema/target/schemas/markup-compatibility.xsd>
[ERROR] xml ErrorLoading schema file <https://ci-builds.apache.org/job/POI/job/POI-DSL-Maven/ws/sonar/ooxml-schema/target/schemas/vmlDrawing.xsd>
[ERROR] xml ErrorLoading schema file <https://ci-builds.apache.org/job/POI/job/POI-DSL-Maven/ws/sonar/ooxml-schema/target/schemas/dml-shapeProperties.xsd>
[ERROR] xml ErrorLoading schema file <https://ci-builds.apache.org/job/POI/job/POI-DSL-Maven/ws/sonar/ooxml-schema/target/schemas/sml-calculationChain.xsd>
[ERROR] xml ErrorLoading schema file <https://ci-builds.apache.org/job/POI/job/POI-DSL-Maven/ws/sonar/ooxml-schema/target/schemas/dml-picture.xsd>
[ERROR] xml ErrorLoading schema file <https://ci-builds.apache.org/job/POI/job/POI-DSL-Maven/ws/sonar/ooxml-schema/target/schemas/dml-diagramElementPropertySet.xsd>
[ERROR] xml ErrorLoading schema file <https://ci-builds.apache.org/job/POI/job/POI-DSL-Maven/ws/sonar/ooxml-schema/target/schemas/dml-shape3DScene.xsd>
[ERROR] xml ErrorLoading schema file <https://ci-builds.apache.org/job/POI/job/POI-DSL-Maven/ws/sonar/ooxml-schema/target/schemas/sml-sharedWorkbookUserNames.xsd>
[ERROR] xml ErrorLoading schema file <https://ci-builds.apache.org/job/POI/job/POI-DSL-Maven/ws/sonar/ooxml-schema/target/schemas/pml-viewProperties.xsd>
[ERROR] xml ErrorLoading schema file <https://ci-builds.apache.org/job/POI/job/POI-DSL-Maven/ws/sonar/ooxml-schema/target/schemas/sml-workbook.xsd>
[ERROR] xml ErrorLoading schema file <https://ci-builds.apache.org/job/POI/job/POI-DSL-Maven/ws/sonar/ooxml-schema/target/schemas/shared-relationshipReference.xsd>
[ERROR] xml ErrorLoading schema file <https://ci-builds.apache.org/job/POI/job/POI-DSL-Maven/ws/sonar/ooxml-schema/target/schemas/dml-table.xsd>
[ERROR] xml ErrorLoading schema file <https://ci-builds.apache.org/job/POI/job/POI-DSL-Maven/ws/sonar/ooxml-schema/target/schemas/dml-graphicalObjectFormat.xsd>
[ERROR] xml ErrorLoading schema file <https://ci-builds.apache.org/job/POI/job/POI-DSL-Maven/ws/sonar/ooxml-schema/target/schemas/vml-officeDrawing.xsd>
[ERROR] xml ErrorLoading schema file <https://ci-builds.apache.org/job/POI/job/POI-DSL-Maven/ws/sonar/ooxml-schema/target/schemas/dml-diagramTypes.xsd>
[ERROR] xml ErrorLoading schema file <https://ci-builds.apache.org/job/POI/job/POI-DSL-Maven/ws/sonar/ooxml-schema/target/schemas/shared-customXmlSchemaProperties.xsd>
[ERROR] xml ErrorLoading schema file <https://ci-builds.apache.org/job/POI/job/POI-DSL-Maven/ws/sonar/ooxml-schema/target/schemas/sml-queryTable.xsd>
[ERROR] xml ErrorLoading schema file <https://ci-builds.apache.org/job/POI/job/POI-DSL-Maven/ws/sonar/ooxml-schema/target/schemas/sml-supplementaryWorkbooks.xsd>
[ERROR] xml ErrorLoading schema file <https://ci-builds.apache.org/job/POI/job/POI-DSL-Maven/ws/sonar/ooxml-schema/target/schemas/pml-embedding.xsd>
[ERROR] xml ErrorLoading schema file <https://ci-builds.apache.org/job/POI/job/POI-DSL-Maven/ws/sonar/ooxml-schema/target/schemas/sml-pivotTable.xsd>
[ERROR] xml ErrorLoading schema file <https://ci-builds.apache.org/job/POI/job/POI-DSL-Maven/ws/sonar/ooxml-schema/target/schemas/dml-shape3DScenePlane.xsd>
[ERROR] xml ErrorLoading schema file <https://ci-builds.apache.org/job/POI/job/POI-DSL-Maven/ws/sonar/ooxml-schema/target/schemas/sml-comments.xsd>
[ERROR] xml ErrorLoading schema file <https://ci-builds.apache.org/job/POI/job/POI-DSL-Maven/ws/sonar/ooxml-schema/target/schemas/sml-sheet.xsd>
[ERROR] xml ErrorLoading schema file <https://ci-builds.apache.org/job/POI/job/POI-DSL-Maven/ws/sonar/ooxml-schema/target/schemas/dml-chart.xsd>
[ERROR] xml ErrorLoading schema file <https://ci-builds.apache.org/job/POI/job/POI-DSL-Maven/ws/sonar/ooxml-schema/target/schemas/sml-customXmlMappings.xsd>
[ERROR] xml ErrorLoading schema file <https://ci-builds.apache.org/job/POI/job/POI-DSL-Maven/ws/sonar/ooxml-schema/target/schemas/sml-pivotTableShared.xsd>
[ERROR] xml ErrorLoading schema file <https://ci-builds.apache.org/job/POI/job/POI-DSL-Maven/ws/sonar/ooxml-schema/target/schemas/dml-textBullet.xsd>
[ERROR] xml ErrorLoading schema file <https://ci-builds.apache.org/job/POI/job/POI-DSL-Maven/ws/sonar/ooxml-schema/target/schemas/shared-documentPropertiesVariantTypes.xsd>
[ERROR] xml ErrorLoading schema file <https://ci-builds.apache.org/job/POI/job/POI-DSL-Maven/ws/sonar/ooxml-schema/target/schemas/dml-stylesheet.xsd>
[ERROR] xml ErrorLoading schema file <https://ci-builds.apache.org/job/POI/job/POI-DSL-Maven/ws/sonar/ooxml-schema/target/schemas/pml-slideSynchronizationData.xsd>
[ERROR] xml ErrorLoading schema file <https://ci-builds.apache.org/job/POI/job/POI-DSL-Maven/ws/sonar/ooxml-schema/target/schemas/dml-compatibility.xsd>
[ERROR] xml ErrorLoading schema file <https://ci-builds.apache.org/job/POI/job/POI-DSL-Maven/ws/sonar/ooxml-schema/target/schemas/vml-wordprocessingDrawing.xsd>
[ERROR] xml ErrorLoading schema file <https://ci-builds.apache.org/job/POI/job/POI-DSL-Maven/ws/sonar/ooxml-schema/target/schemas/dml-shapeGeometry.xsd>
[ERROR] xml ErrorLoading schema file <https://ci-builds.apache.org/job/POI/job/POI-DSL-Maven/ws/sonar/ooxml-schema/target/schemas/sml-sheetMetadata.xsd>
[ERROR] xml ErrorLoading schema file <https://ci-builds.apache.org/job/POI/job/POI-DSL-Maven/ws/sonar/ooxml-schema/target/schemas/dml-shapeLineProperties.xsd>
[ERROR] xml ErrorLoading schema file <https://ci-builds.apache.org/job/POI/job/POI-DSL-Maven/ws/sonar/ooxml-schema/target/schemas/vml-spreadsheetDrawing.xsd>
[ERROR] xml ErrorLoading schema file <https://ci-builds.apache.org/job/POI/job/POI-DSL-Maven/ws/sonar/ooxml-schema/target/schemas/dml-lockedCanvas.xsd>
[ERROR] xml ErrorLoading schema file <https://ci-builds.apache.org/job/POI/job/POI-DSL-Maven/ws/sonar/ooxml-schema/target/schemas/shared-math.xsd>
[ERROR] xml ErrorLoading schema file <https://ci-builds.apache.org/job/POI/job/POI-DSL-Maven/ws/sonar/ooxml-schema/target/schemas/dml-text.xsd>
[ERROR] xml ErrorLoading schema file <https://ci-builds.apache.org/job/POI/job/POI-DSL-Maven/ws/sonar/ooxml-schema/target/schemas/shared-bibliography.xsd>
[ERROR] xml ErrorLoading schema file <https://ci-builds.apache.org/job/POI/job/POI-DSL-Maven/ws/sonar/ooxml-schema/target/schemas/pml-slide.xsd>
[ERROR] xml ErrorLoading schema file <https://ci-builds.apache.org/job/POI/job/POI-DSL-Maven/ws/sonar/ooxml-schema/target/schemas/dml-diagramColorTransform.xsd>
[ERROR] xml ErrorLoading schema file <https://ci-builds.apache.org/job/POI/job/POI-DSL-Maven/ws/sonar/ooxml-schema/target/schemas/sml-table.xsd>
[ERROR] xml ErrorLoading schema file <https://ci-builds.apache.org/job/POI/job/POI-DSL-Maven/ws/sonar/ooxml-schema/target/schemas/dml-graphicalObjectAnimation.xsd>
[ERROR] xml ErrorLoading schema file <https://ci-builds.apache.org/job/POI/job/POI-DSL-Maven/ws/sonar/ooxml-schema/target/schemas/pml-comments.xsd>
[ERROR] xml ErrorLoading schema file <https://ci-builds.apache.org/job/POI/job/POI-DSL-Maven/ws/sonar/ooxml-schema/target/schemas/shared-documentPropertiesExtended.xsd>
[ERROR] xml ErrorLoading schema file <https://ci-builds.apache.org/job/POI/job/POI-DSL-Maven/ws/sonar/ooxml-schema/target/schemas/sml-sharedStringTable.xsd>
[ERROR] xml ErrorLoading schema file <https://ci-builds.apache.org/job/POI/job/POI-DSL-Maven/ws/sonar/ooxml-schema/target/schemas/dml-spreadsheetDrawing.xsd>
[ERROR] xml ErrorLoading schema file <https://ci-builds.apache.org/job/POI/job/POI-DSL-Maven/ws/sonar/ooxml-schema/target/schemas/sml-baseTypes.xsd>
[ERROR] xml ErrorLoading schema file <https://ci-builds.apache.org/job/POI/job/POI-DSL-Maven/ws/sonar/ooxml-schema/target/schemas/sml-styles.xsd>
[ERROR] xml ErrorLoading schema file <https://ci-builds.apache.org/job/POI/job/POI-DSL-Maven/ws/sonar/ooxml-schema/target/schemas/vml-presentationDrawing.xsd>
[ERROR] xml ErrorLoading schema file <https://ci-builds.apache.org/job/POI/job/POI-DSL-Maven/ws/sonar/ooxml-schema/target/schemas/dml-baseStylesheet.xsd>
[ERROR] xml ErrorLoading schema file <https://ci-builds.apache.org/job/POI/job/POI-DSL-Maven/ws/sonar/ooxml-schema/target/schemas/dml-tableStyle.xsd>
[ERROR] xml ErrorLoading schema file <https://ci-builds.apache.org/job/POI/job/POI-DSL-Maven/ws/sonar/ooxml-schema/target/schemas/pml-baseTypes.xsd>
[ERROR] xml ErrorLoading schema file <https://ci-builds.apache.org/job/POI/job/POI-DSL-Maven/ws/sonar/ooxml-schema/target/schemas/shared-documentPropertiesCustom.xsd>
[ERROR] xml ErrorLoading schema file <https://ci-builds.apache.org/job/POI/job/POI-DSL-Maven/ws/sonar/ooxml-schema/target/schemas/dml-diagramDefinition.xsd>
[ERROR] xml ErrorLoading schema file <https://ci-builds.apache.org/job/POI/job/POI-DSL-Maven/ws/sonar/ooxml-schema/target/schemas/dml-shapeEffects.xsd>
[ERROR] xml ErrorLoading schema file <https://ci-builds.apache.org/job/POI/job/POI-DSL-Maven/ws/sonar/ooxml-schema/target/schemas/dml-shapeMiscellaneous.xsd>
[ERROR] xml ErrorLoading schema file <https://ci-builds.apache.org/job/POI/job/POI-DSL-Maven/ws/sonar/ooxml-schema/target/schemas/sml-autoFilter.xsd>
[ERROR] xml ErrorLoading schema file <https://ci-builds.apache.org/job/POI/job/POI-DSL-Maven/ws/sonar/ooxml-schema/target/schemas/dml-chartDrawing.xsd>
[ERROR] xml ErrorLoading schema file <https://ci-builds.apache.org/job/POI/job/POI-DSL-Maven/ws/sonar/ooxml-schema/target/schemas/dml-diagramStyleDefinition.xsd>
[ERROR] xml ErrorLoading schema file <https://ci-builds.apache.org/job/POI/job/POI-DSL-Maven/ws/sonar/ooxml-schema/target/schemas/shared-additionalCharacteristics.xsd>
[ERROR] xml ErrorLoading schema file <https://ci-builds.apache.org/job/POI/job/POI-DSL-Maven/ws/sonar/ooxml-schema/target/schemas/dml-textParagraph.xsd>
[ERROR] xml ErrorLoading schema file <https://ci-builds.apache.org/job/POI/job/POI-DSL-Maven/ws/sonar/ooxml-schema/target/schemas/pml-presentation.xsd>
[ERROR] xml ErrorLoading schema file <https://ci-builds.apache.org/job/POI/job/POI-DSL-Maven/ws/sonar/ooxml-schema/target/schemas/visio.xsd>
[ERROR] xml ErrorLoading schema file <https://ci-builds.apache.org/job/POI/job/POI-DSL-Maven/ws/sonar/ooxml-schema/target/schemas/dml-wordprocessingDrawing.xsd>
[ERROR] xml ErrorLoading schema file <https://ci-builds.apache.org/job/POI/job/POI-DSL-Maven/ws/sonar/ooxml-schema/target/schemas/sml-externalConnections.xsd>
[ERROR] xml ErrorLoading config file <https://ci-builds.apache.org/job/POI/job/POI-DSL-Maven/ws/sonar/ooxml-schema/../../src/ooxml/resources/org/apache/poi/poifs/crypt/encryptionCertificate.xsdconfig>
[ERROR] xml ErrorLoading config file <https://ci-builds.apache.org/job/POI/job/POI-DSL-Maven/ws/sonar/ooxml-schema/../../src/ooxml/resources/org/apache/poi/poifs/crypt/encryptionInfo.xsdconfig>
[ERROR] xml ErrorLoading config file <https://ci-builds.apache.org/job/POI/job/POI-DSL-Maven/ws/sonar/ooxml-schema/../../src/ooxml/resources/org/apache/poi/poifs/crypt/encryptionPassword.xsdconfig>
[ERROR] xml ErrorLoading config file <https://ci-builds.apache.org/job/POI/job/POI-DSL-Maven/ws/sonar/ooxml-schema/../../src/ooxml/resources/org/apache/poi/schemas/ooxmlSchemas.xsdconfig>
[ERROR] xml Error<https://ci-builds.apache.org/job/POI/job/POI-DSL-Maven/ws/sonar/ooxml-schema/target/schemas/wml.xsd>:5537:9: error: src-resolve: attribute 'space@http://www.w3.org/XML/1998/namespace' not found.
[ERROR] xml Error<https://ci-builds.apache.org/job/POI/job/POI-DSL-Maven/ws/sonar/ooxml-schema/target/schemas/shared-math.xsd>:413:9: error: src-resolve: attribute 'space@http://www.w3.org/XML/1998/namespace' not found.
[ERROR]
[ERROR] -> [Help 1]
[ERROR]
[ERROR] To see the full stack trace of the errors, re-run Maven with the -e switch.
[ERROR] Re-run Maven using the -X switch to enable full debug logging.
[ERROR]
[ERROR] For more information about the errors and possible solutions, please read the following articles:
[ERROR] [Help 1] http://cwiki.apache.org/confluence/display/MAVEN/MojoExecutionException
[ERROR]
[ERROR] After correcting the problems, you can resume the build with the command
[ERROR]   mvn <args> -rf :poi-ooxml-schema
Build step 'Invoke top-level Maven targets' marked build as failure
Recording test results

---------------------------------------------------------------------
To unsubscribe, e-mail: [hidden email]
For additional commands, e-mail: [hidden email]

Reply | Threaded
Open this post in threaded view
|

Build failed in Jenkins: POI » POI-DSL-Maven #44

Apache Jenkins Server
See <https://ci-builds.apache.org/job/POI/job/POI-DSL-Maven/44/display/redirect?page=changes>

Changes:

[Andreas Beeker] try to fix sonar build


------------------------------------------
[...truncated 2.09 MB...]
[INFO] Tests run: 1, Failures: 0, Errors: 0, Skipped: 0, Time elapsed: 0.016 s - in org.apache.poi.xssf.usermodel.TestXSSFTextParagraph
[INFO] Running org.apache.poi.xssf.usermodel.TestXSSFTextRun
[INFO] Tests run: 1, Failures: 0, Errors: 0, Skipped: 0, Time elapsed: 0.005 s - in org.apache.poi.xssf.usermodel.TestXSSFTextRun
[INFO] Running org.apache.poi.xssf.usermodel.TestXSSFCellStyle
[INFO] Tests run: 43, Failures: 0, Errors: 0, Skipped: 0, Time elapsed: 0.266 s - in org.apache.poi.xssf.usermodel.TestXSSFCellStyle
[INFO] Running org.apache.poi.xssf.usermodel.TestXSSFFormulaParser
[INFO] Tests run: 12, Failures: 0, Errors: 0, Skipped: 0, Time elapsed: 0.207 s - in org.apache.poi.xssf.usermodel.TestXSSFFormulaParser
[INFO] Running org.apache.poi.xssf.usermodel.TestXSSFPivotTableRef
[INFO] Tests run: 18, Failures: 0, Errors: 0, Skipped: 0, Time elapsed: 0.478 s - in org.apache.poi.xssf.usermodel.TestXSSFPivotTableRef
[INFO] Running org.apache.poi.xssf.usermodel.TestXSSFUnicodeSurrogates
[INFO] Tests run: 1, Failures: 0, Errors: 0, Skipped: 0, Time elapsed: 0.017 s - in org.apache.poi.xssf.usermodel.TestXSSFUnicodeSurrogates
[INFO] Running org.apache.poi.xssf.usermodel.TestXSSFChartSheet
[INFO] Tests run: 3, Failures: 0, Errors: 0, Skipped: 0, Time elapsed: 0.027 s - in org.apache.poi.xssf.usermodel.TestXSSFChartSheet
[INFO] Running org.apache.poi.xssf.usermodel.helpers.TestXSSFColumnShifting
[INFO] Tests run: 2, Failures: 0, Errors: 0, Skipped: 0, Time elapsed: 0.001 s - in org.apache.poi.xssf.usermodel.helpers.TestXSSFColumnShifting
[INFO] Running org.apache.poi.xssf.usermodel.helpers.TestColumnHelper
[INFO] Tests run: 16, Failures: 0, Errors: 0, Skipped: 0, Time elapsed: 0.03 s - in org.apache.poi.xssf.usermodel.helpers.TestColumnHelper
[INFO] Running org.apache.poi.xssf.usermodel.helpers.TestHeaderFooterHelper
[INFO] Tests run: 2, Failures: 0, Errors: 0, Skipped: 0, Time elapsed: 0 s - in org.apache.poi.xssf.usermodel.helpers.TestHeaderFooterHelper
[INFO] Running org.apache.poi.xssf.usermodel.TestXSSFForkedEvaluator
[INFO] Tests run: 2, Failures: 0, Errors: 0, Skipped: 0, Time elapsed: 0.013 s - in org.apache.poi.xssf.usermodel.TestXSSFForkedEvaluator
[INFO] Running org.apache.poi.xssf.usermodel.TestMultiSheetFormulaEvaluatorOnXSSF
[INFO] Tests run: 2, Failures: 0, Errors: 0, Skipped: 0, Time elapsed: 0 s - in org.apache.poi.xssf.usermodel.TestMultiSheetFormulaEvaluatorOnXSSF
[INFO] Running org.apache.poi.xssf.usermodel.TestMatrixFormulasFromXMLSpreadsheet
[INFO] Tests run: 34, Failures: 0, Errors: 0, Skipped: 0, Time elapsed: 0.176 s - in org.apache.poi.xssf.usermodel.TestMatrixFormulasFromXMLSpreadsheet
[INFO] Running org.apache.poi.xssf.usermodel.TestXSSFSheetShiftRowsAndColumns

TestXSSFSheetShiftRowsAndColumns.setup: mergeArea=org.apache.poi.ss.util.CellRangeAddress [C3:D4]
testShiftOneRowAndTestAddresses: Row 0 col 0 address=A1 cell.address=A1 cell.getR=A1
testShiftOneRowAndTestAddresses: Row 0 col 1 address=B1 cell.address=B1 cell.getR=B1
testShiftOneRowAndTestAddresses: Row 0 col 2 address=C1 cell.address=C1 cell.getR=C1
testShiftOneRowAndTestAddresses: Row 0 col 3 address=D1 cell.address=D1 cell.getR=D1
testShiftOneRowAndTestAddresses: Row 1 is empty
testShiftOneRowAndTestAddresses: Row 2 col 0 address=A3 cell.address=A3 cell.getR=A3
testShiftOneRowAndTestAddresses: Row 3 col 0 address=A4 cell.address=A4 cell.getR=A4
testShiftOneRowAndTestAddresses: Row 4 col 0 address=A5 cell.address=A5 cell.getR=A5
testShiftOneRowAndTestAddresses: finished without error
TestXSSFSheetRemoveTable.cleanup: test file written to <https://ci-builds.apache.org/job/POI/job/POI-DSL-Maven/ws/sonar/ooxml/build/custom-reports-test/testShiftOneRowAndTestAddresses.xlsx>

TestXSSFSheetShiftRowsAndColumns.setup: mergeArea=org.apache.poi.ss.util.CellRangeAddress [C3:D4]
testShiftOneColumnAndTestAddresses: Row 0 col 0 address=A1 cell.address=A1 cell.getR=A1
testShiftOneColumnAndTestAddresses: Cell B1 is empty
testShiftOneColumnAndTestAddresses: Row 0 col 2 address=C1 cell.address=C1 cell.getR=C1
testShiftOneColumnAndTestAddresses: Row 0 col 3 address=D1 cell.address=D1 cell.getR=D1
testShiftOneColumnAndTestAddresses: Row 0 col 4 address=E1 cell.address=E1 cell.getR=E1
testShiftOneColumnAndTestAddresses: Row 1 col 0 address=A2 cell.address=A2 cell.getR=A2
testShiftOneColumnAndTestAddresses: Cell B2 is empty
testShiftOneColumnAndTestAddresses: Row 2 col 0 address=A3 cell.address=A3 cell.getR=A3
testShiftOneColumnAndTestAddresses: Cell B3 is empty
testShiftOneColumnAndTestAddresses: Row 3 col 0 address=A4 cell.address=A4 cell.getR=A4
testShiftOneColumnAndTestAddresses: Cell B4 is empty
testShiftOneColumnAndTestAddresses: finished without error
TestXSSFSheetRemoveTable.cleanup: test file written to <https://ci-builds.apache.org/job/POI/job/POI-DSL-Maven/ws/sonar/ooxml/build/custom-reports-test/testShiftOneColumnAndTestAddresses.xlsx>

TestXSSFSheetShiftRowsAndColumns.setup: mergeArea=org.apache.poi.ss.util.CellRangeAddress [C3:D4]
testNoShift: Row 0 col 0 address=A1 cell.address=A1 cell.getR=A1
testNoShift: Row 0 col 1 address=B1 cell.address=B1 cell.getR=B1
testNoShift: Row 0 col 2 address=C1 cell.address=C1 cell.getR=C1
testNoShift: Row 0 col 3 address=D1 cell.address=D1 cell.getR=D1
testNoShift: Row 1 col 0 address=A2 cell.address=A2 cell.getR=A2
testNoShift: Row 2 col 0 address=A3 cell.address=A3 cell.getR=A3
testNoShift: Row 3 col 0 address=A4 cell.address=A4 cell.getR=A4
testNoShift: finished without error
TestXSSFSheetRemoveTable.cleanup: test file written to <https://ci-builds.apache.org/job/POI/job/POI-DSL-Maven/ws/sonar/ooxml/build/custom-reports-test/testNoShift.xlsx>
[WARNING] Tests run: 5, Failures: 0, Errors: 0, Skipped: 2, Time elapsed: 0.03 s - in org.apache.poi.xssf.usermodel.TestXSSFSheetShiftRowsAndColumns
[INFO] Running org.apache.poi.xssf.usermodel.TestXSSFVMLDrawing
[INFO] Tests run: 4, Failures: 0, Errors: 0, Skipped: 0, Time elapsed: 0.054 s - in org.apache.poi.xssf.usermodel.TestXSSFVMLDrawing
[INFO] Running org.apache.poi.xssf.usermodel.TestXSSFColor
[INFO] Tests run: 4, Failures: 0, Errors: 0, Skipped: 0, Time elapsed: 0.062 s - in org.apache.poi.xssf.usermodel.TestXSSFColor
[INFO] Running org.apache.poi.xssf.usermodel.extensions.TestXSSFCellFill
[INFO] Tests run: 6, Failures: 0, Errors: 0, Skipped: 0, Time elapsed: 0.029 s - in org.apache.poi.xssf.usermodel.extensions.TestXSSFCellFill
[INFO] Running org.apache.poi.xssf.usermodel.extensions.TestXSSFBorder
[INFO] Tests run: 1, Failures: 0, Errors: 0, Skipped: 0, Time elapsed: 0.002 s - in org.apache.poi.xssf.usermodel.extensions.TestXSSFBorder
[INFO] Running org.apache.poi.xssf.usermodel.extensions.XSSFCellBorderTest
[INFO] Tests run: 6, Failures: 0, Errors: 0, Skipped: 0, Time elapsed: 0.024 s - in org.apache.poi.xssf.usermodel.extensions.XSSFCellBorderTest
[INFO] Running org.apache.poi.xssf.usermodel.extensions.TestXSSFHeaderFooter
[INFO] Tests run: 10, Failures: 0, Errors: 0, Skipped: 0, Time elapsed: 0.039 s - in org.apache.poi.xssf.usermodel.extensions.TestXSSFHeaderFooter
[INFO] Running org.apache.poi.xssf.usermodel.TestXSSFChart
[INFO] Tests run: 3, Failures: 0, Errors: 0, Skipped: 0, Time elapsed: 0.081 s - in org.apache.poi.xssf.usermodel.TestXSSFChart
[INFO] Running org.apache.poi.xssf.usermodel.TestXSSFTableColumn
[INFO] Tests run: 3, Failures: 0, Errors: 0, Skipped: 0, Time elapsed: 0.056 s - in org.apache.poi.xssf.usermodel.TestXSSFTableColumn
[INFO] Running org.apache.poi.xssf.usermodel.TestXSSFOddHeader
[INFO] Tests run: 1, Failures: 0, Errors: 0, Skipped: 0, Time elapsed: 0.002 s - in org.apache.poi.xssf.usermodel.TestXSSFOddHeader
[INFO] Running org.apache.poi.xssf.usermodel.TestXSSFEvaluationSheet
[INFO] Tests run: 2, Failures: 0, Errors: 0, Skipped: 0, Time elapsed: 0.001 s - in org.apache.poi.xssf.usermodel.TestXSSFEvaluationSheet
[INFO] Running org.apache.poi.xssf.usermodel.TestXSSFPicture
[INFO] Tests run: 7, Failures: 0, Errors: 0, Skipped: 0, Time elapsed: 0.273 s - in org.apache.poi.xssf.usermodel.TestXSSFPicture
[INFO] Running org.apache.poi.xssf.usermodel.TestXSSFSimpleShape
[INFO] Tests run: 1, Failures: 0, Errors: 0, Skipped: 0, Time elapsed: 0.016 s - in org.apache.poi.xssf.usermodel.TestXSSFSimpleShape
[INFO] Running org.apache.poi.xssf.usermodel.TestSheetHiding
[INFO] Tests run: 5, Failures: 0, Errors: 0, Skipped: 0, Time elapsed: 0.078 s - in org.apache.poi.xssf.usermodel.TestSheetHiding
[INFO] Running org.apache.poi.xssf.usermodel.TestXSSFPrintSetup
[INFO] Tests run: 19, Failures: 0, Errors: 0, Skipped: 0, Time elapsed: 0.022 s - in org.apache.poi.xssf.usermodel.TestXSSFPrintSetup
[INFO] Running org.apache.poi.xssf.usermodel.TestXSSFFont
[INFO] Tests run: 23, Failures: 0, Errors: 0, Skipped: 0, Time elapsed: 0.058 s - in org.apache.poi.xssf.usermodel.TestXSSFFont
[INFO] Running org.apache.poi.xssf.usermodel.TestXSSFDataValidation
[INFO] Tests run: 9, Failures: 0, Errors: 0, Skipped: 0, Time elapsed: 0.432 s - in org.apache.poi.xssf.usermodel.TestXSSFDataValidation
[INFO] Running org.apache.poi.xssf.usermodel.TestXSSFFirstHeader
[INFO] Tests run: 1, Failures: 0, Errors: 0, Skipped: 0, Time elapsed: 0.002 s - in org.apache.poi.xssf.usermodel.TestXSSFFirstHeader
[INFO] Running org.apache.poi.xssf.usermodel.TestMissingWorkbookOnXSSF
[INFO] Tests run: 3, Failures: 0, Errors: 0, Skipped: 0, Time elapsed: 0.023 s - in org.apache.poi.xssf.usermodel.TestMissingWorkbookOnXSSF
[INFO] Running org.apache.poi.xssf.usermodel.TestTableStyles
[INFO] Tests run: 2, Failures: 0, Errors: 0, Skipped: 0, Time elapsed: 0.421 s - in org.apache.poi.xssf.usermodel.TestTableStyles
[INFO] Running org.apache.poi.xssf.usermodel.TestXSSFBugs
[Fatal Error] :1:1: JAXP00010001: The parser has encountered more than "1" entity expansions in this document; this is the limit imposed by the JDK.
[WARNING] Tests run: 157, Failures: 0, Errors: 0, Skipped: 8, Time elapsed: 18.726 s - in org.apache.poi.xssf.usermodel.TestXSSFBugs
[INFO] Running org.apache.poi.xssf.usermodel.TestXSSFHeaderFooterProperties
[INFO] Tests run: 8, Failures: 0, Errors: 0, Skipped: 0, Time elapsed: 0.012 s - in org.apache.poi.xssf.usermodel.TestXSSFHeaderFooterProperties
[INFO] Running org.apache.poi.xssf.usermodel.TestXSSFRichTextString
[INFO] Tests run: 20, Failures: 0, Errors: 0, Skipped: 0, Time elapsed: 0.026 s - in org.apache.poi.xssf.usermodel.TestXSSFRichTextString
[INFO] Running org.apache.poi.xssf.TestXSSFCloneSheet
[INFO] Tests run: 8, Failures: 0, Errors: 0, Skipped: 0, Time elapsed: 0.121 s - in org.apache.poi.xssf.TestXSSFCloneSheet
[INFO] Running org.apache.poi.xssf.util.TestEvilUnclosedBRFixingInputStream
[INFO] Tests run: 3, Failures: 0, Errors: 0, Skipped: 0, Time elapsed: 0.001 s - in org.apache.poi.xssf.util.TestEvilUnclosedBRFixingInputStream
[INFO] Running org.apache.poi.xssf.util.TestCTColComparator
[INFO] Tests run: 2, Failures: 0, Errors: 0, Skipped: 0, Time elapsed: 0 s - in org.apache.poi.xssf.util.TestCTColComparator
[INFO] Running org.apache.poi.xssf.util.TestNumericRanges
[INFO] Tests run: 2, Failures: 0, Errors: 0, Skipped: 0, Time elapsed: 0 s - in org.apache.poi.xssf.util.TestNumericRanges
[INFO] Running org.apache.poi.xssf.TestXSSFOffset
[INFO] Tests run: 1, Failures: 0, Errors: 0, Skipped: 0, Time elapsed: 0 s - in org.apache.poi.xssf.TestXSSFOffset
[INFO] Running org.apache.poi.xssf.eventusermodel.TestXSSFReader
[WARNING] Tests run: 14, Failures: 0, Errors: 0, Skipped: 1, Time elapsed: 0.041 s - in org.apache.poi.xssf.eventusermodel.TestXSSFReader
[INFO] Running org.apache.poi.xssf.eventusermodel.TestXSSFBReader
[INFO] Tests run: 4, Failures: 0, Errors: 0, Skipped: 0, Time elapsed: 0.02 s - in org.apache.poi.xssf.eventusermodel.TestXSSFBReader
[INFO] Running org.apache.poi.xssf.eventusermodel.TestReadOnlySharedStringsTable
[INFO] Tests run: 4, Failures: 0, Errors: 0, Skipped: 0, Time elapsed: 0.01 s - in org.apache.poi.xssf.eventusermodel.TestReadOnlySharedStringsTable
[INFO] Running org.apache.poi.xssf.extractor.TestXSSFBEventBasedExcelExtractor
[INFO] Tests run: 4, Failures: 0, Errors: 0, Skipped: 0, Time elapsed: 0.034 s - in org.apache.poi.xssf.extractor.TestXSSFBEventBasedExcelExtractor
[INFO] Running org.apache.poi.xssf.extractor.TestXSSFExcelExtractor
[INFO] Tests run: 8, Failures: 0, Errors: 0, Skipped: 0, Time elapsed: 0.352 s - in org.apache.poi.xssf.extractor.TestXSSFExcelExtractor
[INFO] Running org.apache.poi.xssf.extractor.TestXSSFImportFromXML
[INFO] Tests run: 5, Failures: 0, Errors: 0, Skipped: 0, Time elapsed: 8.029 s - in org.apache.poi.xssf.extractor.TestXSSFImportFromXML
[INFO] Running org.apache.poi.xssf.extractor.TestXSSFExcelExtractorUsingFactory
[INFO] Tests run: 8, Failures: 0, Errors: 0, Skipped: 0, Time elapsed: 0.321 s - in org.apache.poi.xssf.extractor.TestXSSFExcelExtractorUsingFactory
[INFO] Running org.apache.poi.xssf.extractor.TestXSSFEventBasedExcelExtractor
[INFO] Tests run: 12, Failures: 0, Errors: 0, Skipped: 0, Time elapsed: 0.23 s - in org.apache.poi.xssf.extractor.TestXSSFEventBasedExcelExtractor
[INFO] Running org.apache.poi.xssf.extractor.TestXSSFExportToXML
[WARNING] Tests run: 18, Failures: 0, Errors: 0, Skipped: 1, Time elapsed: 0.357 s - in org.apache.poi.xssf.extractor.TestXSSFExportToXML
[INFO] Running org.apache.poi.xssf.extractor.TestXSSFEventBasedExcelExtractorUsingFactory
[INFO] Tests run: 12, Failures: 0, Errors: 0, Skipped: 0, Time elapsed: 0.206 s - in org.apache.poi.xssf.extractor.TestXSSFEventBasedExcelExtractorUsingFactory
[INFO] Running org.apache.poi.xssf.streaming.TestSXSSFRow
[WARNING] Tests run: 14, Failures: 0, Errors: 0, Skipped: 2, Time elapsed: 0.274 s - in org.apache.poi.xssf.streaming.TestSXSSFRow
[INFO] Running org.apache.poi.xssf.streaming.TestSXSSFCell
[WARNING] Tests run: 60, Failures: 0, Errors: 0, Skipped: 4, Time elapsed: 0.63 s - in org.apache.poi.xssf.streaming.TestSXSSFCell
[INFO] Running org.apache.poi.xssf.streaming.TestSXSSFDataValidation
[INFO] Tests run: 2, Failures: 0, Errors: 0, Skipped: 0, Time elapsed: 0.059 s - in org.apache.poi.xssf.streaming.TestSXSSFDataValidation
[INFO] Running org.apache.poi.xssf.streaming.TestSheetDataWriter
[INFO] Tests run: 3, Failures: 0, Errors: 0, Skipped: 0, Time elapsed: 0 s - in org.apache.poi.xssf.streaming.TestSheetDataWriter
[INFO] Running org.apache.poi.xssf.streaming.TestOutlining
[INFO] Tests run: 6, Failures: 0, Errors: 0, Skipped: 0, Time elapsed: 0.078 s - in org.apache.poi.xssf.streaming.TestOutlining
[INFO] Running org.apache.poi.xssf.streaming.TestSXSSFHyperlink
[INFO] Tests run: 2, Failures: 0, Errors: 0, Skipped: 0, Time elapsed: 0.032 s - in org.apache.poi.xssf.streaming.TestSXSSFHyperlink
[INFO] Running org.apache.poi.xssf.streaming.TestAutoSizeColumnTracker
[INFO] Tests run: 8, Failures: 0, Errors: 0, Skipped: 0, Time elapsed: 0.057 s - in org.apache.poi.xssf.streaming.TestAutoSizeColumnTracker
[INFO] Running org.apache.poi.xssf.streaming.TestSXSSFUnicodeSurrogates
[INFO] Tests run: 1, Failures: 0, Errors: 0, Skipped: 0, Time elapsed: 0.043 s - in org.apache.poi.xssf.streaming.TestSXSSFUnicodeSurrogates
[INFO] Running org.apache.poi.xssf.streaming.TestSXSSFSheet
[INFO] Tests run: 50, Failures: 0, Errors: 0, Skipped: 0, Time elapsed: 0.564 s - in org.apache.poi.xssf.streaming.TestSXSSFSheet
[INFO] Running org.apache.poi.xssf.streaming.TestSXSSFFormulaEvaluation
[WARNING] Tests run: 29, Failures: 0, Errors: 0, Skipped: 1, Time elapsed: 0.707 s - in org.apache.poi.xssf.streaming.TestSXSSFFormulaEvaluation
[INFO] Running org.apache.poi.xssf.streaming.TestSXSSFSheetAutoSizeColumn
[INFO] Tests run: 26, Failures: 0, Errors: 0, Skipped: 0, Time elapsed: 0.213 s - in org.apache.poi.xssf.streaming.TestSXSSFSheetAutoSizeColumn
[INFO] Running org.apache.poi.xssf.streaming.TestSXSSFEvaluationSheet
[INFO] Tests run: 1, Failures: 0, Errors: 0, Skipped: 0, Time elapsed: 0.001 s - in org.apache.poi.xssf.streaming.TestSXSSFEvaluationSheet
[INFO] Running org.apache.poi.xssf.streaming.TestSXSSFWorkbookWithCustomZipEntrySource
[INFO] Tests run: 3, Failures: 0, Errors: 0, Skipped: 0, Time elapsed: 0.081 s - in org.apache.poi.xssf.streaming.TestSXSSFWorkbookWithCustomZipEntrySource
[INFO] Running org.apache.poi.xssf.streaming.TestSXSSFWorkbook
[WARNING] Tests run: 37, Failures: 0, Errors: 0, Skipped: 4, Time elapsed: 1.057 s - in org.apache.poi.xssf.streaming.TestSXSSFWorkbook
[INFO] Running org.apache.poi.xssf.streaming.TestDeferredSXSSFWorkbook
[WARNING] Tests run: 31, Failures: 0, Errors: 0, Skipped: 3, Time elapsed: 0.607 s - in org.apache.poi.xssf.streaming.TestDeferredSXSSFWorkbook
[INFO] Running org.apache.poi.xssf.TestNecessaryOOXMLClasses
[INFO] Tests run: 1, Failures: 0, Errors: 0, Skipped: 0, Time elapsed: 0 s - in org.apache.poi.xssf.TestNecessaryOOXMLClasses
[INFO] Running org.apache.poi.xssf.model.TestCalculationChain
[INFO] Tests run: 1, Failures: 0, Errors: 0, Skipped: 0, Time elapsed: 0.224 s - in org.apache.poi.xssf.model.TestCalculationChain
[INFO] Running org.apache.poi.xssf.model.TestSharedStringsTable
[INFO] Tests run: 4, Failures: 0, Errors: 0, Skipped: 0, Time elapsed: 0.063 s - in org.apache.poi.xssf.model.TestSharedStringsTable
[INFO] Running org.apache.poi.xssf.model.TestExternalLinksTable
[INFO] Tests run: 4, Failures: 0, Errors: 0, Skipped: 0, Time elapsed: 0.055 s - in org.apache.poi.xssf.model.TestExternalLinksTable
[INFO] Running org.apache.poi.xssf.model.TestMapInfo
[INFO] Tests run: 1, Failures: 0, Errors: 0, Skipped: 0, Time elapsed: 0.006 s - in org.apache.poi.xssf.model.TestMapInfo
[INFO] Running org.apache.poi.xssf.model.TestCommentsTable
[INFO] Tests run: 7, Failures: 0, Errors: 0, Skipped: 0, Time elapsed: 0.059 s - in org.apache.poi.xssf.model.TestCommentsTable
[INFO] Running org.apache.poi.xssf.model.TestStylesTable
[INFO] Tests run: 13, Failures: 0, Errors: 0, Skipped: 0, Time elapsed: 0.149 s - in org.apache.poi.xssf.model.TestStylesTable
[INFO] Running org.apache.poi.xssf.model.TestThemesTable
[INFO] Tests run: 3, Failures: 0, Errors: 0, Skipped: 0, Time elapsed: 0.061 s - in org.apache.poi.xssf.model.TestThemesTable
[INFO] Running org.apache.poi.xssf.TestSheetProtection
[INFO] Tests run: 17, Failures: 0, Errors: 0, Skipped: 0, Time elapsed: 0.08 s - in org.apache.poi.xssf.TestSheetProtection
[INFO] Running org.apache.poi.xddf.usermodel.TestXDDFColor
[INFO] Tests run: 5, Failures: 0, Errors: 0, Skipped: 0, Time elapsed: 0.032 s - in org.apache.poi.xddf.usermodel.TestXDDFColor
[INFO] Running org.apache.poi.xddf.usermodel.TestNecessaryOOXMLClasses
[INFO] Tests run: 1, Failures: 0, Errors: 0, Skipped: 0, Time elapsed: 0.169 s - in org.apache.poi.xddf.usermodel.TestNecessaryOOXMLClasses
[INFO] Running org.apache.poi.xddf.usermodel.text.TestXDDFTextBodyProperties
[INFO] Tests run: 1, Failures: 0, Errors: 0, Skipped: 0, Time elapsed: 0.001 s - in org.apache.poi.xddf.usermodel.text.TestXDDFTextBodyProperties
[INFO] Running org.apache.poi.xddf.usermodel.text.TestXDDFTextRun
[INFO] Tests run: 3, Failures: 0, Errors: 0, Skipped: 0, Time elapsed: 0.055 s - in org.apache.poi.xddf.usermodel.text.TestXDDFTextRun
[INFO] Running org.apache.poi.xddf.usermodel.chart.TestXDDFChart
[INFO] Tests run: 2, Failures: 0, Errors: 0, Skipped: 0, Time elapsed: 0 s - in org.apache.poi.xddf.usermodel.chart.TestXDDFChart
[INFO] Running org.apache.poi.xddf.usermodel.chart.TestXDDFChartRemoveSeries
testDontRemoveSeries: test file written to <https://ci-builds.apache.org/job/POI/job/POI-DSL-Maven/ws/sonar/ooxml/build/custom-reports-test/testDontRemoveSeries.xlsx>
testBugFixRemoveSeries0: test file written to <https://ci-builds.apache.org/job/POI/job/POI-DSL-Maven/ws/sonar/ooxml/build/custom-reports-test/testBugFixRemoveSeries0.xlsx>
testBugFixRemoveSeries1: test file written to <https://ci-builds.apache.org/job/POI/job/POI-DSL-Maven/ws/sonar/ooxml/build/custom-reports-test/testBugFixRemoveSeries1.xlsx>
testRemoveSeries0: test file written to <https://ci-builds.apache.org/job/POI/job/POI-DSL-Maven/ws/sonar/ooxml/build/custom-reports-test/testRemoveSeries0.xlsx>
[INFO] Tests run: 4, Failures: 0, Errors: 0, Skipped: 0, Time elapsed: 0.042 s - in org.apache.poi.xddf.usermodel.chart.TestXDDFChartRemoveSeries
[INFO] Running org.apache.poi.xddf.usermodel.chart.TestXDDFChartExtensionList
[INFO] Tests run: 1, Failures: 0, Errors: 0, Skipped: 0, Time elapsed: 0.004 s - in org.apache.poi.xddf.usermodel.chart.TestXDDFChartExtensionList
[INFO] Running org.apache.poi.xddf.usermodel.chart.TestXDDFDataSourcesFactory
[INFO] Tests run: 6, Failures: 0, Errors: 0, Skipped: 0, Time elapsed: 0.007 s - in org.apache.poi.xddf.usermodel.chart.TestXDDFDataSourcesFactory
[INFO]
[INFO] Results:
[INFO]
[ERROR] Errors:
[ERROR]   TestSignatureInfo.testSignatureImage:875->initKeyPair:1012->initKeyPair:1051 » FileNotFound
[INFO]
[ERROR] Tests run: 2720, Failures: 0, Errors: 1, Skipped: 147
[INFO]
[INFO] ------------------------------------------------------------------------
[INFO] Reactor Summary for Apache POI - the Java API for Microsoft Documents 5.0.0-SNAPSHOT:
[INFO]
[INFO] Apache POI - the Java API for Microsoft Documents .. SUCCESS [ 10.288 s]
[INFO] Apache POI Main package ............................ SUCCESS [03:56 min]
[INFO] Apache POI Scratchpad package ...................... SUCCESS [ 26.681 s]
[INFO] Apache POI - Openxmlformats Schema package ......... SUCCESS [01:13 min]
[INFO] Apache POI OOXML package ........................... FAILURE [04:20 min]
[INFO] Apache POI ExcelAnt package ........................ SKIPPED
[INFO] Apache POI Examples package ........................ SKIPPED
[INFO] Apache POI integration test ........................ SKIPPED
[INFO] ------------------------------------------------------------------------
[INFO] BUILD FAILURE
[INFO] ------------------------------------------------------------------------
[INFO] Total time:  10:07 min
[INFO] Finished at: 2020-10-24T00:56:46Z
[INFO] ------------------------------------------------------------------------
[ERROR] Failed to execute goal org.apache.maven.plugins:maven-surefire-plugin:3.0.0-M5:test (default-test) on project poi-ooxml: There are test failures.
[ERROR]
[ERROR] Please refer to <https://ci-builds.apache.org/job/POI/job/POI-DSL-Maven/ws/sonar/ooxml/target/surefire-reports> for the individual test results.
[ERROR] Please refer to dump files (if any exist) [date].dump, [date]-jvmRun[N].dump and [date].dumpstream.
[ERROR] -> [Help 1]
[ERROR]
[ERROR] To see the full stack trace of the errors, re-run Maven with the -e switch.
[ERROR] Re-run Maven using the -X switch to enable full debug logging.
[ERROR]
[ERROR] For more information about the errors and possible solutions, please read the following articles:
[ERROR] [Help 1] http://cwiki.apache.org/confluence/display/MAVEN/MojoFailureException
[ERROR]
[ERROR] After correcting the problems, you can resume the build with the command
[ERROR]   mvn <args> -rf :poi-ooxml
Build step 'Invoke top-level Maven targets' marked build as failure
Recording test results

---------------------------------------------------------------------
To unsubscribe, e-mail: [hidden email]
For additional commands, e-mail: [hidden email]

Reply | Threaded
Open this post in threaded view
|

Jenkins build is back to normal : POI » POI-DSL-Maven #45

Apache Jenkins Server
See <https://ci-builds.apache.org/job/POI/job/POI-DSL-Maven/45/display/redirect?page=changes>


---------------------------------------------------------------------
To unsubscribe, e-mail: [hidden email]
For additional commands, e-mail: [hidden email]