Build failed in Jenkins: POI » POI-DSL-Maven #223

classic Classic list List threaded Threaded
2 messages Options
Reply | Threaded
Open this post in threaded view
|

Build failed in Jenkins: POI » POI-DSL-Maven #223

Apache Jenkins Server
See <https://ci-builds.apache.org/job/POI/job/POI-DSL-Maven/223/display/redirect?page=changes>

Changes:

[Andreas Beeker] 65206 - Migrate ant / maven to gradle build
update gradle files and project structure along https://github.com/centic9/poi/tree/gradle_build
remove eclipse IDE project files
remove obsolete record generator files


------------------------------------------
[...truncated 2.45 MB...]
        at sun.reflect.NativeMethodAccessorImpl.invoke0(Native Method) ~[?:1.8.0_281]
        at sun.reflect.NativeMethodAccessorImpl.invoke(NativeMethodAccessorImpl.java:62) ~[?:1.8.0_281]
        at sun.reflect.DelegatingMethodAccessorImpl.invoke(DelegatingMethodAccessorImpl.java:43) ~[?:1.8.0_281]
        at java.lang.reflect.Method.invoke(Method.java:498) ~[?:1.8.0_281]
        at org.junit.platform.commons.util.ReflectionUtils.invokeMethod(ReflectionUtils.java:688) ~[junit-platform-commons-1.7.0.jar:1.7.0]
        at org.junit.jupiter.engine.execution.MethodInvocation.proceed(MethodInvocation.java:60) ~[junit-jupiter-engine-5.7.0.jar:5.7.0]
        at org.junit.jupiter.engine.execution.InvocationInterceptorChain$ValidatingInvocation.proceed(InvocationInterceptorChain.java:131) ~[junit-jupiter-engine-5.7.0.jar:5.7.0]
        at org.junit.jupiter.engine.extension.TimeoutExtension.intercept(TimeoutExtension.java:149) ~[junit-jupiter-engine-5.7.0.jar:5.7.0]
        at org.junit.jupiter.engine.extension.TimeoutExtension.interceptTestableMethod(TimeoutExtension.java:140) ~[junit-jupiter-engine-5.7.0.jar:5.7.0]
        at org.junit.jupiter.engine.extension.TimeoutExtension.interceptTestMethod(TimeoutExtension.java:84) ~[junit-jupiter-engine-5.7.0.jar:5.7.0]
        at org.junit.jupiter.engine.execution.ExecutableInvoker$ReflectiveInterceptorCall.lambda$ofVoidMethod$0(ExecutableInvoker.java:115) ~[junit-jupiter-engine-5.7.0.jar:5.7.0]
        at org.junit.jupiter.engine.execution.ExecutableInvoker.lambda$invoke$0(ExecutableInvoker.java:105) ~[junit-jupiter-engine-5.7.0.jar:5.7.0]
        at org.junit.jupiter.engine.execution.InvocationInterceptorChain$InterceptedInvocation.proceed(InvocationInterceptorChain.java:106) ~[junit-jupiter-engine-5.7.0.jar:5.7.0]
        at org.junit.jupiter.engine.execution.InvocationInterceptorChain.proceed(InvocationInterceptorChain.java:64) ~[junit-jupiter-engine-5.7.0.jar:5.7.0]
        at org.junit.jupiter.engine.execution.InvocationInterceptorChain.chainAndInvoke(InvocationInterceptorChain.java:45) ~[junit-jupiter-engine-5.7.0.jar:5.7.0]
        at org.junit.jupiter.engine.execution.InvocationInterceptorChain.invoke(InvocationInterceptorChain.java:37) ~[junit-jupiter-engine-5.7.0.jar:5.7.0]
        at org.junit.jupiter.engine.execution.ExecutableInvoker.invoke(ExecutableInvoker.java:104) ~[junit-jupiter-engine-5.7.0.jar:5.7.0]
        at org.junit.jupiter.engine.execution.ExecutableInvoker.invoke(ExecutableInvoker.java:98) ~[junit-jupiter-engine-5.7.0.jar:5.7.0]
        at org.junit.jupiter.engine.descriptor.TestMethodTestDescriptor.lambda$invokeTestMethod$6(TestMethodTestDescriptor.java:210) ~[junit-jupiter-engine-5.7.0.jar:5.7.0]
        at org.junit.platform.engine.support.hierarchical.ThrowableCollector.execute(ThrowableCollector.java:73) ~[junit-platform-engine-1.7.0.jar:1.7.0]
        at org.junit.jupiter.engine.descriptor.TestMethodTestDescriptor.invokeTestMethod(TestMethodTestDescriptor.java:206) ~[junit-jupiter-engine-5.7.0.jar:5.7.0]
        at org.junit.jupiter.engine.descriptor.TestMethodTestDescriptor.execute(TestMethodTestDescriptor.java:131) ~[junit-jupiter-engine-5.7.0.jar:5.7.0]
        at org.junit.jupiter.engine.descriptor.TestMethodTestDescriptor.execute(TestMethodTestDescriptor.java:65) ~[junit-jupiter-engine-5.7.0.jar:5.7.0]
        at org.junit.platform.engine.support.hierarchical.NodeTestTask.lambda$executeRecursively$5(NodeTestTask.java:139) ~[junit-platform-engine-1.7.0.jar:1.7.0]
        at org.junit.platform.engine.support.hierarchical.ThrowableCollector.execute(ThrowableCollector.java:73) ~[junit-platform-engine-1.7.0.jar:1.7.0]
        at org.junit.platform.engine.support.hierarchical.NodeTestTask.lambda$executeRecursively$7(NodeTestTask.java:129) ~[junit-platform-engine-1.7.0.jar:1.7.0]
        at org.junit.platform.engine.support.hierarchical.Node.around(Node.java:137) ~[junit-platform-engine-1.7.0.jar:1.7.0]
        at org.junit.platform.engine.support.hierarchical.NodeTestTask.lambda$executeRecursively$8(NodeTestTask.java:127) ~[junit-platform-engine-1.7.0.jar:1.7.0]
        at org.junit.platform.engine.support.hierarchical.ThrowableCollector.execute(ThrowableCollector.java:73) ~[junit-platform-engine-1.7.0.jar:1.7.0]
        at org.junit.platform.engine.support.hierarchical.NodeTestTask.executeRecursively(NodeTestTask.java:126) ~[junit-platform-engine-1.7.0.jar:1.7.0]
        at org.junit.platform.engine.support.hierarchical.NodeTestTask.execute(NodeTestTask.java:84) ~[junit-platform-engine-1.7.0.jar:1.7.0]
        at java.util.ArrayList.forEach(ArrayList.java:1259) ~[?:1.8.0_281]
        at org.junit.platform.engine.support.hierarchical.SameThreadHierarchicalTestExecutorService.invokeAll(SameThreadHierarchicalTestExecutorService.java:38) ~[junit-platform-engine-1.7.0.jar:1.7.0]
        at org.junit.platform.engine.support.hierarchical.NodeTestTask.lambda$executeRecursively$5(NodeTestTask.java:143) ~[junit-platform-engine-1.7.0.jar:1.7.0]
        at org.junit.platform.engine.support.hierarchical.ThrowableCollector.execute(ThrowableCollector.java:73) ~[junit-platform-engine-1.7.0.jar:1.7.0]
        at org.junit.platform.engine.support.hierarchical.NodeTestTask.lambda$executeRecursively$7(NodeTestTask.java:129) ~[junit-platform-engine-1.7.0.jar:1.7.0]
        at org.junit.platform.engine.support.hierarchical.Node.around(Node.java:137) ~[junit-platform-engine-1.7.0.jar:1.7.0]
        at org.junit.platform.engine.support.hierarchical.NodeTestTask.lambda$executeRecursively$8(NodeTestTask.java:127) ~[junit-platform-engine-1.7.0.jar:1.7.0]
        at org.junit.platform.engine.support.hierarchical.ThrowableCollector.execute(ThrowableCollector.java:73) ~[junit-platform-engine-1.7.0.jar:1.7.0]
        at org.junit.platform.engine.support.hierarchical.NodeTestTask.executeRecursively(NodeTestTask.java:126) ~[junit-platform-engine-1.7.0.jar:1.7.0]
        at org.junit.platform.engine.support.hierarchical.NodeTestTask.execute(NodeTestTask.java:84) ~[junit-platform-engine-1.7.0.jar:1.7.0]
        at java.util.ArrayList.forEach(ArrayList.java:1259) ~[?:1.8.0_281]
        at org.junit.platform.engine.support.hierarchical.SameThreadHierarchicalTestExecutorService.invokeAll(SameThreadHierarchicalTestExecutorService.java:38) ~[junit-platform-engine-1.7.0.jar:1.7.0]
        at org.junit.platform.engine.support.hierarchical.NodeTestTask.lambda$executeRecursively$5(NodeTestTask.java:143) ~[junit-platform-engine-1.7.0.jar:1.7.0]
        at org.junit.platform.engine.support.hierarchical.ThrowableCollector.execute(ThrowableCollector.java:73) ~[junit-platform-engine-1.7.0.jar:1.7.0]
        at org.junit.platform.engine.support.hierarchical.NodeTestTask.lambda$executeRecursively$7(NodeTestTask.java:129) ~[junit-platform-engine-1.7.0.jar:1.7.0]
        at org.junit.platform.engine.support.hierarchical.Node.around(Node.java:137) ~[junit-platform-engine-1.7.0.jar:1.7.0]
        at org.junit.platform.engine.support.hierarchical.NodeTestTask.lambda$executeRecursively$8(NodeTestTask.java:127) ~[junit-platform-engine-1.7.0.jar:1.7.0]
        at org.junit.platform.engine.support.hierarchical.ThrowableCollector.execute(ThrowableCollector.java:73) ~[junit-platform-engine-1.7.0.jar:1.7.0]
        at org.junit.platform.engine.support.hierarchical.NodeTestTask.executeRecursively(NodeTestTask.java:126) ~[junit-platform-engine-1.7.0.jar:1.7.0]
        at org.junit.platform.engine.support.hierarchical.NodeTestTask.execute(NodeTestTask.java:84) ~[junit-platform-engine-1.7.0.jar:1.7.0]
        at org.junit.platform.engine.support.hierarchical.SameThreadHierarchicalTestExecutorService.submit(SameThreadHierarchicalTestExecutorService.java:32) ~[junit-platform-engine-1.7.0.jar:1.7.0]
        at org.junit.platform.engine.support.hierarchical.HierarchicalTestExecutor.execute(HierarchicalTestExecutor.java:57) ~[junit-platform-engine-1.7.0.jar:1.7.0]
        at org.junit.platform.engine.support.hierarchical.HierarchicalTestEngine.execute(HierarchicalTestEngine.java:51) ~[junit-platform-engine-1.7.0.jar:1.7.0]
        at org.junit.platform.launcher.core.EngineExecutionOrchestrator.execute(EngineExecutionOrchestrator.java:108) ~[junit-platform-launcher-1.7.0.jar:1.7.0]
        at org.junit.platform.launcher.core.EngineExecutionOrchestrator.execute(EngineExecutionOrchestrator.java:88) ~[junit-platform-launcher-1.7.0.jar:1.7.0]
        at org.junit.platform.launcher.core.EngineExecutionOrchestrator.lambda$execute$0(EngineExecutionOrchestrator.java:54) ~[junit-platform-launcher-1.7.0.jar:1.7.0]
        at org.junit.platform.launcher.core.EngineExecutionOrchestrator.withInterceptedStreams(EngineExecutionOrchestrator.java:67) [junit-platform-launcher-1.7.0.jar:1.7.0]
        at org.junit.platform.launcher.core.EngineExecutionOrchestrator.execute(EngineExecutionOrchestrator.java:52) [junit-platform-launcher-1.7.0.jar:1.7.0]
        at org.junit.platform.launcher.core.DefaultLauncher.execute(DefaultLauncher.java:96) [junit-platform-launcher-1.7.0.jar:1.7.0]
        at org.junit.platform.launcher.core.DefaultLauncher.execute(DefaultLauncher.java:75) [junit-platform-launcher-1.7.0.jar:1.7.0]
        at org.apache.maven.surefire.junitplatform.JUnitPlatformProvider.execute(JUnitPlatformProvider.java:188) [surefire-junit-platform-3.0.0-M5.jar:3.0.0-M5]
        at org.apache.maven.surefire.junitplatform.JUnitPlatformProvider.invokeAllTests(JUnitPlatformProvider.java:154) [surefire-junit-platform-3.0.0-M5.jar:3.0.0-M5]
        at org.apache.maven.surefire.junitplatform.JUnitPlatformProvider.invoke(JUnitPlatformProvider.java:128) [surefire-junit-platform-3.0.0-M5.jar:3.0.0-M5]
        at org.apache.maven.surefire.booter.ForkedBooter.runSuitesInProcess(ForkedBooter.java:428) [surefire-booter-3.0.0-M5.jar:3.0.0-M5]
        at org.apache.maven.surefire.booter.ForkedBooter.execute(ForkedBooter.java:162) [surefire-booter-3.0.0-M5.jar:3.0.0-M5]
        at org.apache.maven.surefire.booter.ForkedBooter.run(ForkedBooter.java:562) [surefire-booter-3.0.0-M5.jar:3.0.0-M5]
        at org.apache.maven.surefire.booter.ForkedBooter.main(ForkedBooter.java:548) [surefire-booter-3.0.0-M5.jar:3.0.0-M5]
[INFO]
[INFO] --- jacoco-maven-plugin:0.8.6:report (report) @ poi-ooxml ---
[INFO] Loading execution data file <https://ci-builds.apache.org/job/POI/job/POI-DSL-Maven/ws/sonar/ooxml/target/jacoco.exec>
[INFO] Analyzed bundle 'Apache POI OOXML package' with 741 classes
[INFO]
[INFO] --- maven-jar-plugin:2.4:jar (default-jar) @ poi-ooxml ---
[INFO] Building jar: <https://ci-builds.apache.org/job/POI/job/POI-DSL-Maven/ws/sonar/ooxml/target/poi-ooxml-5.0.1-SNAPSHOT.jar>
[INFO]
[INFO] --------------------< org.apache.poi:poi-excelant >---------------------
[INFO] Building Apache POI ExcelAnt package 5.0.1-SNAPSHOT                [6/8]
[INFO] --------------------------------[ jar ]---------------------------------
Downloading from apache-releases-repo: https://repository.apache.org/content/repositories/releases/org/apache/ant/ant/1.10.9/ant-1.10.9.pom
Progress (1): 4.1/17 kBProgress (1): 7.7/17 kBProgress (1): 12/17 kB Progress (1): 16/17 kBProgress (1): 17 kB                      Downloaded from apache-releases-repo: https://repository.apache.org/content/repositories/releases/org/apache/ant/ant/1.10.9/ant-1.10.9.pom (17 kB at 16 kB/s)
Downloading from apache-releases-repo: https://repository.apache.org/content/repositories/releases/org/apache/ant/ant-parent/1.10.9/ant-parent-1.10.9.pom
Progress (1): 4.1/6.5 kBProgress (1): 6.5 kB                        Downloaded from apache-releases-repo: https://repository.apache.org/content/repositories/releases/org/apache/ant/ant-parent/1.10.9/ant-parent-1.10.9.pom (6.5 kB at 15 kB/s)
Downloading from apache-releases-repo: https://repository.apache.org/content/repositories/releases/org/apache/ant/ant-launcher/1.10.9/ant-launcher-1.10.9.pom
Progress (1): 3.2 kB                    Downloaded from apache-releases-repo: https://repository.apache.org/content/repositories/releases/org/apache/ant/ant-launcher/1.10.9/ant-launcher-1.10.9.pom (3.2 kB at 9.4 kB/s)
Downloading from apache-releases-repo: https://repository.apache.org/content/repositories/releases/org/apache/ant/ant/1.10.9/ant-1.10.9.jar
Downloading from apache-releases-repo: https://repository.apache.org/content/repositories/releases/org/apache/ant/ant-launcher/1.10.9/ant-launcher-1.10.9.jar
Progress (1): 0/2.3 MBProgress (1): 0/2.3 MBProgress (1): 0/2.3 MBProgress (1): 0.1/2.3 MBProgress (1): 0.1/2.3 MBProgress (2): 0.1/2.3 MB | 4.1/19 kBProgress (2): 0.1/2.3 MB | 7.7/19 kBProgress (2): 0.1/2.3 MB | 7.7/19 kBProgress (2): 0.1/2.3 MB | 7.7/19 kBProgress (2): 0.1/2.3 MB | 7.7/19 kBProgress (2): 0.1/2.3 MB | 7.7/19 kBProgress (2): 0.1/2.3 MB | 12/19 kB Progress (2): 0.1/2.3 MB | 16/19 kBProgress (2): 0.1/2.3 MB | 19 kB   Progress (2): 0.2/2.3 MB | 19 kBProgress (2): 0.2/2.3 MB | 19 kBProgress (2): 0.2/2.3 MB | 19 kBProgress (2): 0.2/2.3 MB | 19 kBProgress (2): 0.2/2.3 MB | 19 kBProgress (2): 0.2/2.3 MB | 19 kBProgress (2): 0.3/2.3 MB | 19 kBProgress (2): 0.3/2.3 MB | 19 kBProgress (2): 0.3/2.3 MB | 19 kBProgress (2): 0.3/2.3 MB | 19 kBProgress (2): 0.3/2.3 MB | 19 kBProgress (2): 0.3/2.3 MB | 19 kBProgress (2): 0.3/2.3 MB | 19 kB                                Downloaded from apache-releases-repo: https://repository.apache.org/content/repositories/releases/org/apache/ant/ant-launcher/1.10.9/ant-launcher-1.10.9.jar (19 kB at 8.1 kB/s)
Progress (1): 0.3/2.3 MBProgress (1): 0.3/2.3 MBProgress (1): 0.4/2.3 MBProgress (1): 0.4/2.3 MBProgress (1): 0.4/2.3 MBProgress (1): 0.4/2.3 MBProgress (1): 0.4/2.3 MBProgress (1): 0.4/2.3 MBProgress (1): 0.5/2.3 MBProgress (1): 0.5/2.3 MBProgress (1): 0.5/2.3 MBProgress (1): 0.5/2.3 MBProgress (1): 0.5/2.3 MBProgress (1): 0.5/2.3 MBProgress (1): 0.5/2.3 MBProgress (1): 0.6/2.3 MBProgress (1): 0.6/2.3 MBProgress (1): 0.6/2.3 MBProgress (1): 0.6/2.3 MBProgress (1): 0.6/2.3 MBProgress (1): 0.6/2.3 MBProgress (1): 0.6/2.3 MBProgress (1): 0.6/2.3 MBProgress (1): 0.7/2.3 MBProgress (1): 0.7/2.3 MBProgress (1): 0.7/2.3 MBProgress (1): 0.7/2.3 MBProgress (1): 0.7/2.3 MBProgress (1): 0.7/2.3 MBProgress (1): 0.7/2.3 MBProgress (1): 0.8/2.3 MBProgress (1): 0.8/2.3 MBProgress (1): 0.8/2.3 MBProgress (1): 0.8/2.3 MBProgress (1): 0.8/2.3 MBProgress (1): 0.8/2.3 MBProgress (1): 0.9/2.3 MBProgress (1): 0.9/2.3 MBProgress (1): 0.9/2.3 MBProgress (1): 0.9/2.3 MBProgress (1): 0.9/2.3 MBProgress (1): 0.9/2.3 MBProgress (1): 0.9/2.3 MBProgress (1): 0.9/2.3 MBProgress (1): 1.0/2.3 MBProgress (1): 1.0/2.3 MBProgress (1): 1.0/2.3 MBProgress (1): 1.0/2.3 MBProgress (1): 1.0/2.3 MBProgress (1): 1.0/2.3 MBProgress (1): 1.0/2.3 MBProgress (1): 1.0/2.3 MBProgress (1): 1.1/2.3 MBProgress (1): 1.1/2.3 MBProgress (1): 1.1/2.3 MBProgress (1): 1.1/2.3 MBProgress (1): 1.1/2.3 MBProgress (1): 1.1/2.3 MBProgress (1): 1.1/2.3 MBProgress (1): 1.2/2.3 MBProgress (1): 1.2/2.3 MBProgress (1): 1.2/2.3 MBProgress (1): 1.2/2.3 MBProgress (1): 1.2/2.3 MBProgress (1): 1.2/2.3 MBProgress (1): 1.3/2.3 MBProgress (1): 1.3/2.3 MBProgress (1): 1.3/2.3 MBProgress (1): 1.3/2.3 MBProgress (1): 1.3/2.3 MBProgress (1): 1.3/2.3 MBProgress (1): 1.3/2.3 MBProgress (1): 1.3/2.3 MBProgress (1): 1.4/2.3 MBProgress (1): 1.4/2.3 MBProgress (1): 1.4/2.3 MBProgress (1): 1.4/2.3 MBProgress (1): 1.4/2.3 MBProgress (1): 1.4/2.3 MBProgress (1): 1.4/2.3 MBProgress (1): 1.4/2.3 MBProgress (1): 1.5/2.3 MBProgress (1): 1.5/2.3 MBProgress (1): 1.5/2.3 MBProgress (1): 1.5/2.3 MBProgress (1): 1.5/2.3 MBProgress (1): 1.5/2.3 MBProgress (1): 1.6/2.3 MBProgress (1): 1.6/2.3 MBProgress (1): 1.6/2.3 MBProgress (1): 1.6/2.3 MBProgress (1): 1.6/2.3 MBProgress (1): 1.6/2.3 MBProgress (1): 1.6/2.3 MBProgress (1): 1.6/2.3 MBProgress (1): 1.7/2.3 MBProgress (1): 1.7/2.3 MBProgress (1): 1.7/2.3 MBProgress (1): 1.7/2.3 MBProgress (1): 1.7/2.3 MBProgress (1): 1.7/2.3 MBProgress (1): 1.7/2.3 MBProgress (1): 1.7/2.3 MBProgress (1): 1.8/2.3 MBProgress (1): 1.8/2.3 MBProgress (1): 1.8/2.3 MBProgress (1): 1.8/2.3 MBProgress (1): 1.8/2.3 MBProgress (1): 1.8/2.3 MBProgress (1): 1.9/2.3 MBProgress (1): 1.9/2.3 MBProgress (1): 1.9/2.3 MBProgress (1): 1.9/2.3 MBProgress (1): 1.9/2.3 MBProgress (1): 1.9/2.3 MBProgress (1): 1.9/2.3 MBProgress (1): 2.0/2.3 MBProgress (1): 2.0/2.3 MBProgress (1): 2.0/2.3 MBProgress (1): 2.0/2.3 MBProgress (1): 2.0/2.3 MBProgress (1): 2.0/2.3 MBProgress (1): 2.0/2.3 MBProgress (1): 2.0/2.3 MBProgress (1): 2.1/2.3 MBProgress (1): 2.1/2.3 MBProgress (1): 2.1/2.3 MBProgress (1): 2.1/2.3 MBProgress (1): 2.1/2.3 MBProgress (1): 2.1/2.3 MBProgress (1): 2.1/2.3 MBProgress (1): 2.2/2.3 MBProgress (1): 2.2/2.3 MBProgress (1): 2.2/2.3 MBProgress (1): 2.2/2.3 MBProgress (1): 2.2/2.3 MBProgress (1): 2.2/2.3 MBProgress (1): 2.3/2.3 MBProgress (1): 2.3/2.3 MBProgress (1): 2.3 MB                        Downloaded from apache-releases-repo: https://repository.apache.org/content/repositories/releases/org/apache/ant/ant/1.10.9/ant-1.10.9.jar (2.3 MB at 760 kB/s)
[INFO]
[INFO] --- jacoco-maven-plugin:0.8.6:prepare-agent (default) @ poi-excelant ---
[INFO] argLine set to -javaagent:<https://ci-builds.apache.org/job/POI/job/POI-DSL-Maven/ws/.repository/org/jacoco/org.jacoco.agent/0.8.6/org.jacoco.agent-0.8.6-runtime.jar=destfile=/home/jenkins/workspace/POI/POI-DSL-Maven/sonar/excelant/target/jacoco.exec> -Xmx1024m
[INFO]
[INFO] --- maven-resources-plugin:3.2.0:copy-resources (copy-sources) @ poi-excelant ---
[INFO] Using 'UTF-8' encoding to copy filtered resources.
[INFO] Using 'UTF-8' encoding to copy filtered properties files.
[INFO] Copying 14 resources
[INFO]
[INFO] --- maven-resources-plugin:3.2.0:copy-resources (copy-resources) @ poi-excelant ---
[INFO] Using 'UTF-8' encoding to copy filtered resources.
[INFO] Using 'UTF-8' encoding to copy filtered properties files.
[INFO] Copying 1 resource
[INFO] Copying 1 resource
[INFO]
[INFO] --- maven-resources-plugin:3.2.0:resources (default-resources) @ poi-excelant ---
[INFO] Using 'UTF-8' encoding to copy filtered resources.
[INFO] Using 'UTF-8' encoding to copy filtered properties files.
[INFO] Copying 2 resources
[INFO]
[INFO] --- maven-compiler-plugin:3.8.1:compile (default-compile) @ poi-excelant ---
[INFO] Changes detected - recompiling the module!
[INFO] Compiling 14 source files to <https://ci-builds.apache.org/job/POI/job/POI-DSL-Maven/ws/sonar/excelant/target/classes>
[INFO]
[INFO] --- maven-resources-plugin:3.2.0:copy-resources (copy-tests) @ poi-excelant ---
[INFO] Using 'UTF-8' encoding to copy filtered resources.
[INFO] Using 'UTF-8' encoding to copy filtered properties files.
[INFO] Copying 12 resources
[INFO]
[INFO] --- maven-resources-plugin:3.2.0:testResources (default-testResources) @ poi-excelant ---
[INFO] Using 'UTF-8' encoding to copy filtered resources.
[INFO] Using 'UTF-8' encoding to copy filtered properties files.
[INFO] skip non existing resourceDirectory <https://ci-builds.apache.org/job/POI/job/POI-DSL-Maven/ws/sonar/excelant/src/test/resources>
[INFO]
[INFO] --- maven-compiler-plugin:3.8.1:testCompile (default-testCompile) @ poi-excelant ---
[INFO] Changes detected - recompiling the module!
[INFO] Compiling 12 source files to <https://ci-builds.apache.org/job/POI/job/POI-DSL-Maven/ws/sonar/excelant/target/test-classes>
[INFO]
[INFO] --- maven-surefire-plugin:3.0.0-M5:test (default-test) @ poi-excelant ---
ExcelAntEvaluationResult [evaluationCompletedWithError=true, didPass=false, returnValue=0.0, errorMessage=Evaluation failed due to an evaluation error of 42 which is #N/A, actualDelta=0.0, cellName='ErrorCell'!A1]
[INFO]
[INFO] --- jacoco-maven-plugin:0.8.6:report (report) @ poi-excelant ---
[INFO] Loading execution data file <https://ci-builds.apache.org/job/POI/job/POI-DSL-Maven/ws/sonar/excelant/target/jacoco.exec>
[INFO] Analyzed bundle 'Apache POI ExcelAnt package' with 13 classes
[INFO]
[INFO] --- maven-jar-plugin:2.4:jar (default-jar) @ poi-excelant ---
[INFO] Building jar: <https://ci-builds.apache.org/job/POI/job/POI-DSL-Maven/ws/sonar/excelant/target/poi-excelant-5.0.1-SNAPSHOT.jar>
[INFO]
[INFO] --------------------< org.apache.poi:poi-examples >---------------------
[INFO] Building Apache POI Examples package 5.0.1-SNAPSHOT                [7/8]
[INFO] --------------------------------[ jar ]---------------------------------
[INFO]
[INFO] --- jacoco-maven-plugin:0.8.6:prepare-agent (default) @ poi-examples ---
[INFO] argLine set to -javaagent:<https://ci-builds.apache.org/job/POI/job/POI-DSL-Maven/ws/.repository/org/jacoco/org.jacoco.agent/0.8.6/org.jacoco.agent-0.8.6-runtime.jar=destfile=/home/jenkins/workspace/POI/POI-DSL-Maven/sonar/examples/target/jacoco.exec> -Xmx1024m
[INFO]
[INFO] --- maven-resources-plugin:3.2.0:copy-resources (copy-sources) @ poi-examples ---
[INFO] Using 'UTF-8' encoding to copy filtered resources.
[INFO] Using 'UTF-8' encoding to copy filtered properties files.
[INFO] skip non existing resourceDirectory <https://ci-builds.apache.org/job/POI/job/POI-DSL-Maven/ws/sonar/examples/../../src/examples/src>
[INFO]
[INFO] --- maven-resources-plugin:3.2.0:resources (default-resources) @ poi-examples ---
[INFO] Using 'UTF-8' encoding to copy filtered resources.
[INFO] Using 'UTF-8' encoding to copy filtered properties files.
[INFO] skip non existing resourceDirectory <https://ci-builds.apache.org/job/POI/job/POI-DSL-Maven/ws/sonar/examples/src/main/resources>
[INFO]
[INFO] --- maven-compiler-plugin:3.8.1:compile (default-compile) @ poi-examples ---
[INFO] No sources to compile
[INFO]
[INFO] --- maven-resources-plugin:3.2.0:testResources (default-testResources) @ poi-examples ---
[INFO] Not copying test resources
[INFO]
[INFO] --- maven-compiler-plugin:3.8.1:testCompile (default-testCompile) @ poi-examples ---
[INFO] Not compiling test sources
[INFO]
[INFO] --- maven-surefire-plugin:3.0.0-M5:test (default-test) @ poi-examples ---
[INFO] Tests are skipped.
[INFO]
[INFO] --- jacoco-maven-plugin:0.8.6:report (report) @ poi-examples ---
[INFO] Skipping JaCoCo execution due to missing execution data file.
[INFO]
[INFO] --- maven-jar-plugin:2.4:jar (default-jar) @ poi-examples ---
[WARNING] JAR will be empty - no content was marked for inclusion!
[INFO] Building jar: <https://ci-builds.apache.org/job/POI/job/POI-DSL-Maven/ws/sonar/examples/target/poi-examples-5.0.1-SNAPSHOT.jar>
[INFO]
[INFO] ------------------< org.apache.poi:integration-test >-------------------
[INFO] Building Apache POI integration test 5.0.1-SNAPSHOT                [8/8]
[INFO] --------------------------------[ jar ]---------------------------------
Downloading from apache-releases-repo: https://repository.apache.org/content/repositories/releases/org/apache/commons/commons-math3/3.2/commons-math3-3.2.jar
Progress (1): 0/1.7 MBProgress (1): 0/1.7 MBProgress (1): 0/1.7 MBProgress (1): 0/1.7 MBProgress (1): 0/1.7 MBProgress (1): 0/1.7 MBProgress (1): 0.1/1.7 MBProgress (1): 0.1/1.7 MBProgress (1): 0.1/1.7 MBProgress (1): 0.1/1.7 MBProgress (1): 0.1/1.7 MBProgress (1): 0.1/1.7 MBProgress (1): 0.1/1.7 MBProgress (1): 0.1/1.7 MBProgress (1): 0.1/1.7 MBProgress (1): 0.1/1.7 MBProgress (1): 0.1/1.7 MBProgress (1): 0.1/1.7 MBProgress (1): 0.2/1.7 MBProgress (1): 0.2/1.7 MBProgress (1): 0.2/1.7 MBProgress (1): 0.2/1.7 MBProgress (1): 0.2/1.7 MBProgress (1): 0.2/1.7 MBProgress (1): 0.2/1.7 MBProgress (1): 0.2/1.7 MBProgress (1): 0.2/1.7 MBProgress (1): 0.2/1.7 MBProgress (1): 0.2/1.7 MBProgress (1): 0.2/1.7 MBProgress (1): 0.3/1.7 MBProgress (1): 0.3/1.7 MBProgress (1): 0.3/1.7 MBProgress (1): 0.3/1.7 MBProgress (1): 0.3/1.7 MBProgress (1): 0.3/1.7 MBProgress (1): 0.3/1.7 MBProgress (1): 0.3/1.7 MBProgress (1): 0.3/1.7 MBProgress (1): 0.3/1.7 MBProgress (1): 0.3/1.7 MBProgress (1): 0.3/1.7 MBProgress (1): 0.4/1.7 MBProgress (1): 0.4/1.7 MBProgress (1): 0.4/1.7 MBProgress (1): 0.4/1.7 MBProgress (1): 0.4/1.7 MBProgress (1): 0.4/1.7 MBProgress (1): 0.4/1.7 MBProgress (1): 0.4/1.7 MBProgress (1): 0.4/1.7 MBProgress (1): 0.4/1.7 MBProgress (1): 0.4/1.7 MBProgress (1): 0.4/1.7 MBProgress (1): 0.5/1.7 MBProgress (1): 0.5/1.7 MBProgress (1): 0.5/1.7 MBProgress (1): 0.5/1.7 MBProgress (1): 0.5/1.7 MBProgress (1): 0.5/1.7 MBProgress (1): 0.5/1.7 MBProgress (1): 0.5/1.7 MBProgress (1): 0.5/1.7 MBProgress (1): 0.5/1.7 MBProgress (1): 0.5/1.7 MBProgress (1): 0.5/1.7 MBProgress (1): 0.5/1.7 MBProgress (1): 0.6/1.7 MBProgress (1): 0.6/1.7 MBProgress (1): 0.6/1.7 MBProgress (1): 0.6/1.7 MBProgress (1): 0.6/1.7 MBProgress (1): 0.6/1.7 MBProgress (1): 0.6/1.7 MBProgress (1): 0.6/1.7 MBProgress (1): 0.6/1.7 MBProgress (1): 0.6/1.7 MBProgress (1): 0.6/1.7 MBProgress (1): 0.6/1.7 MBProgress (1): 0.7/1.7 MBProgress (1): 0.7/1.7 MBProgress (1): 0.7/1.7 MBProgress (1): 0.7/1.7 MBProgress (1): 0.7/1.7 MBProgress (1): 0.7/1.7 MBProgress (1): 0.7/1.7 MBProgress (1): 0.7/1.7 MBProgress (1): 0.7/1.7 MBProgress (1): 0.7/1.7 MBProgress (1): 0.7/1.7 MBProgress (1): 0.7/1.7 MBProgress (1): 0.8/1.7 MBProgress (1): 0.8/1.7 MBProgress (1): 0.8/1.7 MBProgress (1): 0.8/1.7 MBProgress (1): 0.8/1.7 MBProgress (1): 0.8/1.7 MBProgress (1): 0.8/1.7 MBProgress (1): 0.8/1.7 MBProgress (1): 0.8/1.7 MBProgress (1): 0.8/1.7 MBProgress (1): 0.8/1.7 MBProgress (1): 0.8/1.7 MBProgress (1): 0.9/1.7 MBProgress (1): 0.9/1.7 MBProgress (1): 0.9/1.7 MBProgress (1): 0.9/1.7 MBProgress (1): 0.9/1.7 MBProgress (1): 0.9/1.7 MBProgress (1): 0.9/1.7 MBProgress (1): 0.9/1.7 MBProgress (1): 0.9/1.7 MBProgress (1): 0.9/1.7 MBProgress (1): 0.9/1.7 MBProgress (1): 0.9/1.7 MBProgress (1): 1.0/1.7 MBProgress (1): 1.0/1.7 MBProgress (1): 1.0/1.7 MBProgress (1): 1.0/1.7 MBProgress (1): 1.0/1.7 MBProgress (1): 1.0/1.7 MBProgress (1): 1.0/1.7 MBProgress (1): 1.0/1.7 MBProgress (1): 1.0/1.7 MBProgress (1): 1.0/1.7 MBProgress (1): 1.0/1.7 MBProgress (1): 1.0/1.7 MBProgress (1): 1.0/1.7 MBProgress (1): 1.1/1.7 MBProgress (1): 1.1/1.7 MBProgress (1): 1.1/1.7 MBProgress (1): 1.1/1.7 MBProgress (1): 1.1/1.7 MBProgress (1): 1.1/1.7 MBProgress (1): 1.1/1.7 MBProgress (1): 1.1/1.7 MBProgress (1): 1.1/1.7 MBProgress (1): 1.1/1.7 MBProgress (1): 1.1/1.7 MBProgress (1): 1.1/1.7 MBProgress (1): 1.2/1.7 MBProgress (1): 1.2/1.7 MBProgress (1): 1.2/1.7 MBProgress (1): 1.2/1.7 MBProgress (1): 1.2/1.7 MBProgress (1): 1.2/1.7 MBProgress (1): 1.2/1.7 MBProgress (1): 1.2/1.7 MBProgress (1): 1.2/1.7 MBProgress (1): 1.2/1.7 MBProgress (1): 1.2/1.7 MBProgress (1): 1.2/1.7 MBProgress (1): 1.3/1.7 MBProgress (1): 1.3/1.7 MBProgress (1): 1.3/1.7 MBProgress (1): 1.3/1.7 MBProgress (1): 1.3/1.7 MBProgress (1): 1.3/1.7 MBProgress (1): 1.3/1.7 MBProgress (1): 1.3/1.7 MBProgress (1): 1.3/1.7 MBProgress (1): 1.3/1.7 MBProgress (1): 1.3/1.7 MBProgress (1): 1.3/1.7 MBProgress (1): 1.4/1.7 MBProgress (1): 1.4/1.7 MBProgress (1): 1.4/1.7 MBProgress (1): 1.4/1.7 MBProgress (1): 1.4/1.7 MBProgress (1): 1.4/1.7 MBProgress (1): 1.4/1.7 MBProgress (1): 1.4/1.7 MBProgress (1): 1.4/1.7 MBProgress (1): 1.4/1.7 MBProgress (1): 1.4/1.7 MBProgress (1): 1.4/1.7 MBProgress (1): 1.4/1.7 MBProgress (1): 1.5/1.7 MBProgress (1): 1.5/1.7 MBProgress (1): 1.5/1.7 MBProgress (1): 1.5/1.7 MBProgress (1): 1.5/1.7 MBProgress (1): 1.5/1.7 MBProgress (1): 1.5/1.7 MBProgress (1): 1.5/1.7 MBProgress (1): 1.5/1.7 MBProgress (1): 1.5/1.7 MBProgress (1): 1.5/1.7 MBProgress (1): 1.5/1.7 MBProgress (1): 1.6/1.7 MBProgress (1): 1.6/1.7 MBProgress (1): 1.6/1.7 MBProgress (1): 1.6/1.7 MBProgress (1): 1.6/1.7 MBProgress (1): 1.6/1.7 MBProgress (1): 1.6/1.7 MBProgress (1): 1.6/1.7 MBProgress (1): 1.6/1.7 MBProgress (1): 1.6/1.7 MBProgress (1): 1.6/1.7 MBProgress (1): 1.6/1.7 MBProgress (1): 1.7/1.7 MBProgress (1): 1.7/1.7 MBProgress (1): 1.7/1.7 MBProgress (1): 1.7/1.7 MBProgress (1): 1.7/1.7 MBProgress (1): 1.7 MB                        Downloaded from apache-releases-repo: https://repository.apache.org/content/repositories/releases/org/apache/commons/commons-math3/3.2/commons-math3-3.2.jar (1.7 MB at 1.3 MB/s)
[INFO]
[INFO] --- jacoco-maven-plugin:0.8.6:prepare-agent (default) @ integration-test ---
[INFO] argLine set to -javaagent:<https://ci-builds.apache.org/job/POI/job/POI-DSL-Maven/ws/.repository/org/jacoco/org.jacoco.agent/0.8.6/org.jacoco.agent-0.8.6-runtime.jar=destfile=/home/jenkins/workspace/POI/POI-DSL-Maven/sonar/integration-test/target/jacoco.exec> -Xmx1024m
[INFO]
[INFO] --- maven-resources-plugin:3.2.0:resources (default-resources) @ integration-test ---
[INFO] Using 'UTF-8' encoding to copy filtered resources.
[INFO] Using 'UTF-8' encoding to copy filtered properties files.
[INFO] skip non existing resourceDirectory <https://ci-builds.apache.org/job/POI/job/POI-DSL-Maven/ws/sonar/integration-test/src/main/resources>
[INFO]
[INFO] --- maven-compiler-plugin:3.8.1:compile (default-compile) @ integration-test ---
[INFO] No sources to compile
[INFO]
[INFO] --- maven-resources-plugin:3.2.0:copy-resources (copy-tests) @ integration-test ---
[INFO] Using 'UTF-8' encoding to copy filtered resources.
[INFO] Using 'UTF-8' encoding to copy filtered properties files.
[INFO] Copying 29 resources
[INFO] Copying 4 resources
[INFO] Copying 1 resource
[INFO]
[INFO] --- maven-resources-plugin:3.2.0:testResources (default-testResources) @ integration-test ---
[INFO] Using 'UTF-8' encoding to copy filtered resources.
[INFO] Using 'UTF-8' encoding to copy filtered properties files.
[INFO] skip non existing resourceDirectory <https://ci-builds.apache.org/job/POI/job/POI-DSL-Maven/ws/sonar/integration-test/src/test/resources>
[INFO]
[INFO] --- maven-compiler-plugin:3.8.1:testCompile (default-testCompile) @ integration-test ---
[INFO] Changes detected - recompiling the module!
[INFO] Compiling 32 source files to <https://ci-builds.apache.org/job/POI/job/POI-DSL-Maven/ws/sonar/integration-test/target/test-classes>
[INFO] -------------------------------------------------------------
[ERROR] COMPILATION ERROR :
[INFO] -------------------------------------------------------------
[ERROR] <https://ci-builds.apache.org/job/POI/job/POI-DSL-Maven/ws/sonar/integration-test/src/test/java/org/apache/poi/stress/HPSFFileHandler.java>:[36,36] package org.apache.poi.examples.hpsf does not exist
[ERROR] <https://ci-builds.apache.org/job/POI/job/POI-DSL-Maven/ws/sonar/integration-test/src/test/java/org/apache/poi/stress/XSSFFileHandler.java>:[39,34] package org.apache.poi.examples.ss does not exist
[ERROR] <https://ci-builds.apache.org/job/POI/job/POI-DSL-Maven/ws/sonar/integration-test/src/test/java/org/apache/poi/stress/XSSFFileHandler.java>:[40,51] package org.apache.poi.examples.xssf.eventusermodel does not exist
[ERROR] <https://ci-builds.apache.org/job/POI/job/POI-DSL-Maven/ws/sonar/integration-test/src/test/java/org/apache/poi/stress/XSSFFileHandler.java>:[41,51] package org.apache.poi.examples.xssf.eventusermodel does not exist
[INFO] 4 errors
[INFO] -------------------------------------------------------------
[INFO] ------------------------------------------------------------------------
[INFO] Reactor Summary for Apache POI - the Java API for Microsoft Documents 5.0.1-SNAPSHOT:
[INFO]
[INFO] Apache POI - the Java API for Microsoft Documents .. SUCCESS [ 20.466 s]
[INFO] Apache POI Main package ............................ SUCCESS [03:47 min]
[INFO] Apache POI Scratchpad package ...................... SUCCESS [ 27.299 s]
[INFO] Apache POI - Openxmlformats Schema package ......... SUCCESS [01:03 min]
[INFO] Apache POI OOXML package ........................... SUCCESS [04:57 min]
[INFO] Apache POI ExcelAnt package ........................ SUCCESS [ 11.003 s]
[INFO] Apache POI Examples package ........................ SUCCESS [  0.035 s]
[INFO] Apache POI integration test ........................ FAILURE [  1.628 s]
[INFO] ------------------------------------------------------------------------
[INFO] BUILD FAILURE
[INFO] ------------------------------------------------------------------------
[INFO] Total time:  10:49 min
[INFO] Finished at: 2021-03-27T16:44:02Z
[INFO] ------------------------------------------------------------------------
[ERROR] Failed to execute goal org.apache.maven.plugins:maven-compiler-plugin:3.8.1:testCompile (default-testCompile) on project integration-test: Compilation failure: Compilation failure:
[ERROR] <https://ci-builds.apache.org/job/POI/job/POI-DSL-Maven/ws/sonar/integration-test/src/test/java/org/apache/poi/stress/HPSFFileHandler.java>:[36,36] package org.apache.poi.examples.hpsf does not exist
[ERROR] <https://ci-builds.apache.org/job/POI/job/POI-DSL-Maven/ws/sonar/integration-test/src/test/java/org/apache/poi/stress/XSSFFileHandler.java>:[39,34] package org.apache.poi.examples.ss does not exist
[ERROR] <https://ci-builds.apache.org/job/POI/job/POI-DSL-Maven/ws/sonar/integration-test/src/test/java/org/apache/poi/stress/XSSFFileHandler.java>:[40,51] package org.apache.poi.examples.xssf.eventusermodel does not exist
[ERROR] <https://ci-builds.apache.org/job/POI/job/POI-DSL-Maven/ws/sonar/integration-test/src/test/java/org/apache/poi/stress/XSSFFileHandler.java>:[41,51] package org.apache.poi.examples.xssf.eventusermodel does not exist
[ERROR] -> [Help 1]
[ERROR]
[ERROR] To see the full stack trace of the errors, re-run Maven with the -e switch.
[ERROR] Re-run Maven using the -X switch to enable full debug logging.
[ERROR]
[ERROR] For more information about the errors and possible solutions, please read the following articles:
[ERROR] [Help 1] http://cwiki.apache.org/confluence/display/MAVEN/MojoFailureException
[ERROR]
[ERROR] After correcting the problems, you can resume the build with the command
[ERROR]   mvn <args> -rf :integration-test
Build step 'Invoke top-level Maven targets' marked build as failure
Recording test results
[Checks API] No suitable checks publisher found.

---------------------------------------------------------------------
To unsubscribe, e-mail: [hidden email]
For additional commands, e-mail: [hidden email]

Reply | Threaded
Open this post in threaded view
|

Build failed in Jenkins: POI » POI-DSL-Maven #224

Apache Jenkins Server
See <https://ci-builds.apache.org/job/POI/job/POI-DSL-Maven/224/display/redirect?page=changes>

Changes:

[Andreas Beeker] 65206 - Migrate ant / maven to gradle build
try to fix Java 16 build


------------------------------------------
[...truncated 1.21 MB...]
        at org.apache.poi.ooxml.util.DocumentHelper.readDocument(DocumentHelper.java:57) ~[classes/:?]
        at org.apache.poi.openxml4j.opc.internal.ContentTypeManager.parseContentTypesFile(ContentTypeManager.java:395) ~[classes/:?]
        at org.apache.poi.openxml4j.opc.internal.ContentTypeManager.<init>(ContentTypeManager.java:104) ~[classes/:?]
        at org.apache.poi.openxml4j.opc.internal.ZipContentTypeManager.<init>(ZipContentTypeManager.java:54) ~[classes/:?]
        at org.apache.poi.openxml4j.opc.ZipPackage.getPartsImpl(ZipPackage.java:257) ~[classes/:?]
        at org.apache.poi.openxml4j.opc.OPCPackage.getParts(OPCPackage.java:740) ~[classes/:?]
        at org.apache.poi.openxml4j.opc.OPCPackage.open(OPCPackage.java:315) ~[classes/:?]
        at org.apache.poi.openxml4j.opc.TestContentType.lambda$testFileWithContentTypeEntities$5(TestContentType.java:139) ~[test-classes/:?]
        at org.junit.jupiter.api.AssertThrows.assertThrows(AssertThrows.java:55) ~[junit-jupiter-api-5.7.0.jar:5.7.0]
        at org.junit.jupiter.api.AssertThrows.assertThrows(AssertThrows.java:37) ~[junit-jupiter-api-5.7.0.jar:5.7.0]
        at org.junit.jupiter.api.Assertions.assertThrows(Assertions.java:3007) ~[junit-jupiter-api-5.7.0.jar:5.7.0]
        at org.apache.poi.openxml4j.opc.TestContentType.testFileWithContentTypeEntities(TestContentType.java:139) ~[test-classes/:?]
        at sun.reflect.NativeMethodAccessorImpl.invoke0(Native Method) ~[?:1.8.0_281]
        at sun.reflect.NativeMethodAccessorImpl.invoke(NativeMethodAccessorImpl.java:62) ~[?:1.8.0_281]
        at sun.reflect.DelegatingMethodAccessorImpl.invoke(DelegatingMethodAccessorImpl.java:43) ~[?:1.8.0_281]
        at java.lang.reflect.Method.invoke(Method.java:498) ~[?:1.8.0_281]
        at org.junit.platform.commons.util.ReflectionUtils.invokeMethod(ReflectionUtils.java:688) ~[junit-platform-commons-1.7.0.jar:1.7.0]
        at org.junit.jupiter.engine.execution.MethodInvocation.proceed(MethodInvocation.java:60) ~[junit-jupiter-engine-5.7.0.jar:5.7.0]
        at org.junit.jupiter.engine.execution.InvocationInterceptorChain$ValidatingInvocation.proceed(InvocationInterceptorChain.java:131) ~[junit-jupiter-engine-5.7.0.jar:5.7.0]
        at org.junit.jupiter.engine.extension.TimeoutExtension.intercept(TimeoutExtension.java:149) ~[junit-jupiter-engine-5.7.0.jar:5.7.0]
        at org.junit.jupiter.engine.extension.TimeoutExtension.interceptTestableMethod(TimeoutExtension.java:140) ~[junit-jupiter-engine-5.7.0.jar:5.7.0]
        at org.junit.jupiter.engine.extension.TimeoutExtension.interceptTestMethod(TimeoutExtension.java:84) ~[junit-jupiter-engine-5.7.0.jar:5.7.0]
        at org.junit.jupiter.engine.execution.ExecutableInvoker$ReflectiveInterceptorCall.lambda$ofVoidMethod$0(ExecutableInvoker.java:115) ~[junit-jupiter-engine-5.7.0.jar:5.7.0]
        at org.junit.jupiter.engine.execution.ExecutableInvoker.lambda$invoke$0(ExecutableInvoker.java:105) ~[junit-jupiter-engine-5.7.0.jar:5.7.0]
        at org.junit.jupiter.engine.execution.InvocationInterceptorChain$InterceptedInvocation.proceed(InvocationInterceptorChain.java:106) ~[junit-jupiter-engine-5.7.0.jar:5.7.0]
        at org.junit.jupiter.engine.execution.InvocationInterceptorChain.proceed(InvocationInterceptorChain.java:64) ~[junit-jupiter-engine-5.7.0.jar:5.7.0]
        at org.junit.jupiter.engine.execution.InvocationInterceptorChain.chainAndInvoke(InvocationInterceptorChain.java:45) ~[junit-jupiter-engine-5.7.0.jar:5.7.0]
        at org.junit.jupiter.engine.execution.InvocationInterceptorChain.invoke(InvocationInterceptorChain.java:37) ~[junit-jupiter-engine-5.7.0.jar:5.7.0]
        at org.junit.jupiter.engine.execution.ExecutableInvoker.invoke(ExecutableInvoker.java:104) ~[junit-jupiter-engine-5.7.0.jar:5.7.0]
        at org.junit.jupiter.engine.execution.ExecutableInvoker.invoke(ExecutableInvoker.java:98) ~[junit-jupiter-engine-5.7.0.jar:5.7.0]
        at org.junit.jupiter.engine.descriptor.TestMethodTestDescriptor.lambda$invokeTestMethod$6(TestMethodTestDescriptor.java:210) ~[junit-jupiter-engine-5.7.0.jar:5.7.0]
        at org.junit.platform.engine.support.hierarchical.ThrowableCollector.execute(ThrowableCollector.java:73) ~[junit-platform-engine-1.7.0.jar:1.7.0]
        at org.junit.jupiter.engine.descriptor.TestMethodTestDescriptor.invokeTestMethod(TestMethodTestDescriptor.java:206) ~[junit-jupiter-engine-5.7.0.jar:5.7.0]
        at org.junit.jupiter.engine.descriptor.TestMethodTestDescriptor.execute(TestMethodTestDescriptor.java:131) ~[junit-jupiter-engine-5.7.0.jar:5.7.0]
        at org.junit.jupiter.engine.descriptor.TestMethodTestDescriptor.execute(TestMethodTestDescriptor.java:65) ~[junit-jupiter-engine-5.7.0.jar:5.7.0]
        at org.junit.platform.engine.support.hierarchical.NodeTestTask.lambda$executeRecursively$5(NodeTestTask.java:139) ~[junit-platform-engine-1.7.0.jar:1.7.0]
        at org.junit.platform.engine.support.hierarchical.ThrowableCollector.execute(ThrowableCollector.java:73) ~[junit-platform-engine-1.7.0.jar:1.7.0]
        at org.junit.platform.engine.support.hierarchical.NodeTestTask.lambda$executeRecursively$7(NodeTestTask.java:129) ~[junit-platform-engine-1.7.0.jar:1.7.0]
        at org.junit.platform.engine.support.hierarchical.Node.around(Node.java:137) ~[junit-platform-engine-1.7.0.jar:1.7.0]
        at org.junit.platform.engine.support.hierarchical.NodeTestTask.lambda$executeRecursively$8(NodeTestTask.java:127) ~[junit-platform-engine-1.7.0.jar:1.7.0]
        at org.junit.platform.engine.support.hierarchical.ThrowableCollector.execute(ThrowableCollector.java:73) ~[junit-platform-engine-1.7.0.jar:1.7.0]
        at org.junit.platform.engine.support.hierarchical.NodeTestTask.executeRecursively(NodeTestTask.java:126) ~[junit-platform-engine-1.7.0.jar:1.7.0]
        at org.junit.platform.engine.support.hierarchical.NodeTestTask.execute(NodeTestTask.java:84) ~[junit-platform-engine-1.7.0.jar:1.7.0]
        at java.util.ArrayList.forEach(ArrayList.java:1259) ~[?:1.8.0_281]
        at org.junit.platform.engine.support.hierarchical.SameThreadHierarchicalTestExecutorService.invokeAll(SameThreadHierarchicalTestExecutorService.java:38) ~[junit-platform-engine-1.7.0.jar:1.7.0]
        at org.junit.platform.engine.support.hierarchical.NodeTestTask.lambda$executeRecursively$5(NodeTestTask.java:143) ~[junit-platform-engine-1.7.0.jar:1.7.0]
        at org.junit.platform.engine.support.hierarchical.ThrowableCollector.execute(ThrowableCollector.java:73) ~[junit-platform-engine-1.7.0.jar:1.7.0]
        at org.junit.platform.engine.support.hierarchical.NodeTestTask.lambda$executeRecursively$7(NodeTestTask.java:129) ~[junit-platform-engine-1.7.0.jar:1.7.0]
        at org.junit.platform.engine.support.hierarchical.Node.around(Node.java:137) ~[junit-platform-engine-1.7.0.jar:1.7.0]
        at org.junit.platform.engine.support.hierarchical.NodeTestTask.lambda$executeRecursively$8(NodeTestTask.java:127) ~[junit-platform-engine-1.7.0.jar:1.7.0]
        at org.junit.platform.engine.support.hierarchical.ThrowableCollector.execute(ThrowableCollector.java:73) ~[junit-platform-engine-1.7.0.jar:1.7.0]
        at org.junit.platform.engine.support.hierarchical.NodeTestTask.executeRecursively(NodeTestTask.java:126) ~[junit-platform-engine-1.7.0.jar:1.7.0]
        at org.junit.platform.engine.support.hierarchical.NodeTestTask.execute(NodeTestTask.java:84) ~[junit-platform-engine-1.7.0.jar:1.7.0]
        at java.util.ArrayList.forEach(ArrayList.java:1259) ~[?:1.8.0_281]
        at org.junit.platform.engine.support.hierarchical.SameThreadHierarchicalTestExecutorService.invokeAll(SameThreadHierarchicalTestExecutorService.java:38) ~[junit-platform-engine-1.7.0.jar:1.7.0]
        at org.junit.platform.engine.support.hierarchical.NodeTestTask.lambda$executeRecursively$5(NodeTestTask.java:143) ~[junit-platform-engine-1.7.0.jar:1.7.0]
        at org.junit.platform.engine.support.hierarchical.ThrowableCollector.execute(ThrowableCollector.java:73) ~[junit-platform-engine-1.7.0.jar:1.7.0]
        at org.junit.platform.engine.support.hierarchical.NodeTestTask.lambda$executeRecursively$7(NodeTestTask.java:129) ~[junit-platform-engine-1.7.0.jar:1.7.0]
        at org.junit.platform.engine.support.hierarchical.Node.around(Node.java:137) ~[junit-platform-engine-1.7.0.jar:1.7.0]
        at org.junit.platform.engine.support.hierarchical.NodeTestTask.lambda$executeRecursively$8(NodeTestTask.java:127) ~[junit-platform-engine-1.7.0.jar:1.7.0]
        at org.junit.platform.engine.support.hierarchical.ThrowableCollector.execute(ThrowableCollector.java:73) ~[junit-platform-engine-1.7.0.jar:1.7.0]
        at org.junit.platform.engine.support.hierarchical.NodeTestTask.executeRecursively(NodeTestTask.java:126) ~[junit-platform-engine-1.7.0.jar:1.7.0]
        at org.junit.platform.engine.support.hierarchical.NodeTestTask.execute(NodeTestTask.java:84) ~[junit-platform-engine-1.7.0.jar:1.7.0]
        at org.junit.platform.engine.support.hierarchical.SameThreadHierarchicalTestExecutorService.submit(SameThreadHierarchicalTestExecutorService.java:32) ~[junit-platform-engine-1.7.0.jar:1.7.0]
        at org.junit.platform.engine.support.hierarchical.HierarchicalTestExecutor.execute(HierarchicalTestExecutor.java:57) ~[junit-platform-engine-1.7.0.jar:1.7.0]
        at org.junit.platform.engine.support.hierarchical.HierarchicalTestEngine.execute(HierarchicalTestEngine.java:51) ~[junit-platform-engine-1.7.0.jar:1.7.0]
        at org.junit.platform.launcher.core.EngineExecutionOrchestrator.execute(EngineExecutionOrchestrator.java:108) ~[junit-platform-launcher-1.7.0.jar:1.7.0]
        at org.junit.platform.launcher.core.EngineExecutionOrchestrator.execute(EngineExecutionOrchestrator.java:88) ~[junit-platform-launcher-1.7.0.jar:1.7.0]
        at org.junit.platform.launcher.core.EngineExecutionOrchestrator.lambda$execute$0(EngineExecutionOrchestrator.java:54) ~[junit-platform-launcher-1.7.0.jar:1.7.0]
        at org.junit.platform.launcher.core.EngineExecutionOrchestrator.withInterceptedStreams(EngineExecutionOrchestrator.java:67) [junit-platform-launcher-1.7.0.jar:1.7.0]
        at org.junit.platform.launcher.core.EngineExecutionOrchestrator.execute(EngineExecutionOrchestrator.java:52) [junit-platform-launcher-1.7.0.jar:1.7.0]
        at org.junit.platform.launcher.core.DefaultLauncher.execute(DefaultLauncher.java:96) [junit-platform-launcher-1.7.0.jar:1.7.0]
        at org.junit.platform.launcher.core.DefaultLauncher.execute(DefaultLauncher.java:75) [junit-platform-launcher-1.7.0.jar:1.7.0]
        at org.apache.maven.surefire.junitplatform.JUnitPlatformProvider.execute(JUnitPlatformProvider.java:188) [surefire-junit-platform-3.0.0-M5.jar:3.0.0-M5]
        at org.apache.maven.surefire.junitplatform.JUnitPlatformProvider.invokeAllTests(JUnitPlatformProvider.java:154) [surefire-junit-platform-3.0.0-M5.jar:3.0.0-M5]
        at org.apache.maven.surefire.junitplatform.JUnitPlatformProvider.invoke(JUnitPlatformProvider.java:128) [surefire-junit-platform-3.0.0-M5.jar:3.0.0-M5]
        at org.apache.maven.surefire.booter.ForkedBooter.runSuitesInProcess(ForkedBooter.java:428) [surefire-booter-3.0.0-M5.jar:3.0.0-M5]
        at org.apache.maven.surefire.booter.ForkedBooter.execute(ForkedBooter.java:162) [surefire-booter-3.0.0-M5.jar:3.0.0-M5]
        at org.apache.maven.surefire.booter.ForkedBooter.run(ForkedBooter.java:562) [surefire-booter-3.0.0-M5.jar:3.0.0-M5]
        at org.apache.maven.surefire.booter.ForkedBooter.main(ForkedBooter.java:548) [surefire-booter-3.0.0-M5.jar:3.0.0-M5]
[INFO]
[INFO] --- jacoco-maven-plugin:0.8.6:report (report) @ poi-ooxml ---
[INFO] Loading execution data file <https://ci-builds.apache.org/job/POI/job/POI-DSL-Maven/ws/sonar/ooxml/target/jacoco.exec>
[INFO] Analyzed bundle 'Apache POI OOXML package' with 741 classes
[INFO]
[INFO] --- maven-jar-plugin:2.4:jar (default-jar) @ poi-ooxml ---
[INFO] Building jar: <https://ci-builds.apache.org/job/POI/job/POI-DSL-Maven/ws/sonar/ooxml/target/poi-ooxml-5.0.1-SNAPSHOT.jar>
[INFO]
[INFO] --------------------< org.apache.poi:poi-excelant >---------------------
[INFO] Building Apache POI ExcelAnt package 5.0.1-SNAPSHOT                [6/8]
[INFO] --------------------------------[ jar ]---------------------------------
[INFO]
[INFO] --- jacoco-maven-plugin:0.8.6:prepare-agent (default) @ poi-excelant ---
[INFO] argLine set to -javaagent:<https://ci-builds.apache.org/job/POI/job/POI-DSL-Maven/ws/.repository/org/jacoco/org.jacoco.agent/0.8.6/org.jacoco.agent-0.8.6-runtime.jar=destfile=/home/jenkins/workspace/POI/POI-DSL-Maven/sonar/excelant/target/jacoco.exec> -Xmx1024m
[INFO]
[INFO] --- maven-resources-plugin:3.2.0:copy-resources (copy-sources) @ poi-excelant ---
[INFO] Using 'UTF-8' encoding to copy filtered resources.
[INFO] Using 'UTF-8' encoding to copy filtered properties files.
[INFO] Copying 14 resources
[INFO]
[INFO] --- maven-resources-plugin:3.2.0:copy-resources (copy-resources) @ poi-excelant ---
[INFO] Using 'UTF-8' encoding to copy filtered resources.
[INFO] Using 'UTF-8' encoding to copy filtered properties files.
[INFO] Copying 1 resource
[INFO] Copying 1 resource
[INFO]
[INFO] --- maven-resources-plugin:3.2.0:resources (default-resources) @ poi-excelant ---
[INFO] Using 'UTF-8' encoding to copy filtered resources.
[INFO] Using 'UTF-8' encoding to copy filtered properties files.
[INFO] Copying 2 resources
[INFO]
[INFO] --- maven-compiler-plugin:3.8.1:compile (default-compile) @ poi-excelant ---
[INFO] Changes detected - recompiling the module!
[INFO] Compiling 14 source files to <https://ci-builds.apache.org/job/POI/job/POI-DSL-Maven/ws/sonar/excelant/target/classes>
[INFO]
[INFO] --- maven-resources-plugin:3.2.0:copy-resources (copy-tests) @ poi-excelant ---
[INFO] Using 'UTF-8' encoding to copy filtered resources.
[INFO] Using 'UTF-8' encoding to copy filtered properties files.
[INFO] Copying 12 resources
[INFO]
[INFO] --- maven-resources-plugin:3.2.0:testResources (default-testResources) @ poi-excelant ---
[INFO] Using 'UTF-8' encoding to copy filtered resources.
[INFO] Using 'UTF-8' encoding to copy filtered properties files.
[INFO] skip non existing resourceDirectory <https://ci-builds.apache.org/job/POI/job/POI-DSL-Maven/ws/sonar/excelant/src/test/resources>
[INFO]
[INFO] --- maven-compiler-plugin:3.8.1:testCompile (default-testCompile) @ poi-excelant ---
[INFO] Changes detected - recompiling the module!
[INFO] Compiling 12 source files to <https://ci-builds.apache.org/job/POI/job/POI-DSL-Maven/ws/sonar/excelant/target/test-classes>
[INFO]
[INFO] --- maven-surefire-plugin:3.0.0-M5:test (default-test) @ poi-excelant ---
ExcelAntEvaluationResult [evaluationCompletedWithError=true, didPass=false, returnValue=0.0, errorMessage=Evaluation failed due to an evaluation error of 42 which is #N/A, actualDelta=0.0, cellName='ErrorCell'!A1]
[INFO]
[INFO] --- jacoco-maven-plugin:0.8.6:report (report) @ poi-excelant ---
[INFO] Loading execution data file <https://ci-builds.apache.org/job/POI/job/POI-DSL-Maven/ws/sonar/excelant/target/jacoco.exec>
[INFO] Analyzed bundle 'Apache POI ExcelAnt package' with 13 classes
[INFO]
[INFO] --- maven-jar-plugin:2.4:jar (default-jar) @ poi-excelant ---
[INFO] Building jar: <https://ci-builds.apache.org/job/POI/job/POI-DSL-Maven/ws/sonar/excelant/target/poi-excelant-5.0.1-SNAPSHOT.jar>
[INFO]
[INFO] --------------------< org.apache.poi:poi-examples >---------------------
[INFO] Building Apache POI Examples package 5.0.1-SNAPSHOT                [7/8]
[INFO] --------------------------------[ jar ]---------------------------------
[INFO]
[INFO] --- jacoco-maven-plugin:0.8.6:prepare-agent (default) @ poi-examples ---
[INFO] argLine set to -javaagent:<https://ci-builds.apache.org/job/POI/job/POI-DSL-Maven/ws/.repository/org/jacoco/org.jacoco.agent/0.8.6/org.jacoco.agent-0.8.6-runtime.jar=destfile=/home/jenkins/workspace/POI/POI-DSL-Maven/sonar/examples/target/jacoco.exec> -Xmx1024m
[INFO]
[INFO] --- maven-resources-plugin:3.2.0:copy-resources (copy-sources) @ poi-examples ---
[INFO] Using 'UTF-8' encoding to copy filtered resources.
[INFO] Using 'UTF-8' encoding to copy filtered properties files.
[INFO] skip non existing resourceDirectory <https://ci-builds.apache.org/job/POI/job/POI-DSL-Maven/ws/sonar/examples/../../src/examples/src>
[INFO]
[INFO] --- maven-resources-plugin:3.2.0:resources (default-resources) @ poi-examples ---
[INFO] Using 'UTF-8' encoding to copy filtered resources.
[INFO] Using 'UTF-8' encoding to copy filtered properties files.
[INFO] skip non existing resourceDirectory <https://ci-builds.apache.org/job/POI/job/POI-DSL-Maven/ws/sonar/examples/src/main/resources>
[INFO]
[INFO] --- maven-compiler-plugin:3.8.1:compile (default-compile) @ poi-examples ---
[INFO] No sources to compile
[INFO]
[INFO] --- maven-resources-plugin:3.2.0:testResources (default-testResources) @ poi-examples ---
[INFO] Not copying test resources
[INFO]
[INFO] --- maven-compiler-plugin:3.8.1:testCompile (default-testCompile) @ poi-examples ---
[INFO] Not compiling test sources
[INFO]
[INFO] --- maven-surefire-plugin:3.0.0-M5:test (default-test) @ poi-examples ---
[INFO] Tests are skipped.
[INFO]
[INFO] --- jacoco-maven-plugin:0.8.6:report (report) @ poi-examples ---
[INFO] Skipping JaCoCo execution due to missing execution data file.
[INFO]
[INFO] --- maven-jar-plugin:2.4:jar (default-jar) @ poi-examples ---
[WARNING] JAR will be empty - no content was marked for inclusion!
[INFO] Building jar: <https://ci-builds.apache.org/job/POI/job/POI-DSL-Maven/ws/sonar/examples/target/poi-examples-5.0.1-SNAPSHOT.jar>
[INFO]
[INFO] ------------------< org.apache.poi:integration-test >-------------------
[INFO] Building Apache POI integration test 5.0.1-SNAPSHOT                [8/8]
[INFO] --------------------------------[ jar ]---------------------------------
[INFO]
[INFO] --- jacoco-maven-plugin:0.8.6:prepare-agent (default) @ integration-test ---
[INFO] argLine set to -javaagent:<https://ci-builds.apache.org/job/POI/job/POI-DSL-Maven/ws/.repository/org/jacoco/org.jacoco.agent/0.8.6/org.jacoco.agent-0.8.6-runtime.jar=destfile=/home/jenkins/workspace/POI/POI-DSL-Maven/sonar/integration-test/target/jacoco.exec> -Xmx1024m
[INFO]
[INFO] --- maven-resources-plugin:3.2.0:resources (default-resources) @ integration-test ---
[INFO] Using 'UTF-8' encoding to copy filtered resources.
[INFO] Using 'UTF-8' encoding to copy filtered properties files.
[INFO] skip non existing resourceDirectory <https://ci-builds.apache.org/job/POI/job/POI-DSL-Maven/ws/sonar/integration-test/src/main/resources>
[INFO]
[INFO] --- maven-compiler-plugin:3.8.1:compile (default-compile) @ integration-test ---
[INFO] No sources to compile
[INFO]
[INFO] --- maven-resources-plugin:3.2.0:copy-resources (copy-tests) @ integration-test ---
[INFO] Using 'UTF-8' encoding to copy filtered resources.
[INFO] Using 'UTF-8' encoding to copy filtered properties files.
[INFO] Copying 29 resources
[INFO] Copying 4 resources
[INFO] Copying 1 resource
[INFO]
[INFO] --- maven-resources-plugin:3.2.0:testResources (default-testResources) @ integration-test ---
[INFO] Using 'UTF-8' encoding to copy filtered resources.
[INFO] Using 'UTF-8' encoding to copy filtered properties files.
[INFO] skip non existing resourceDirectory <https://ci-builds.apache.org/job/POI/job/POI-DSL-Maven/ws/sonar/integration-test/src/test/resources>
[INFO]
[INFO] --- maven-compiler-plugin:3.8.1:testCompile (default-testCompile) @ integration-test ---
[INFO] Changes detected - recompiling the module!
[INFO] Compiling 32 source files to <https://ci-builds.apache.org/job/POI/job/POI-DSL-Maven/ws/sonar/integration-test/target/test-classes>
[INFO] -------------------------------------------------------------
[ERROR] COMPILATION ERROR :
[INFO] -------------------------------------------------------------
[ERROR] <https://ci-builds.apache.org/job/POI/job/POI-DSL-Maven/ws/sonar/integration-test/src/test/java/org/apache/poi/stress/HPSFFileHandler.java>:[36,36] package org.apache.poi.examples.hpsf does not exist
[ERROR] <https://ci-builds.apache.org/job/POI/job/POI-DSL-Maven/ws/sonar/integration-test/src/test/java/org/apache/poi/stress/XSSFFileHandler.java>:[39,34] package org.apache.poi.examples.ss does not exist
[ERROR] <https://ci-builds.apache.org/job/POI/job/POI-DSL-Maven/ws/sonar/integration-test/src/test/java/org/apache/poi/stress/XSSFFileHandler.java>:[40,51] package org.apache.poi.examples.xssf.eventusermodel does not exist
[ERROR] <https://ci-builds.apache.org/job/POI/job/POI-DSL-Maven/ws/sonar/integration-test/src/test/java/org/apache/poi/stress/XSSFFileHandler.java>:[41,51] package org.apache.poi.examples.xssf.eventusermodel does not exist
[INFO] 4 errors
[INFO] -------------------------------------------------------------
[INFO] ------------------------------------------------------------------------
[INFO] Reactor Summary for Apache POI - the Java API for Microsoft Documents 5.0.1-SNAPSHOT:
[INFO]
[INFO] Apache POI - the Java API for Microsoft Documents .. SUCCESS [  0.825 s]
[INFO] Apache POI Main package ............................ SUCCESS [04:13 min]
[INFO] Apache POI Scratchpad package ...................... SUCCESS [ 30.682 s]
[INFO] Apache POI - Openxmlformats Schema package ......... SUCCESS [01:02 min]
[INFO] Apache POI OOXML package ........................... SUCCESS [04:34 min]
[INFO] Apache POI ExcelAnt package ........................ SUCCESS [  6.490 s]
[INFO] Apache POI Examples package ........................ SUCCESS [  0.036 s]
[INFO] Apache POI integration test ........................ FAILURE [  0.307 s]
[INFO] ------------------------------------------------------------------------
[INFO] BUILD FAILURE
[INFO] ------------------------------------------------------------------------
[INFO] Total time:  10:28 min
[INFO] Finished at: 2021-03-28T00:43:12Z
[INFO] ------------------------------------------------------------------------
[ERROR] Failed to execute goal org.apache.maven.plugins:maven-compiler-plugin:3.8.1:testCompile (default-testCompile) on project integration-test: Compilation failure: Compilation failure:
[ERROR] <https://ci-builds.apache.org/job/POI/job/POI-DSL-Maven/ws/sonar/integration-test/src/test/java/org/apache/poi/stress/HPSFFileHandler.java>:[36,36] package org.apache.poi.examples.hpsf does not exist
[ERROR] <https://ci-builds.apache.org/job/POI/job/POI-DSL-Maven/ws/sonar/integration-test/src/test/java/org/apache/poi/stress/XSSFFileHandler.java>:[39,34] package org.apache.poi.examples.ss does not exist
[ERROR] <https://ci-builds.apache.org/job/POI/job/POI-DSL-Maven/ws/sonar/integration-test/src/test/java/org/apache/poi/stress/XSSFFileHandler.java>:[40,51] package org.apache.poi.examples.xssf.eventusermodel does not exist
[ERROR] <https://ci-builds.apache.org/job/POI/job/POI-DSL-Maven/ws/sonar/integration-test/src/test/java/org/apache/poi/stress/XSSFFileHandler.java>:[41,51] package org.apache.poi.examples.xssf.eventusermodel does not exist
[ERROR] -> [Help 1]
[ERROR]
[ERROR] To see the full stack trace of the errors, re-run Maven with the -e switch.
[ERROR] Re-run Maven using the -X switch to enable full debug logging.
[ERROR]
[ERROR] For more information about the errors and possible solutions, please read the following articles:
[ERROR] [Help 1] http://cwiki.apache.org/confluence/display/MAVEN/MojoFailureException
[ERROR]
[ERROR] After correcting the problems, you can resume the build with the command
[ERROR]   mvn <args> -rf :integration-test
Build step 'Invoke top-level Maven targets' marked build as failure
Recording test results
[Checks API] No suitable checks publisher found.

---------------------------------------------------------------------
To unsubscribe, e-mail: [hidden email]
For additional commands, e-mail: [hidden email]