Build failed in Jenkins: POI » POI-DSL-Maven #181

classic Classic list List threaded Threaded
2 messages Options
Reply | Threaded
Open this post in threaded view
|

Build failed in Jenkins: POI » POI-DSL-Maven #181

Apache Jenkins Server
See <https://ci-builds.apache.org/job/POI/job/POI-DSL-Maven/181/display/redirect>

Changes:


------------------------------------------
Started by an SCM change
Running as SYSTEM
[EnvInject] - Loading node environment variables.
[EnvInject] - Preparing an environment for the build.
[EnvInject] - Keeping Jenkins system variables.
[EnvInject] - Keeping Jenkins build variables.
[EnvInject] - Injecting as environment variables the properties content
LANG=en_US.UTF-8
FORREST_HOME=/home/jenkins/tools/forrest/latest

[EnvInject] - Variables injected successfully.
[EnvInject] - Injecting contributions.
Building remotely on H42 (ubuntu) in workspace <https://ci-builds.apache.org/job/POI/job/POI-DSL-Maven/ws/>
[WS-CLEANUP] Deleting project workspace...
[WS-CLEANUP] Done
Also:   hudson.remoting.Channel$CallSiteStackTrace: Remote call to H42
                at hudson.remoting.Channel.attachCallSiteStackTrace(Channel.java:1788)
                at hudson.remoting.UserRequest$ExceptionResponse.retrieve(UserRequest.java:356)
                at hudson.remoting.Channel.call(Channel.java:998)
                at hudson.FilePath.act(FilePath.java:1069)
                at hudson.FilePath.act(FilePath.java:1058)
                at hudson.scm.SubversionSCM.checkout(SubversionSCM.java:927)
                at hudson.scm.SubversionSCM.checkout(SubversionSCM.java:857)
                at hudson.scm.SCM.checkout(SCM.java:505)
                at hudson.model.AbstractProject.checkout(AbstractProject.java:1206)
                at hudson.model.AbstractBuild$AbstractBuildExecution.defaultCheckout(AbstractBuild.java:574)
                at jenkins.scm.SCMCheckoutStrategy.checkout(SCMCheckoutStrategy.java:86)
                at hudson.model.AbstractBuild$AbstractBuildExecution.run(AbstractBuild.java:499)
                at hudson.model.Run.execute(Run.java:1880)
                at hudson.model.FreeStyleBuild.run(FreeStyleBuild.java:43)
                at hudson.model.ResourceController.execute(ResourceController.java:97)
                at hudson.model.Executor.run(Executor.java:428)
java.lang.NoClassDefFoundError: Could not initialize class jenkins.model.Jenkins
        at hudson.scm.SubversionSCM.descriptor(SubversionSCM.java:2561)
        at hudson.scm.SubversionSCM.createDefaultSVNOptions(SubversionSCM.java:1086)
        at hudson.scm.SubversionSCM.createClientManager(SubversionSCM.java:1076)
        at hudson.scm.SubversionSCM$CheckOutTask.invoke(SubversionSCM.java:1003)
        at hudson.scm.SubversionSCM$CheckOutTask.invoke(SubversionSCM.java:980)
        at hudson.FilePath$FileCallableWrapper.call(FilePath.java:3073)
        at hudson.remoting.UserRequest.perform(UserRequest.java:211)
        at hudson.remoting.UserRequest.perform(UserRequest.java:54)
        at hudson.remoting.Request$2.run(Request.java:369)
        at hudson.remoting.InterceptingExecutorService$1.call(InterceptingExecutorService.java:72)
        at java.util.concurrent.FutureTask.run(FutureTask.java:266)
        at java.util.concurrent.ThreadPoolExecutor.runWorker(ThreadPoolExecutor.java:1149)
        at java.util.concurrent.ThreadPoolExecutor$Worker.run(ThreadPoolExecutor.java:624)
        at java.lang.Thread.run(Thread.java:748)
Caused: java.io.IOException: Remote call on H42 failed
        at hudson.remoting.Channel.call(Channel.java:1004)
        at hudson.FilePath.act(FilePath.java:1069)
        at hudson.FilePath.act(FilePath.java:1058)
        at hudson.scm.SubversionSCM.checkout(SubversionSCM.java:927)
        at hudson.scm.SubversionSCM.checkout(SubversionSCM.java:857)
        at hudson.scm.SCM.checkout(SCM.java:505)
        at hudson.model.AbstractProject.checkout(AbstractProject.java:1206)
        at hudson.model.AbstractBuild$AbstractBuildExecution.defaultCheckout(AbstractBuild.java:574)
        at jenkins.scm.SCMCheckoutStrategy.checkout(SCMCheckoutStrategy.java:86)
        at hudson.model.AbstractBuild$AbstractBuildExecution.run(AbstractBuild.java:499)
        at hudson.model.Run.execute(Run.java:1880)
        at hudson.model.FreeStyleBuild.run(FreeStyleBuild.java:43)
        at hudson.model.ResourceController.execute(ResourceController.java:97)
        at hudson.model.Executor.run(Executor.java:428)
Retrying after 10 seconds
Also:   hudson.remoting.Channel$CallSiteStackTrace: Remote call to H42
                at hudson.remoting.Channel.attachCallSiteStackTrace(Channel.java:1788)
                at hudson.remoting.UserRequest$ExceptionResponse.retrieve(UserRequest.java:356)
                at hudson.remoting.Channel.call(Channel.java:998)
                at hudson.FilePath.act(FilePath.java:1069)
                at hudson.FilePath.act(FilePath.java:1058)
                at hudson.scm.SubversionSCM.checkout(SubversionSCM.java:927)
                at hudson.scm.SubversionSCM.checkout(SubversionSCM.java:857)
                at hudson.scm.SCM.checkout(SCM.java:505)
                at hudson.model.AbstractProject.checkout(AbstractProject.java:1206)
                at hudson.model.AbstractBuild$AbstractBuildExecution.defaultCheckout(AbstractBuild.java:574)
                at jenkins.scm.SCMCheckoutStrategy.checkout(SCMCheckoutStrategy.java:86)
                at hudson.model.AbstractBuild$AbstractBuildExecution.run(AbstractBuild.java:499)
                at hudson.model.Run.execute(Run.java:1880)
                at hudson.model.FreeStyleBuild.run(FreeStyleBuild.java:43)
                at hudson.model.ResourceController.execute(ResourceController.java:97)
                at hudson.model.Executor.run(Executor.java:428)
java.lang.NoClassDefFoundError: Could not initialize class jenkins.model.Jenkins
        at hudson.scm.SubversionSCM.descriptor(SubversionSCM.java:2561)
        at hudson.scm.SubversionSCM.createDefaultSVNOptions(SubversionSCM.java:1086)
        at hudson.scm.SubversionSCM.createClientManager(SubversionSCM.java:1076)
        at hudson.scm.SubversionSCM$CheckOutTask.invoke(SubversionSCM.java:1003)
        at hudson.scm.SubversionSCM$CheckOutTask.invoke(SubversionSCM.java:980)
        at hudson.FilePath$FileCallableWrapper.call(FilePath.java:3073)
        at hudson.remoting.UserRequest.perform(UserRequest.java:211)
        at hudson.remoting.UserRequest.perform(UserRequest.java:54)
        at hudson.remoting.Request$2.run(Request.java:369)
        at hudson.remoting.InterceptingExecutorService$1.call(InterceptingExecutorService.java:72)
        at java.util.concurrent.FutureTask.run(FutureTask.java:266)
        at java.util.concurrent.ThreadPoolExecutor.runWorker(ThreadPoolExecutor.java:1149)
        at java.util.concurrent.ThreadPoolExecutor$Worker.run(ThreadPoolExecutor.java:624)
        at java.lang.Thread.run(Thread.java:748)
Caused: java.io.IOException: Remote call on H42 failed
        at hudson.remoting.Channel.call(Channel.java:1004)
        at hudson.FilePath.act(FilePath.java:1069)
        at hudson.FilePath.act(FilePath.java:1058)
        at hudson.scm.SubversionSCM.checkout(SubversionSCM.java:927)
        at hudson.scm.SubversionSCM.checkout(SubversionSCM.java:857)
        at hudson.scm.SCM.checkout(SCM.java:505)
        at hudson.model.AbstractProject.checkout(AbstractProject.java:1206)
        at hudson.model.AbstractBuild$AbstractBuildExecution.defaultCheckout(AbstractBuild.java:574)
        at jenkins.scm.SCMCheckoutStrategy.checkout(SCMCheckoutStrategy.java:86)
        at hudson.model.AbstractBuild$AbstractBuildExecution.run(AbstractBuild.java:499)
        at hudson.model.Run.execute(Run.java:1880)
        at hudson.model.FreeStyleBuild.run(FreeStyleBuild.java:43)
        at hudson.model.ResourceController.execute(ResourceController.java:97)
        at hudson.model.Executor.run(Executor.java:428)
Retrying after 10 seconds
Also:   hudson.remoting.Channel$CallSiteStackTrace: Remote call to H42
                at hudson.remoting.Channel.attachCallSiteStackTrace(Channel.java:1788)
                at hudson.remoting.UserRequest$ExceptionResponse.retrieve(UserRequest.java:356)
                at hudson.remoting.Channel.call(Channel.java:998)
                at hudson.FilePath.act(FilePath.java:1069)
                at hudson.FilePath.act(FilePath.java:1058)
                at hudson.scm.SubversionSCM.checkout(SubversionSCM.java:927)
                at hudson.scm.SubversionSCM.checkout(SubversionSCM.java:857)
                at hudson.scm.SCM.checkout(SCM.java:505)
                at hudson.model.AbstractProject.checkout(AbstractProject.java:1206)
                at hudson.model.AbstractBuild$AbstractBuildExecution.defaultCheckout(AbstractBuild.java:574)
                at jenkins.scm.SCMCheckoutStrategy.checkout(SCMCheckoutStrategy.java:86)
                at hudson.model.AbstractBuild$AbstractBuildExecution.run(AbstractBuild.java:499)
                at hudson.model.Run.execute(Run.java:1880)
                at hudson.model.FreeStyleBuild.run(FreeStyleBuild.java:43)
                at hudson.model.ResourceController.execute(ResourceController.java:97)
                at hudson.model.Executor.run(Executor.java:428)
java.lang.NoClassDefFoundError: Could not initialize class jenkins.model.Jenkins
        at hudson.scm.SubversionSCM.descriptor(SubversionSCM.java:2561)
        at hudson.scm.SubversionSCM.createDefaultSVNOptions(SubversionSCM.java:1086)
        at hudson.scm.SubversionSCM.createClientManager(SubversionSCM.java:1076)
        at hudson.scm.SubversionSCM$CheckOutTask.invoke(SubversionSCM.java:1003)
        at hudson.scm.SubversionSCM$CheckOutTask.invoke(SubversionSCM.java:980)
        at hudson.FilePath$FileCallableWrapper.call(FilePath.java:3073)
        at hudson.remoting.UserRequest.perform(UserRequest.java:211)
        at hudson.remoting.UserRequest.perform(UserRequest.java:54)
        at hudson.remoting.Request$2.run(Request.java:369)
        at hudson.remoting.InterceptingExecutorService$1.call(InterceptingExecutorService.java:72)
        at java.util.concurrent.FutureTask.run(FutureTask.java:266)
        at java.util.concurrent.ThreadPoolExecutor.runWorker(ThreadPoolExecutor.java:1149)
        at java.util.concurrent.ThreadPoolExecutor$Worker.run(ThreadPoolExecutor.java:624)
        at java.lang.Thread.run(Thread.java:748)
Caused: java.io.IOException: Remote call on H42 failed
        at hudson.remoting.Channel.call(Channel.java:1004)
        at hudson.FilePath.act(FilePath.java:1069)
        at hudson.FilePath.act(FilePath.java:1058)
        at hudson.scm.SubversionSCM.checkout(SubversionSCM.java:927)
        at hudson.scm.SubversionSCM.checkout(SubversionSCM.java:857)
        at hudson.scm.SCM.checkout(SCM.java:505)
        at hudson.model.AbstractProject.checkout(AbstractProject.java:1206)
        at hudson.model.AbstractBuild$AbstractBuildExecution.defaultCheckout(AbstractBuild.java:574)
        at jenkins.scm.SCMCheckoutStrategy.checkout(SCMCheckoutStrategy.java:86)
        at hudson.model.AbstractBuild$AbstractBuildExecution.run(AbstractBuild.java:499)
        at hudson.model.Run.execute(Run.java:1880)
        at hudson.model.FreeStyleBuild.run(FreeStyleBuild.java:43)
        at hudson.model.ResourceController.execute(ResourceController.java:97)
        at hudson.model.Executor.run(Executor.java:428)
Retrying after 10 seconds
Also:   hudson.remoting.Channel$CallSiteStackTrace: Remote call to H42
                at hudson.remoting.Channel.attachCallSiteStackTrace(Channel.java:1788)
                at hudson.remoting.UserRequest$ExceptionResponse.retrieve(UserRequest.java:356)
                at hudson.remoting.Channel.call(Channel.java:998)
                at hudson.FilePath.act(FilePath.java:1069)
                at hudson.FilePath.act(FilePath.java:1058)
                at hudson.scm.SubversionSCM.checkout(SubversionSCM.java:927)
                at hudson.scm.SubversionSCM.checkout(SubversionSCM.java:857)
                at hudson.scm.SCM.checkout(SCM.java:505)
                at hudson.model.AbstractProject.checkout(AbstractProject.java:1206)
                at hudson.model.AbstractBuild$AbstractBuildExecution.defaultCheckout(AbstractBuild.java:574)
                at jenkins.scm.SCMCheckoutStrategy.checkout(SCMCheckoutStrategy.java:86)
                at hudson.model.AbstractBuild$AbstractBuildExecution.run(AbstractBuild.java:499)
                at hudson.model.Run.execute(Run.java:1880)
                at hudson.model.FreeStyleBuild.run(FreeStyleBuild.java:43)
                at hudson.model.ResourceController.execute(ResourceController.java:97)
                at hudson.model.Executor.run(Executor.java:428)
java.lang.NoClassDefFoundError: Could not initialize class jenkins.model.Jenkins
        at hudson.scm.SubversionSCM.descriptor(SubversionSCM.java:2561)
        at hudson.scm.SubversionSCM.createDefaultSVNOptions(SubversionSCM.java:1086)
        at hudson.scm.SubversionSCM.createClientManager(SubversionSCM.java:1076)
        at hudson.scm.SubversionSCM$CheckOutTask.invoke(SubversionSCM.java:1003)
        at hudson.scm.SubversionSCM$CheckOutTask.invoke(SubversionSCM.java:980)
        at hudson.FilePath$FileCallableWrapper.call(FilePath.java:3073)
        at hudson.remoting.UserRequest.perform(UserRequest.java:211)
        at hudson.remoting.UserRequest.perform(UserRequest.java:54)
        at hudson.remoting.Request$2.run(Request.java:369)
        at hudson.remoting.InterceptingExecutorService$1.call(InterceptingExecutorService.java:72)
        at java.util.concurrent.FutureTask.run(FutureTask.java:266)
        at java.util.concurrent.ThreadPoolExecutor.runWorker(ThreadPoolExecutor.java:1149)
        at java.util.concurrent.ThreadPoolExecutor$Worker.run(ThreadPoolExecutor.java:624)
        at java.lang.Thread.run(Thread.java:748)
Caused: java.io.IOException: Remote call on H42 failed
        at hudson.remoting.Channel.call(Channel.java:1004)
        at hudson.FilePath.act(FilePath.java:1069)
        at hudson.FilePath.act(FilePath.java:1058)
        at hudson.scm.SubversionSCM.checkout(SubversionSCM.java:927)
        at hudson.scm.SubversionSCM.checkout(SubversionSCM.java:857)
        at hudson.scm.SCM.checkout(SCM.java:505)
        at hudson.model.AbstractProject.checkout(AbstractProject.java:1206)
        at hudson.model.AbstractBuild$AbstractBuildExecution.defaultCheckout(AbstractBuild.java:574)
        at jenkins.scm.SCMCheckoutStrategy.checkout(SCMCheckoutStrategy.java:86)
        at hudson.model.AbstractBuild$AbstractBuildExecution.run(AbstractBuild.java:499)
        at hudson.model.Run.execute(Run.java:1880)
        at hudson.model.FreeStyleBuild.run(FreeStyleBuild.java:43)
        at hudson.model.ResourceController.execute(ResourceController.java:97)
        at hudson.model.Executor.run(Executor.java:428)
Recording test results
ERROR: Step ?Publish JUnit test result report? failed: No test report files were found. Configuration error?

---------------------------------------------------------------------
To unsubscribe, e-mail: [hidden email]
For additional commands, e-mail: [hidden email]

Reply | Threaded
Open this post in threaded view
|

Jenkins build is back to normal : POI » POI-DSL-Maven #182

Apache Jenkins Server
See <https://ci-builds.apache.org/job/POI/job/POI-DSL-Maven/182/display/redirect>


---------------------------------------------------------------------
To unsubscribe, e-mail: [hidden email]
For additional commands, e-mail: [hidden email]