Build failed in Jenkins: POI » POI-DSL-IBM-JDK #1

classic Classic list List threaded Threaded
6 messages Options
Reply | Threaded
Open this post in threaded view
|

Build failed in Jenkins: POI » POI-DSL-IBM-JDK #1

Apache Jenkins Server
See <https://ci-builds.apache.org/job/POI/job/POI-DSL-IBM-JDK/1/display/redirect>

Changes:


------------------------------------------
[...truncated 377.12 KB...]
AU        src/documentation/resources/images/POIFSInitialization.gif
AU        src/documentation/resources/images/logoKarmokar2.png
AU        src/documentation/resources/images/logoRaPiGmbH10.png
AU        src/documentation/resources/images/logoKarmokar3.png
AU        src/documentation/resources/images/logoRaPiGmbH11.png
AU        src/documentation/resources/images/logoMichaelMosmann.png
AU        src/documentation/resources/images/logoKarmokar4.png
AU        src/documentation/resources/images/logoRaPiGmbH12.png
AU        src/documentation/resources/images/logoKarmokar5.png
AU        src/documentation/resources/images/logoKarmokar6.png
AU        src/documentation/resources/images/ApacheConEu08.jpg
AU        src/documentation/resources/images/BlockClassDiagram.gif
AU        src/documentation/resources/images/calculatePayment.jpg
AU        src/documentation/resources/images/PropertyTableClassDiagram.gif
AU        src/documentation/resources/images/logoRussellBeattie1.png
AU        src/documentation/resources/images/logoRussellBeattie2.png
AU        src/documentation/resources/images/logoRussellBeattie3.png
A         src/documentation/sitemap.xmap
AU        src/documentation/skinconf.xml
AU        src/documentation/release-guide.txt
A         src/documentation/cli.xconf
AU        src/documentation/RELEASE-NOTES.txt
AU        src/documentation/README.txt
A         src/documentation/classes
A         src/documentation/classes/CatalogManager.properties
At revision 1880886


<-- Got one external: forrest.properties, svn url: https://svn.apache.org/repos/asf/poi/site/forrest.properties -->
Fetching 'https://svn.apache.org/repos/asf/poi/site/forrest.properties' at -1 into '<https://ci-builds.apache.org/job/POI/job/POI-DSL-IBM-JDK/ws/forrest.properties'>
A         forrest.properties
At revision 1880886

At revision 1880886

No JDK named ?IBM 1.8 64-bit (on Ubuntu only)? found
[POI-DSL-IBM-JDK] $ /bin/sh -xe /tmp/jenkins4182785546072810800.sh
+ svn status
    X   forrest.properties
X       src/documentation

Performing status on external item at 'src/documentation':
+ echo Java-Home:
Java-Home:
+ ls -al /
total 10297
drwxr-xr-x  25 root root     4096 Jul 21 06:59 .
drwxr-xr-x  25 root root     4096 Jul 21 06:59 ..
drwxr-xr-x   2 root root     4096 Aug  6 06:03 bin
drwxr-xr-x   4 root root     1024 Aug  7 06:23 boot
-rw-r--r--   1 root root      530 Feb  4  2020 chboot
drwxr-xr-x  20 root root     4040 Jul 15 13:47 dev
drwxr-xr-x 121 root root    12288 Aug 11 06:38 etc
drwxr-xr-x  11 root root     4096 Aug  9 05:36 home
lrwxrwxrwx   1 root root       34 Jul 21 06:59 initrd.img -> boot/initrd.img-4.15.0-112-generic
lrwxrwxrwx   1 root root       34 Jul 21 06:59 initrd.img.old -> boot/initrd.img-4.15.0-111-generic
drwxr-xr-x  19 root root     4096 Jul  6 18:46 lib
drwxr-xr-x   2 root root    12288 Jul  6 18:46 lib32
drwxr-xr-x   3 root root     4096 Jul  6 18:46 lib64
drwxr-xr-x   2 root root    12288 Jul  6 18:46 libx32
drwx------   2 root root    16384 Feb  4  2020 lost+found
drwxr-xr-x   2 root root     4096 Feb  4  2020 media
drwxr-xr-x   2 root root     4096 Feb  4  2020 mnt
drwxr-xr-x   8 root root     4096 Jun 25 17:46 opt
dr-xr-xr-x 365 root root        0 Jun 26 23:40 proc
-rw-r--r--   1 root root    11724 Jun 19  2019 puppet-release-bionic.deb
drwx------   6 root root     4096 Jun 25 17:46 root
drwxr-xr-x  31 root root     1100 Aug 16 06:28 run
drwxr-xr-x   2 root root    12288 Aug  6 06:02 sbin
drwxr-xr-x   8 root root     4096 Feb  7  2020 snap
drwxr-xr-x   2 root root     4096 Feb  4  2020 srv
dr-xr-xr-x  13 root root        0 Jun 26 23:41 sys
drwxrwxrwt   1 root root 10395648 Aug 16 07:32 tmp
drwxr-xr-x  15 root root     4096 Feb  7  2020 usr
drwxr-xr-x  13 root root     4096 Feb  7  2020 var
lrwxrwxrwx   1 root root       31 Jul 21 06:59 vmlinuz -> boot/vmlinuz-4.15.0-112-generic
lrwxrwxrwx   1 root root       31 Jul 21 06:59 vmlinuz.old -> boot/vmlinuz-4.15.0-111-generic
+ ls -al /bin
total 11580
drwxr-xr-x  2 root root    4096 Aug  6 06:03 .
drwxr-xr-x 25 root root    4096 Jul 21 06:59 ..
-rwxr-xr-x  1 root root 1113504 Jun  6  2019 bash
-rwxr-xr-x  3 root root   34888 Jul  4  2019 bunzip2
-rwxr-xr-x  1 root root 2062296 Mar  6  2019 busybox
-rwxr-xr-x  3 root root   34888 Jul  4  2019 bzcat
lrwxrwxrwx  1 root root       6 Jul  4  2019 bzcmp -> bzdiff
-rwxr-xr-x  1 root root    2140 Jul  4  2019 bzdiff
lrwxrwxrwx  1 root root       6 Jul  4  2019 bzegrep -> bzgrep
-rwxr-xr-x  1 root root    4877 Jul  4  2019 bzexe
lrwxrwxrwx  1 root root       6 Jul  4  2019 bzfgrep -> bzgrep
-rwxr-xr-x  1 root root    3642 Jul  4  2019 bzgrep
-rwxr-xr-x  3 root root   34888 Jul  4  2019 bzip2
-rwxr-xr-x  1 root root   14328 Jul  4  2019 bzip2recover
lrwxrwxrwx  1 root root       6 Jul  4  2019 bzless -> bzmore
-rwxr-xr-x  1 root root    1297 Jul  4  2019 bzmore
-rwxr-xr-x  1 root root   35064 Jan 18  2018 cat
-rwxr-xr-x  1 root root   63672 Jan 18  2018 chgrp
-rwxr-xr-x  1 root root   59608 Jan 18  2018 chmod
-rwxr-xr-x  1 root root   67768 Jan 18  2018 chown
-rwxr-xr-x  1 root root   10312 Jan 22  2018 chvt
-rwxr-xr-x  1 root root  141528 Jan 18  2018 cp
-rwxr-xr-x  1 root root  157224 Nov  5  2019 cpio
-rwxr-xr-x  1 root root  121432 Jan 25  2018 dash
-rwxr-xr-x  1 root root  100568 Jan 18  2018 date
-rwxr-xr-x  1 root root   76000 Jan 18  2018 dd
-rwxr-xr-x  1 root root   84776 Jan 18  2018 df
-rwxr-xr-x  1 root root  133792 Jan 18  2018 dir
-rwxr-xr-x  1 root root   72000 Mar  5 17:23 dmesg
lrwxrwxrwx  1 root root       8 Jan 31  2018 dnsdomainname -> hostname
lrwxrwxrwx  1 root root       8 Jan 31  2018 domainname -> hostname
-rwxr-xr-x  1 root root  170520 Jan 22  2018 dumpkeys
-rwxr-xr-x  1 root root   35000 Jan 18  2018 echo
-rwxr-xr-x  1 root root   51512 Apr 26  2016 ed
-rwxr-xr-x  1 root root      28 Sep 18  2019 egrep
-rwxr-xr-x  1 root root   30904 Jan 18  2018 false
-rwxr-xr-x  1 root root   10312 Jan 22  2018 fgconsole
-rwxr-xr-x  1 root root      28 Sep 18  2019 fgrep
-rwxr-xr-x  1 root root   64784 Mar  5 17:23 findmnt
-rwxr-xr-x  1 root root   35928 Dec 11  2018 fuser
-rwsr-xr-x  1 root root   30800 Aug 11  2016 fusermount
-rwxr-xr-x  1 root root  219456 Sep 18  2019 grep
-rwxr-xr-x  2 root root    2301 Apr 28  2017 gunzip
-rwxr-xr-x  1 root root    5927 Apr 28  2017 gzexe
-rwxr-xr-x  1 root root  101560 Apr 28  2017 gzip
-rwxr-xr-x  1 root root   18504 Jan 31  2018 hostname
-rwxr-xr-x  1 root root  558200 Jul 15 15:16 ip
-rwxr-xr-x  1 root root   63576 Jul  8 18:59 journalctl
-rwxr-xr-x  1 root root   10312 Jan 22  2018 kbd_mode
-rwxr-xr-x  1 root root   26704 Aug  9  2019 kill
-rwxr-xr-x  1 root root  149688 Jul 28 14:46 kmod
-rwxr-xr-x  1 root root  170760 Dec  1  2017 less
-rwxr-xr-x  1 root root   10256 Dec  1  2017 lessecho
lrwxrwxrwx  1 root root       8 Dec  1  2017 lessfile -> lesspipe
-rwxr-xr-x  1 root root   19856 Dec  1  2017 lesskey
-rwxr-xr-x  1 root root    8564 Dec  1  2017 lesspipe
-rwxr-xr-x  1 root root   67808 Jan 18  2018 ln
-rwxr-xr-x  1 root root  211528 Jan 22  2018 loadkeys
-rwxr-xr-x  1 root root   52664 Mar 22  2019 login
-rwxr-xr-x  1 root root   51280 Jul  8 18:59 loginctl
-rwxr-xr-x  1 root root  109232 Mar 21  2019 lowntfs-3g
-rwxr-xr-x  1 root root  133792 Jan 18  2018 ls
-rwxr-xr-x  1 root root   84048 Mar  5 17:23 lsblk
lrwxrwxrwx  1 root root       4 Jul 28 14:46 lsmod -> kmod
-rwxr-xr-x  1 root root   80056 Jan 18  2018 mkdir
-rwxr-xr-x  1 root root   67768 Jan 18  2018 mknod
-rwxr-xr-x  1 root root   43192 Jan 18  2018 mktemp
-rwxr-xr-x  1 root root   38952 Mar  5 17:23 more
-rwsr-xr-x  1 root root   43088 Mar  5 17:23 mount
-rwxr-xr-x  1 root root   14408 Mar  5 17:23 mountpoint
lrwxrwxrwx  1 root root      20 Feb  4  2020 mt -> /etc/alternatives/mt
-rwxr-xr-x  1 root root   80512 Nov  5  2019 mt-gnu
-rwxr-xr-x  1 root root  137440 Jan 18  2018 mv
-rwxr-xr-x  1 root root  245872 Mar  6  2018 nano
lrwxrwxrwx  1 root root      20 Feb  4  2020 nc -> /etc/alternatives/nc
-rwxr-xr-x  1 root root   35312 May 14  2018 nc.openbsd
lrwxrwxrwx  1 root root      24 Feb  4  2020 netcat -> /etc/alternatives/netcat
-rwxr-xr-x  1 root root  154192 Jan 10  2017 netstat
-rwxr-xr-x  1 root root   43080 Jul  8 18:59 networkctl
lrwxrwxrwx  1 root root       8 Jan 31  2018 nisdomainname -> hostname
-rwxr-xr-x  1 root root  146128 Mar 21  2019 ntfs-3g
-rwxr-xr-x  1 root root   10312 Mar 21  2019 ntfs-3g.probe
-rwxr-xr-x  1 root root   26728 Mar 21  2019 ntfscat
-rwxr-xr-x  1 root root   34920 Mar 21  2019 ntfscluster
-rwxr-xr-x  1 root root   34920 Mar 21  2019 ntfscmp
-rwxr-xr-x  1 root root   34928 Mar 21  2019 ntfsfallocate
-rwxr-xr-x  1 root root   43120 Mar 21  2019 ntfsfix
-rwxr-xr-x  1 root root   55416 Mar 21  2019 ntfsinfo
-rwxr-xr-x  1 root root   31928 Mar 21  2019 ntfsls
-rwxr-xr-x  1 root root   30824 Mar 21  2019 ntfsmove
-rwxr-xr-x  1 root root  116840 Mar 21  2019 ntfsrecover
-rwxr-xr-x  1 root root   88672 Mar 21  2019 ntfssecaudit
-rwxr-xr-x  1 root root   38944 Mar 21  2019 ntfstruncate
-rwxr-xr-x  1 root root   30744 Mar 21  2019 ntfsusermap
-rwxr-xr-x  1 root root   47752 Mar 21  2019 ntfswipe
lrwxrwxrwx  1 root root       6 Jan 22  2018 open -> openvt
-rwxr-xr-x  1 root root   18872 Jan 22  2018 openvt
lrwxrwxrwx  1 root root      14 Nov  1  2017 pidof -> /sbin/killall5
-rwsr-xr-x  1 root root   64424 Jun 28  2019 ping
lrwxrwxrwx  1 root root       4 Jun 28  2019 ping4 -> ping
lrwxrwxrwx  1 root root       4 Jun 28  2019 ping6 -> ping
-rwxr-xr-x  1 root root   38904 Apr  4  2019 plymouth
-rwxr-xr-x  1 root root  133432 Aug  9  2019 ps
-rwxr-xr-x  1 root root   35000 Jan 18  2018 pwd
lrwxrwxrwx  1 root root       4 Jun  6  2019 rbash -> bash
-rwxr-xr-x  1 root root   43192 Jan 18  2018 readlink
-rwxr-xr-x  1 root root      89 Apr 26  2016 red
-rwxr-xr-x  1 root root   63704 Jan 18  2018 rm
-rwxr-xr-x  1 root root   43192 Jan 18  2018 rmdir
lrwxrwxrwx  1 root root       4 Mar  6  2018 rnano -> nano
-rwxr-xr-x  1 root root   18760 Dec 30  2017 run-parts
-rwxr-xr-x  1 root root  109000 Jan 30  2018 sed
-rwxr-xr-x  1 root root   43144 Jan 22  2018 setfont
-rwxr-xr-x  1 root root   39103 Apr 23  2019 setupcon
lrwxrwxrwx  1 root root       4 Feb  4  2020 sh -> dash
lrwxrwxrwx  1 root root       4 Feb  4  2020 sh.distrib -> dash
-rwxr-xr-x  1 root root   35000 Jan 18  2018 sleep
-rwxr-xr-x  1 root root  139904 Jul 15 15:16 ss
lrwxrwxrwx  1 root root       7 Mar  6  2019 static-sh -> busybox
-rwxr-xr-x  1 root root   75992 Jan 18  2018 stty
-rwsr-xr-x  1 root root   44664 Mar 22  2019 su
-rwxr-xr-x  1 root root   35000 Jan 18  2018 sync
-rwxr-xr-x  1 root root  182352 Jul  8 18:59 systemctl
lrwxrwxrwx  1 root root      20 Jul  8 18:59 systemd -> /lib/systemd/systemd
-rwxr-xr-x  1 root root   10320 Jul  8 18:59 systemd-ask-password
-rwxr-xr-x  1 root root   14400 Jul  8 18:59 systemd-escape
-rwxr-xr-x  1 root root   84328 Jul  8 18:59 systemd-hwdb
-rwxr-xr-x  1 root root   14416 Jul  8 18:59 systemd-inhibit
-rwxr-xr-x  1 root root   18496 Jul  8 18:59 systemd-machine-id-setup
-rwxr-xr-x  1 root root   14408 Jul  8 18:59 systemd-notify
-rwxr-xr-x  1 root root   43080 Jul  8 18:59 systemd-sysusers
-rwxr-xr-x  1 root root   71752 Jul  8 18:59 systemd-tmpfiles
-rwxr-xr-x  1 root root   26696 Jul  8 18:59 systemd-tty-ask-password-agent
-rwxr-xr-x  1 root root  423312 Jan 21  2019 tar
-rwxr-xr-x  1 root root   10104 Dec 30  2017 tempfile
-rwxr-xr-x  1 root root   88280 Jan 18  2018 touch
-rwxr-xr-x  1 root root   30904 Jan 18  2018 true
-rwxr-xr-x  1 root root  584072 Jul  8 18:59 udevadm
-rwxr-xr-x  1 root root   14328 Aug 11  2016 ulockmgr_server
-rwsr-xr-x  1 root root   26696 Mar  5 17:23 umount
-rwxr-xr-x  1 root root   35032 Jan 18  2018 uname
-rwxr-xr-x  2 root root    2301 Apr 28  2017 uncompress
-rwxr-xr-x  1 root root    2762 Jan 22  2018 unicode_start
-rwxr-xr-x  1 root root  133792 Jan 18  2018 vdir
-rwxr-xr-x  1 root root   30800 Mar  5 17:23 wdctl
-rwxr-xr-x  1 root root     946 Dec 30  2017 which
-rwxr-xr-x  1 root root   26632 Jan 12  2018 whiptail
lrwxrwxrwx  1 root root       8 Jan 31  2018 ypdomainname -> hostname
-rwxr-xr-x  1 root root    1937 Apr 28  2017 zcat
-rwxr-xr-x  1 root root    1777 Apr 28  2017 zcmp
-rwxr-xr-x  1 root root    5764 Apr 28  2017 zdiff
-rwxr-xr-x  1 root root     140 Apr 28  2017 zegrep
-rwxr-xr-x  1 root root     140 Apr 28  2017 zfgrep
-rwxr-xr-x  1 root root    2131 Apr 28  2017 zforce
-rwxr-xr-x  1 root root    5938 Apr 28  2017 zgrep
-rwxr-xr-x  1 root root    2037 Apr 28  2017 zless
-rwxr-xr-x  1 root root    1910 Apr 28  2017 zmore
-rwxr-xr-x  1 root root    5047 Apr 28  2017 znew
+ /bin/java -version
/tmp/jenkins4182785546072810800.sh: 9: /tmp/jenkins4182785546072810800.sh: /bin/java: not found
Build step 'Execute shell' marked build as failure
[SpotBugs] Skipping execution of recorder since overall result is 'FAILURE'
Archiving artifacts
No JDK named ?IBM 1.8 64-bit (on Ubuntu only)? found
Skipping publisher since build result is FAILURE
Recording test results
No JDK named ?IBM 1.8 64-bit (on Ubuntu only)? found
ERROR: Step ?Publish JUnit test result report? failed: No test report files were found. Configuration error?
No JDK named ?IBM 1.8 64-bit (on Ubuntu only)? found
No JDK named ?IBM 1.8 64-bit (on Ubuntu only)? found

---------------------------------------------------------------------
To unsubscribe, e-mail: [hidden email]
For additional commands, e-mail: [hidden email]

Reply | Threaded
Open this post in threaded view
|

Build failed in Jenkins: POI » POI-DSL-IBM-JDK #2

Apache Jenkins Server
See <https://ci-builds.apache.org/job/POI/job/POI-DSL-IBM-JDK/2/display/redirect?page=changes>

Changes:

[Andreas Beeker] fix build error

[Andreas Beeker] use spotbugs in xmlbeans builds

[Andreas Beeker] Update library versions
Replace deprecated junit @Rules with assertThrows
Adapt to XMLSec refactoring in version 2.2.0

[Andreas Beeker] disable old "rapid release" Java versions

[Andreas Beeker] Activate Forbidden-Apis-Check also for other tests
Max supported Java version is currently Java 14
Fix the check failures

[Andreas Beeker] #64036 - Replace reflection calls in factories for Java 9+
provide EvalutionWorkbook in HSSF/XSSF/SXSSF

[Andreas Beeker] #64036 - Replace reflection calls in factories for Java 9+
ImageRenderer implementation are now loaded via ServiceLoader
fixed the ServiceLoader.load invocations to pass a sensible ClassLoader as OSGi preparation

[Andreas Beeker] removed test which is covered by TestPPTX2PNG

[Andreas Beeker] #64036 - Replace reflection calls in factories for Java 9+
ImageRenderer implementation are now loaded via ServiceLoader
fixed the ServiceLoader.load invocations to pass a sensible ClassLoader as OSGi preparation

[Andreas Beeker] #64036 - Replace reflection calls in factories for Java 9+
removed some unnecessary reflection calls OperationEvaluatorFactory

[Andreas Beeker] #64036 - Replace reflection calls in factories for Java 9+
migrated XDGF factories

[Andreas Beeker] fresh nodes on ci-builds ... maybe new luck?

[Andreas Beeker] try to fix no-scratchpad test

[Andreas Beeker] Update links to ci-builds.apache.org

[Andreas Beeker] Migrate JOB DSL to new Jenkins environment ci-builds.apache.org


------------------------------------------
[...truncated 10.92 KB...]
U         src/integrationtest/org/apache/poi/stress/XSSFFileHandler.java
U         src/integrationtest/org/apache/poi/stress/TestAllFiles.java
U         src/resources/devtools/forbidden-signatures-prod.txt
U         src/resources/devtools/forbidden-signatures.txt
A         src/resources/main/META-INF/services/org.apache.poi.sl.draw.ImageRenderer
A         src/resources/ooxml/META-INF/services/org.apache.poi.sl.draw.ImageRenderer
A         src/resources/scratchpad/META-INF/services/org.apache.poi.sl.draw.ImageRenderer
U         src/multimodule/ooxml/java9/module-info.class
U         src/multimodule/ooxml/java9/module-info.java
U         src/multimodule/ooxml/test9/module-info.class
U         src/multimodule/ooxml/test9/module-info.java
U         src/multimodule/poi/java9/module-info.class
U         src/multimodule/poi/java9/module-info.java
U         src/multimodule/poi/test9/module-info.class
U         src/multimodule/poi/test9/module-info.java
U         src/multimodule/scratchpad/java9/module-info.class
U         src/multimodule/scratchpad/java9/module-info.java
U         src/multimodule/scratchpad/test9/module-info.class
U         src/multimodule/scratchpad/test9/module-info.java

<-- Got one external: documentation, svn url: https://svn.apache.org/repos/asf/poi/site/src/documentation -->
Fetching 'https://svn.apache.org/repos/asf/poi/site/src/documentation' at -1 into '<https://ci-builds.apache.org/job/POI/job/POI-DSL-IBM-JDK/ws/src/documentation'>
U         src/documentation/content/xdocs/devel/subversion.xml
U         src/documentation/content/xdocs/download.xml
U         src/documentation/release-guide.txt
At revision 1881091


<-- Got one external: forrest.properties, svn url: https://svn.apache.org/repos/asf/poi/site/forrest.properties -->
Fetching 'https://svn.apache.org/repos/asf/poi/site/forrest.properties' at -1 into '<https://ci-builds.apache.org/job/POI/job/POI-DSL-IBM-JDK/ws/forrest.properties'>
At revision 1881091

At revision 1881091

No changes for https://svn.apache.org/repos/asf/poi/site/forrest.properties since the previous build
No JDK named ?IBM 1.8 64-bit (on Ubuntu only)? found
[POI-DSL-IBM-JDK] $ /bin/sh -xe /tmp/jenkins1165308921643666949.sh
+ svn status
    X   forrest.properties
X       src/documentation

Performing status on external item at 'src/documentation':
+ echo Java-Home:
Java-Home:
+ ls -al /
total 10297
drwxr-xr-x  25 root root     4096 Jul 21 06:59 .
drwxr-xr-x  25 root root     4096 Jul 21 06:59 ..
drwxr-xr-x   2 root root     4096 Aug  6 06:03 bin
drwxr-xr-x   4 root root     1024 Aug  7 06:23 boot
-rw-r--r--   1 root root      530 Feb  4  2020 chboot
drwxr-xr-x  20 root root     4040 Jul 15 13:47 dev
drwxr-xr-x 121 root root    12288 Aug 22 06:22 etc
drwxr-xr-x  11 root root     4096 Aug  9 05:36 home
lrwxrwxrwx   1 root root       34 Jul 21 06:59 initrd.img -> boot/initrd.img-4.15.0-112-generic
lrwxrwxrwx   1 root root       34 Jul 21 06:59 initrd.img.old -> boot/initrd.img-4.15.0-111-generic
drwxr-xr-x  19 root root     4096 Jul  6 18:46 lib
drwxr-xr-x   2 root root    12288 Jul  6 18:46 lib32
drwxr-xr-x   3 root root     4096 Jul  6 18:46 lib64
drwxr-xr-x   2 root root    12288 Jul  6 18:46 libx32
drwx------   2 root root    16384 Feb  4  2020 lost+found
drwxr-xr-x   2 root root     4096 Feb  4  2020 media
drwxr-xr-x   2 root root     4096 Feb  4  2020 mnt
drwxr-xr-x   9 root root     4096 Aug 19 20:06 opt
dr-xr-xr-x 364 root root        0 Jun 26 23:40 proc
-rw-r--r--   1 root root    11724 Jun 19  2019 puppet-release-bionic.deb
drwx------   6 root root     4096 Jun 25 17:46 root
drwxr-xr-x  31 root root     1120 Aug 23 07:00 run
drwxr-xr-x   2 root root    12288 Aug  6 06:02 sbin
drwxr-xr-x   8 root root     4096 Feb  7  2020 snap
drwxr-xr-x   2 root root     4096 Feb  4  2020 srv
dr-xr-xr-x  13 root root        0 Aug 16 07:32 sys
drwxrwxrwt   1 root root 10395648 Aug 23 07:29 tmp
drwxr-xr-x  15 root root     4096 Feb  7  2020 usr
drwxr-xr-x  13 root root     4096 Feb  7  2020 var
lrwxrwxrwx   1 root root       31 Jul 21 06:59 vmlinuz -> boot/vmlinuz-4.15.0-112-generic
lrwxrwxrwx   1 root root       31 Jul 21 06:59 vmlinuz.old -> boot/vmlinuz-4.15.0-111-generic
+ ls -al /bin
total 11580
drwxr-xr-x  2 root root    4096 Aug  6 06:03 .
drwxr-xr-x 25 root root    4096 Jul 21 06:59 ..
-rwxr-xr-x  1 root root 1113504 Jun  6  2019 bash
-rwxr-xr-x  3 root root   34888 Jul  4  2019 bunzip2
-rwxr-xr-x  1 root root 2062296 Mar  6  2019 busybox
-rwxr-xr-x  3 root root   34888 Jul  4  2019 bzcat
lrwxrwxrwx  1 root root       6 Jul  4  2019 bzcmp -> bzdiff
-rwxr-xr-x  1 root root    2140 Jul  4  2019 bzdiff
lrwxrwxrwx  1 root root       6 Jul  4  2019 bzegrep -> bzgrep
-rwxr-xr-x  1 root root    4877 Jul  4  2019 bzexe
lrwxrwxrwx  1 root root       6 Jul  4  2019 bzfgrep -> bzgrep
-rwxr-xr-x  1 root root    3642 Jul  4  2019 bzgrep
-rwxr-xr-x  3 root root   34888 Jul  4  2019 bzip2
-rwxr-xr-x  1 root root   14328 Jul  4  2019 bzip2recover
lrwxrwxrwx  1 root root       6 Jul  4  2019 bzless -> bzmore
-rwxr-xr-x  1 root root    1297 Jul  4  2019 bzmore
-rwxr-xr-x  1 root root   35064 Jan 18  2018 cat
-rwxr-xr-x  1 root root   63672 Jan 18  2018 chgrp
-rwxr-xr-x  1 root root   59608 Jan 18  2018 chmod
-rwxr-xr-x  1 root root   67768 Jan 18  2018 chown
-rwxr-xr-x  1 root root   10312 Jan 22  2018 chvt
-rwxr-xr-x  1 root root  141528 Jan 18  2018 cp
-rwxr-xr-x  1 root root  157224 Nov  5  2019 cpio
-rwxr-xr-x  1 root root  121432 Jan 25  2018 dash
-rwxr-xr-x  1 root root  100568 Jan 18  2018 date
-rwxr-xr-x  1 root root   76000 Jan 18  2018 dd
-rwxr-xr-x  1 root root   84776 Jan 18  2018 df
-rwxr-xr-x  1 root root  133792 Jan 18  2018 dir
-rwxr-xr-x  1 root root   72000 Mar  5 17:23 dmesg
lrwxrwxrwx  1 root root       8 Jan 31  2018 dnsdomainname -> hostname
lrwxrwxrwx  1 root root       8 Jan 31  2018 domainname -> hostname
-rwxr-xr-x  1 root root  170520 Jan 22  2018 dumpkeys
-rwxr-xr-x  1 root root   35000 Jan 18  2018 echo
-rwxr-xr-x  1 root root   51512 Apr 26  2016 ed
-rwxr-xr-x  1 root root      28 Sep 18  2019 egrep
-rwxr-xr-x  1 root root   30904 Jan 18  2018 false
-rwxr-xr-x  1 root root   10312 Jan 22  2018 fgconsole
-rwxr-xr-x  1 root root      28 Sep 18  2019 fgrep
-rwxr-xr-x  1 root root   64784 Mar  5 17:23 findmnt
-rwxr-xr-x  1 root root   35928 Dec 11  2018 fuser
-rwsr-xr-x  1 root root   30800 Aug 11  2016 fusermount
-rwxr-xr-x  1 root root  219456 Sep 18  2019 grep
-rwxr-xr-x  2 root root    2301 Apr 28  2017 gunzip
-rwxr-xr-x  1 root root    5927 Apr 28  2017 gzexe
-rwxr-xr-x  1 root root  101560 Apr 28  2017 gzip
-rwxr-xr-x  1 root root   18504 Jan 31  2018 hostname
-rwxr-xr-x  1 root root  558200 Jul 15 15:16 ip
-rwxr-xr-x  1 root root   63576 Jul  8 18:59 journalctl
-rwxr-xr-x  1 root root   10312 Jan 22  2018 kbd_mode
-rwxr-xr-x  1 root root   26704 Aug  9  2019 kill
-rwxr-xr-x  1 root root  149688 Jul 28 14:46 kmod
-rwxr-xr-x  1 root root  170760 Dec  1  2017 less
-rwxr-xr-x  1 root root   10256 Dec  1  2017 lessecho
lrwxrwxrwx  1 root root       8 Dec  1  2017 lessfile -> lesspipe
-rwxr-xr-x  1 root root   19856 Dec  1  2017 lesskey
-rwxr-xr-x  1 root root    8564 Dec  1  2017 lesspipe
-rwxr-xr-x  1 root root   67808 Jan 18  2018 ln
-rwxr-xr-x  1 root root  211528 Jan 22  2018 loadkeys
-rwxr-xr-x  1 root root   52664 Mar 22  2019 login
-rwxr-xr-x  1 root root   51280 Jul  8 18:59 loginctl
-rwxr-xr-x  1 root root  109232 Mar 21  2019 lowntfs-3g
-rwxr-xr-x  1 root root  133792 Jan 18  2018 ls
-rwxr-xr-x  1 root root   84048 Mar  5 17:23 lsblk
lrwxrwxrwx  1 root root       4 Jul 28 14:46 lsmod -> kmod
-rwxr-xr-x  1 root root   80056 Jan 18  2018 mkdir
-rwxr-xr-x  1 root root   67768 Jan 18  2018 mknod
-rwxr-xr-x  1 root root   43192 Jan 18  2018 mktemp
-rwxr-xr-x  1 root root   38952 Mar  5 17:23 more
-rwsr-xr-x  1 root root   43088 Mar  5 17:23 mount
-rwxr-xr-x  1 root root   14408 Mar  5 17:23 mountpoint
lrwxrwxrwx  1 root root      20 Feb  4  2020 mt -> /etc/alternatives/mt
-rwxr-xr-x  1 root root   80512 Nov  5  2019 mt-gnu
-rwxr-xr-x  1 root root  137440 Jan 18  2018 mv
-rwxr-xr-x  1 root root  245872 Mar  6  2018 nano
lrwxrwxrwx  1 root root      20 Feb  4  2020 nc -> /etc/alternatives/nc
-rwxr-xr-x  1 root root   35312 May 14  2018 nc.openbsd
lrwxrwxrwx  1 root root      24 Feb  4  2020 netcat -> /etc/alternatives/netcat
-rwxr-xr-x  1 root root  154192 Jan 10  2017 netstat
-rwxr-xr-x  1 root root   43080 Jul  8 18:59 networkctl
lrwxrwxrwx  1 root root       8 Jan 31  2018 nisdomainname -> hostname
-rwxr-xr-x  1 root root  146128 Mar 21  2019 ntfs-3g
-rwxr-xr-x  1 root root   10312 Mar 21  2019 ntfs-3g.probe
-rwxr-xr-x  1 root root   26728 Mar 21  2019 ntfscat
-rwxr-xr-x  1 root root   34920 Mar 21  2019 ntfscluster
-rwxr-xr-x  1 root root   34920 Mar 21  2019 ntfscmp
-rwxr-xr-x  1 root root   34928 Mar 21  2019 ntfsfallocate
-rwxr-xr-x  1 root root   43120 Mar 21  2019 ntfsfix
-rwxr-xr-x  1 root root   55416 Mar 21  2019 ntfsinfo
-rwxr-xr-x  1 root root   31928 Mar 21  2019 ntfsls
-rwxr-xr-x  1 root root   30824 Mar 21  2019 ntfsmove
-rwxr-xr-x  1 root root  116840 Mar 21  2019 ntfsrecover
-rwxr-xr-x  1 root root   88672 Mar 21  2019 ntfssecaudit
-rwxr-xr-x  1 root root   38944 Mar 21  2019 ntfstruncate
-rwxr-xr-x  1 root root   30744 Mar 21  2019 ntfsusermap
-rwxr-xr-x  1 root root   47752 Mar 21  2019 ntfswipe
lrwxrwxrwx  1 root root       6 Jan 22  2018 open -> openvt
-rwxr-xr-x  1 root root   18872 Jan 22  2018 openvt
lrwxrwxrwx  1 root root      14 Nov  1  2017 pidof -> /sbin/killall5
-rwsr-xr-x  1 root root   64424 Jun 28  2019 ping
lrwxrwxrwx  1 root root       4 Jun 28  2019 ping4 -> ping
lrwxrwxrwx  1 root root       4 Jun 28  2019 ping6 -> ping
-rwxr-xr-x  1 root root   38904 Apr  4  2019 plymouth
-rwxr-xr-x  1 root root  133432 Aug  9  2019 ps
-rwxr-xr-x  1 root root   35000 Jan 18  2018 pwd
lrwxrwxrwx  1 root root       4 Jun  6  2019 rbash -> bash
-rwxr-xr-x  1 root root   43192 Jan 18  2018 readlink
-rwxr-xr-x  1 root root      89 Apr 26  2016 red
-rwxr-xr-x  1 root root   63704 Jan 18  2018 rm
-rwxr-xr-x  1 root root   43192 Jan 18  2018 rmdir
lrwxrwxrwx  1 root root       4 Mar  6  2018 rnano -> nano
-rwxr-xr-x  1 root root   18760 Dec 30  2017 run-parts
-rwxr-xr-x  1 root root  109000 Jan 30  2018 sed
-rwxr-xr-x  1 root root   43144 Jan 22  2018 setfont
-rwxr-xr-x  1 root root   39103 Apr 23  2019 setupcon
lrwxrwxrwx  1 root root       4 Feb  4  2020 sh -> dash
lrwxrwxrwx  1 root root       4 Feb  4  2020 sh.distrib -> dash
-rwxr-xr-x  1 root root   35000 Jan 18  2018 sleep
-rwxr-xr-x  1 root root  139904 Jul 15 15:16 ss
lrwxrwxrwx  1 root root       7 Mar  6  2019 static-sh -> busybox
-rwxr-xr-x  1 root root   75992 Jan 18  2018 stty
-rwsr-xr-x  1 root root   44664 Mar 22  2019 su
-rwxr-xr-x  1 root root   35000 Jan 18  2018 sync
-rwxr-xr-x  1 root root  182352 Jul  8 18:59 systemctl
lrwxrwxrwx  1 root root      20 Jul  8 18:59 systemd -> /lib/systemd/systemd
-rwxr-xr-x  1 root root   10320 Jul  8 18:59 systemd-ask-password
-rwxr-xr-x  1 root root   14400 Jul  8 18:59 systemd-escape
-rwxr-xr-x  1 root root   84328 Jul  8 18:59 systemd-hwdb
-rwxr-xr-x  1 root root   14416 Jul  8 18:59 systemd-inhibit
-rwxr-xr-x  1 root root   18496 Jul  8 18:59 systemd-machine-id-setup
-rwxr-xr-x  1 root root   14408 Jul  8 18:59 systemd-notify
-rwxr-xr-x  1 root root   43080 Jul  8 18:59 systemd-sysusers
-rwxr-xr-x  1 root root   71752 Jul  8 18:59 systemd-tmpfiles
-rwxr-xr-x  1 root root   26696 Jul  8 18:59 systemd-tty-ask-password-agent
-rwxr-xr-x  1 root root  423312 Jan 21  2019 tar
-rwxr-xr-x  1 root root   10104 Dec 30  2017 tempfile
-rwxr-xr-x  1 root root   88280 Jan 18  2018 touch
-rwxr-xr-x  1 root root   30904 Jan 18  2018 true
-rwxr-xr-x  1 root root  584072 Jul  8 18:59 udevadm
-rwxr-xr-x  1 root root   14328 Aug 11  2016 ulockmgr_server
-rwsr-xr-x  1 root root   26696 Mar  5 17:23 umount
-rwxr-xr-x  1 root root   35032 Jan 18  2018 uname
-rwxr-xr-x  2 root root    2301 Apr 28  2017 uncompress
-rwxr-xr-x  1 root root    2762 Jan 22  2018 unicode_start
-rwxr-xr-x  1 root root  133792 Jan 18  2018 vdir
-rwxr-xr-x  1 root root   30800 Mar  5 17:23 wdctl
-rwxr-xr-x  1 root root     946 Dec 30  2017 which
-rwxr-xr-x  1 root root   26632 Jan 12  2018 whiptail
lrwxrwxrwx  1 root root       8 Jan 31  2018 ypdomainname -> hostname
-rwxr-xr-x  1 root root    1937 Apr 28  2017 zcat
-rwxr-xr-x  1 root root    1777 Apr 28  2017 zcmp
-rwxr-xr-x  1 root root    5764 Apr 28  2017 zdiff
-rwxr-xr-x  1 root root     140 Apr 28  2017 zegrep
-rwxr-xr-x  1 root root     140 Apr 28  2017 zfgrep
-rwxr-xr-x  1 root root    2131 Apr 28  2017 zforce
-rwxr-xr-x  1 root root    5938 Apr 28  2017 zgrep
-rwxr-xr-x  1 root root    2037 Apr 28  2017 zless
-rwxr-xr-x  1 root root    1910 Apr 28  2017 zmore
-rwxr-xr-x  1 root root    5047 Apr 28  2017 znew
+ /bin/java -version
/tmp/jenkins1165308921643666949.sh: 9: /tmp/jenkins1165308921643666949.sh: /bin/java: not found
Build step 'Execute shell' marked build as failure
[SpotBugs] Skipping execution of recorder since overall result is 'FAILURE'
Archiving artifacts
No JDK named ?IBM 1.8 64-bit (on Ubuntu only)? found
Skipping publisher since build result is FAILURE
Recording test results
No JDK named ?IBM 1.8 64-bit (on Ubuntu only)? found
ERROR: Step ?Publish JUnit test result report? failed: No test report files were found. Configuration error?
No JDK named ?IBM 1.8 64-bit (on Ubuntu only)? found
No JDK named ?IBM 1.8 64-bit (on Ubuntu only)? found

---------------------------------------------------------------------
To unsubscribe, e-mail: [hidden email]
For additional commands, e-mail: [hidden email]

Reply | Threaded
Open this post in threaded view
|

Build failed in Jenkins: POI » POI-DSL-IBM-JDK #3

Apache Jenkins Server
See <https://ci-builds.apache.org/job/POI/job/POI-DSL-IBM-JDK/3/display/redirect?page=changes>

Changes:

[PJ Fanning] [bug-64691] rename field

[Bida Fan] Add get/set indentationLeftChars/indentationRightChars in paragraph


------------------------------------------
[...truncated 23 B...]
No JDK named ?IBM 1.8 64-bit (on Ubuntu only)? found
[EnvInject] - Loading node environment variables.
[EnvInject] - Preparing an environment for the build.
[EnvInject] - Keeping Jenkins system variables.
[EnvInject] - Keeping Jenkins build variables.
[EnvInject] - Injecting as environment variables the properties content
LANG=en_US.UTF-8
FORREST_HOME=/home/jenkins/tools/forrest/latest

[EnvInject] - Variables injected successfully.
[EnvInject] - Injecting contributions.
Building remotely on H42 (ubuntu) in workspace <https://ci-builds.apache.org/job/POI/job/POI-DSL-IBM-JDK/ws/>
[WS-CLEANUP] Deleting project workspace...
[WS-CLEANUP] Done
No JDK named ?IBM 1.8 64-bit (on Ubuntu only)? found
Updating https://svn.apache.org/repos/asf/poi/trunk at revision '2020-08-30T07:28:15.827 +0000'
U         src/ooxml/java/org/apache/poi/xssf/usermodel/XSSFDataValidation.java
U         src/ooxml/java/org/apache/poi/xssf/usermodel/XSSFSheet.java
U         src/ooxml/java/org/apache/poi/xwpf/usermodel/XWPFParagraph.java
U         src/ooxml/testcases/org/apache/poi/xssf/usermodel/TestXSSFDataValidation.java
U         src/ooxml/testcases/org/apache/poi/xwpf/usermodel/TestXWPFParagraph.java

<-- Got one external: documentation, svn url: https://svn.apache.org/repos/asf/poi/site/src/documentation -->
Fetching 'https://svn.apache.org/repos/asf/poi/site/src/documentation' at -1 into '<https://ci-builds.apache.org/job/POI/job/POI-DSL-IBM-JDK/ws/src/documentation'>
At revision 1881314


<-- Got one external: forrest.properties, svn url: https://svn.apache.org/repos/asf/poi/site/forrest.properties -->
Fetching 'https://svn.apache.org/repos/asf/poi/site/forrest.properties' at -1 into '<https://ci-builds.apache.org/job/POI/job/POI-DSL-IBM-JDK/ws/forrest.properties'>
At revision 1881314

At revision 1881314

No changes for https://svn.apache.org/repos/asf/poi/site/src/documentation since the previous build
No changes for https://svn.apache.org/repos/asf/poi/site/forrest.properties since the previous build
No JDK named ?IBM 1.8 64-bit (on Ubuntu only)? found
[POI-DSL-IBM-JDK] $ /bin/sh -xe /tmp/jenkins7348595771250742568.sh
+ svn status
    X   forrest.properties
X       src/documentation

Performing status on external item at 'src/documentation':
+ echo Java-Home:
Java-Home:
+ ls -al /
total 10297
drwxr-xr-x  25 root root     4096 Jul 21 06:59 .
drwxr-xr-x  25 root root     4096 Jul 21 06:59 ..
drwxr-xr-x   2 root root     4096 Aug  6 06:03 bin
drwxr-xr-x   4 root root     1024 Aug  7 06:23 boot
-rw-r--r--   1 root root      530 Feb  4  2020 chboot
drwxr-xr-x  20 root root     4040 Jul 15 13:47 dev
drwxr-xr-x 121 root root    12288 Aug 28 06:13 etc
drwxr-xr-x  11 root root     4096 Aug  9 05:36 home
lrwxrwxrwx   1 root root       34 Jul 21 06:59 initrd.img -> boot/initrd.img-4.15.0-112-generic
lrwxrwxrwx   1 root root       34 Jul 21 06:59 initrd.img.old -> boot/initrd.img-4.15.0-111-generic
drwxr-xr-x  19 root root     4096 Jul  6 18:46 lib
drwxr-xr-x   2 root root    12288 Jul  6 18:46 lib32
drwxr-xr-x   3 root root     4096 Jul  6 18:46 lib64
drwxr-xr-x   2 root root    12288 Jul  6 18:46 libx32
drwx------   2 root root    16384 Feb  4  2020 lost+found
drwxr-xr-x   2 root root     4096 Feb  4  2020 media
drwxr-xr-x   2 root root     4096 Feb  4  2020 mnt
drwxr-xr-x  10 root root     4096 Aug 28 14:33 opt
dr-xr-xr-x 359 root root        0 Jun 26 23:40 proc
-rw-r--r--   1 root root    11724 Jun 19  2019 puppet-release-bionic.deb
drwx------   6 root root     4096 Jun 25 17:46 root
drwxr-xr-x  31 root root     1100 Aug 30 06:18 run
drwxr-xr-x   2 root root    12288 Aug 26 06:45 sbin
drwxr-xr-x   8 root root     4096 Feb  7  2020 snap
drwxr-xr-x   2 root root     4096 Feb  4  2020 srv
dr-xr-xr-x  13 root root        0 Aug 16 07:32 sys
drwxrwxrwt   1 root root 10395648 Aug 30 07:28 tmp
drwxr-xr-x  15 root root     4096 Feb  7  2020 usr
drwxr-xr-x  13 root root     4096 Feb  7  2020 var
lrwxrwxrwx   1 root root       31 Jul 21 06:59 vmlinuz -> boot/vmlinuz-4.15.0-112-generic
lrwxrwxrwx   1 root root       31 Jul 21 06:59 vmlinuz.old -> boot/vmlinuz-4.15.0-111-generic
+ ls -al /bin
total 11580
drwxr-xr-x  2 root root    4096 Aug  6 06:03 .
drwxr-xr-x 25 root root    4096 Jul 21 06:59 ..
-rwxr-xr-x  1 root root 1113504 Jun  6  2019 bash
-rwxr-xr-x  3 root root   34888 Jul  4  2019 bunzip2
-rwxr-xr-x  1 root root 2062296 Mar  6  2019 busybox
-rwxr-xr-x  3 root root   34888 Jul  4  2019 bzcat
lrwxrwxrwx  1 root root       6 Jul  4  2019 bzcmp -> bzdiff
-rwxr-xr-x  1 root root    2140 Jul  4  2019 bzdiff
lrwxrwxrwx  1 root root       6 Jul  4  2019 bzegrep -> bzgrep
-rwxr-xr-x  1 root root    4877 Jul  4  2019 bzexe
lrwxrwxrwx  1 root root       6 Jul  4  2019 bzfgrep -> bzgrep
-rwxr-xr-x  1 root root    3642 Jul  4  2019 bzgrep
-rwxr-xr-x  3 root root   34888 Jul  4  2019 bzip2
-rwxr-xr-x  1 root root   14328 Jul  4  2019 bzip2recover
lrwxrwxrwx  1 root root       6 Jul  4  2019 bzless -> bzmore
-rwxr-xr-x  1 root root    1297 Jul  4  2019 bzmore
-rwxr-xr-x  1 root root   35064 Jan 18  2018 cat
-rwxr-xr-x  1 root root   63672 Jan 18  2018 chgrp
-rwxr-xr-x  1 root root   59608 Jan 18  2018 chmod
-rwxr-xr-x  1 root root   67768 Jan 18  2018 chown
-rwxr-xr-x  1 root root   10312 Jan 22  2018 chvt
-rwxr-xr-x  1 root root  141528 Jan 18  2018 cp
-rwxr-xr-x  1 root root  157224 Nov  5  2019 cpio
-rwxr-xr-x  1 root root  121432 Jan 25  2018 dash
-rwxr-xr-x  1 root root  100568 Jan 18  2018 date
-rwxr-xr-x  1 root root   76000 Jan 18  2018 dd
-rwxr-xr-x  1 root root   84776 Jan 18  2018 df
-rwxr-xr-x  1 root root  133792 Jan 18  2018 dir
-rwxr-xr-x  1 root root   72000 Mar  5 17:23 dmesg
lrwxrwxrwx  1 root root       8 Jan 31  2018 dnsdomainname -> hostname
lrwxrwxrwx  1 root root       8 Jan 31  2018 domainname -> hostname
-rwxr-xr-x  1 root root  170520 Jan 22  2018 dumpkeys
-rwxr-xr-x  1 root root   35000 Jan 18  2018 echo
-rwxr-xr-x  1 root root   51512 Apr 26  2016 ed
-rwxr-xr-x  1 root root      28 Sep 18  2019 egrep
-rwxr-xr-x  1 root root   30904 Jan 18  2018 false
-rwxr-xr-x  1 root root   10312 Jan 22  2018 fgconsole
-rwxr-xr-x  1 root root      28 Sep 18  2019 fgrep
-rwxr-xr-x  1 root root   64784 Mar  5 17:23 findmnt
-rwxr-xr-x  1 root root   35928 Dec 11  2018 fuser
-rwsr-xr-x  1 root root   30800 Aug 11  2016 fusermount
-rwxr-xr-x  1 root root  219456 Sep 18  2019 grep
-rwxr-xr-x  2 root root    2301 Apr 28  2017 gunzip
-rwxr-xr-x  1 root root    5927 Apr 28  2017 gzexe
-rwxr-xr-x  1 root root  101560 Apr 28  2017 gzip
-rwxr-xr-x  1 root root   18504 Jan 31  2018 hostname
-rwxr-xr-x  1 root root  558200 Jul 15 15:16 ip
-rwxr-xr-x  1 root root   63576 Jul  8 18:59 journalctl
-rwxr-xr-x  1 root root   10312 Jan 22  2018 kbd_mode
-rwxr-xr-x  1 root root   26704 Aug  9  2019 kill
-rwxr-xr-x  1 root root  149688 Jul 28 14:46 kmod
-rwxr-xr-x  1 root root  170760 Dec  1  2017 less
-rwxr-xr-x  1 root root   10256 Dec  1  2017 lessecho
lrwxrwxrwx  1 root root       8 Dec  1  2017 lessfile -> lesspipe
-rwxr-xr-x  1 root root   19856 Dec  1  2017 lesskey
-rwxr-xr-x  1 root root    8564 Dec  1  2017 lesspipe
-rwxr-xr-x  1 root root   67808 Jan 18  2018 ln
-rwxr-xr-x  1 root root  211528 Jan 22  2018 loadkeys
-rwxr-xr-x  1 root root   52664 Mar 22  2019 login
-rwxr-xr-x  1 root root   51280 Jul  8 18:59 loginctl
-rwxr-xr-x  1 root root  109232 Mar 21  2019 lowntfs-3g
-rwxr-xr-x  1 root root  133792 Jan 18  2018 ls
-rwxr-xr-x  1 root root   84048 Mar  5 17:23 lsblk
lrwxrwxrwx  1 root root       4 Jul 28 14:46 lsmod -> kmod
-rwxr-xr-x  1 root root   80056 Jan 18  2018 mkdir
-rwxr-xr-x  1 root root   67768 Jan 18  2018 mknod
-rwxr-xr-x  1 root root   43192 Jan 18  2018 mktemp
-rwxr-xr-x  1 root root   38952 Mar  5 17:23 more
-rwsr-xr-x  1 root root   43088 Mar  5 17:23 mount
-rwxr-xr-x  1 root root   14408 Mar  5 17:23 mountpoint
lrwxrwxrwx  1 root root      20 Feb  4  2020 mt -> /etc/alternatives/mt
-rwxr-xr-x  1 root root   80512 Nov  5  2019 mt-gnu
-rwxr-xr-x  1 root root  137440 Jan 18  2018 mv
-rwxr-xr-x  1 root root  245872 Mar  6  2018 nano
lrwxrwxrwx  1 root root      20 Feb  4  2020 nc -> /etc/alternatives/nc
-rwxr-xr-x  1 root root   35312 May 14  2018 nc.openbsd
lrwxrwxrwx  1 root root      24 Feb  4  2020 netcat -> /etc/alternatives/netcat
-rwxr-xr-x  1 root root  154192 Jan 10  2017 netstat
-rwxr-xr-x  1 root root   43080 Jul  8 18:59 networkctl
lrwxrwxrwx  1 root root       8 Jan 31  2018 nisdomainname -> hostname
-rwxr-xr-x  1 root root  146128 Mar 21  2019 ntfs-3g
-rwxr-xr-x  1 root root   10312 Mar 21  2019 ntfs-3g.probe
-rwxr-xr-x  1 root root   26728 Mar 21  2019 ntfscat
-rwxr-xr-x  1 root root   34920 Mar 21  2019 ntfscluster
-rwxr-xr-x  1 root root   34920 Mar 21  2019 ntfscmp
-rwxr-xr-x  1 root root   34928 Mar 21  2019 ntfsfallocate
-rwxr-xr-x  1 root root   43120 Mar 21  2019 ntfsfix
-rwxr-xr-x  1 root root   55416 Mar 21  2019 ntfsinfo
-rwxr-xr-x  1 root root   31928 Mar 21  2019 ntfsls
-rwxr-xr-x  1 root root   30824 Mar 21  2019 ntfsmove
-rwxr-xr-x  1 root root  116840 Mar 21  2019 ntfsrecover
-rwxr-xr-x  1 root root   88672 Mar 21  2019 ntfssecaudit
-rwxr-xr-x  1 root root   38944 Mar 21  2019 ntfstruncate
-rwxr-xr-x  1 root root   30744 Mar 21  2019 ntfsusermap
-rwxr-xr-x  1 root root   47752 Mar 21  2019 ntfswipe
lrwxrwxrwx  1 root root       6 Jan 22  2018 open -> openvt
-rwxr-xr-x  1 root root   18872 Jan 22  2018 openvt
lrwxrwxrwx  1 root root      14 Nov  1  2017 pidof -> /sbin/killall5
-rwsr-xr-x  1 root root   64424 Jun 28  2019 ping
lrwxrwxrwx  1 root root       4 Jun 28  2019 ping4 -> ping
lrwxrwxrwx  1 root root       4 Jun 28  2019 ping6 -> ping
-rwxr-xr-x  1 root root   38904 Apr  4  2019 plymouth
-rwxr-xr-x  1 root root  133432 Aug  9  2019 ps
-rwxr-xr-x  1 root root   35000 Jan 18  2018 pwd
lrwxrwxrwx  1 root root       4 Jun  6  2019 rbash -> bash
-rwxr-xr-x  1 root root   43192 Jan 18  2018 readlink
-rwxr-xr-x  1 root root      89 Apr 26  2016 red
-rwxr-xr-x  1 root root   63704 Jan 18  2018 rm
-rwxr-xr-x  1 root root   43192 Jan 18  2018 rmdir
lrwxrwxrwx  1 root root       4 Mar  6  2018 rnano -> nano
-rwxr-xr-x  1 root root   18760 Dec 30  2017 run-parts
-rwxr-xr-x  1 root root  109000 Jan 30  2018 sed
-rwxr-xr-x  1 root root   43144 Jan 22  2018 setfont
-rwxr-xr-x  1 root root   39103 Apr 23  2019 setupcon
lrwxrwxrwx  1 root root       4 Feb  4  2020 sh -> dash
lrwxrwxrwx  1 root root       4 Feb  4  2020 sh.distrib -> dash
-rwxr-xr-x  1 root root   35000 Jan 18  2018 sleep
-rwxr-xr-x  1 root root  139904 Jul 15 15:16 ss
lrwxrwxrwx  1 root root       7 Mar  6  2019 static-sh -> busybox
-rwxr-xr-x  1 root root   75992 Jan 18  2018 stty
-rwsr-xr-x  1 root root   44664 Mar 22  2019 su
-rwxr-xr-x  1 root root   35000 Jan 18  2018 sync
-rwxr-xr-x  1 root root  182352 Jul  8 18:59 systemctl
lrwxrwxrwx  1 root root      20 Jul  8 18:59 systemd -> /lib/systemd/systemd
-rwxr-xr-x  1 root root   10320 Jul  8 18:59 systemd-ask-password
-rwxr-xr-x  1 root root   14400 Jul  8 18:59 systemd-escape
-rwxr-xr-x  1 root root   84328 Jul  8 18:59 systemd-hwdb
-rwxr-xr-x  1 root root   14416 Jul  8 18:59 systemd-inhibit
-rwxr-xr-x  1 root root   18496 Jul  8 18:59 systemd-machine-id-setup
-rwxr-xr-x  1 root root   14408 Jul  8 18:59 systemd-notify
-rwxr-xr-x  1 root root   43080 Jul  8 18:59 systemd-sysusers
-rwxr-xr-x  1 root root   71752 Jul  8 18:59 systemd-tmpfiles
-rwxr-xr-x  1 root root   26696 Jul  8 18:59 systemd-tty-ask-password-agent
-rwxr-xr-x  1 root root  423312 Jan 21  2019 tar
-rwxr-xr-x  1 root root   10104 Dec 30  2017 tempfile
-rwxr-xr-x  1 root root   88280 Jan 18  2018 touch
-rwxr-xr-x  1 root root   30904 Jan 18  2018 true
-rwxr-xr-x  1 root root  584072 Jul  8 18:59 udevadm
-rwxr-xr-x  1 root root   14328 Aug 11  2016 ulockmgr_server
-rwsr-xr-x  1 root root   26696 Mar  5 17:23 umount
-rwxr-xr-x  1 root root   35032 Jan 18  2018 uname
-rwxr-xr-x  2 root root    2301 Apr 28  2017 uncompress
-rwxr-xr-x  1 root root    2762 Jan 22  2018 unicode_start
-rwxr-xr-x  1 root root  133792 Jan 18  2018 vdir
-rwxr-xr-x  1 root root   30800 Mar  5 17:23 wdctl
-rwxr-xr-x  1 root root     946 Dec 30  2017 which
-rwxr-xr-x  1 root root   26632 Jan 12  2018 whiptail
lrwxrwxrwx  1 root root       8 Jan 31  2018 ypdomainname -> hostname
-rwxr-xr-x  1 root root    1937 Apr 28  2017 zcat
-rwxr-xr-x  1 root root    1777 Apr 28  2017 zcmp
-rwxr-xr-x  1 root root    5764 Apr 28  2017 zdiff
-rwxr-xr-x  1 root root     140 Apr 28  2017 zegrep
-rwxr-xr-x  1 root root     140 Apr 28  2017 zfgrep
-rwxr-xr-x  1 root root    2131 Apr 28  2017 zforce
-rwxr-xr-x  1 root root    5938 Apr 28  2017 zgrep
-rwxr-xr-x  1 root root    2037 Apr 28  2017 zless
-rwxr-xr-x  1 root root    1910 Apr 28  2017 zmore
-rwxr-xr-x  1 root root    5047 Apr 28  2017 znew
+ /bin/java -version
/tmp/jenkins7348595771250742568.sh: 9: /tmp/jenkins7348595771250742568.sh: /bin/java: not found
Build step 'Execute shell' marked build as failure
[SpotBugs] Skipping execution of recorder since overall result is 'FAILURE'
Archiving artifacts
No JDK named ?IBM 1.8 64-bit (on Ubuntu only)? found
Skipping publisher since build result is FAILURE
Recording test results
No JDK named ?IBM 1.8 64-bit (on Ubuntu only)? found
ERROR: Step ?Publish JUnit test result report? failed: No test report files were found. Configuration error?
No JDK named ?IBM 1.8 64-bit (on Ubuntu only)? found
No JDK named ?IBM 1.8 64-bit (on Ubuntu only)? found

---------------------------------------------------------------------
To unsubscribe, e-mail: [hidden email]
For additional commands, e-mail: [hidden email]

Reply | Threaded
Open this post in threaded view
|

Build failed in Jenkins: POI » POI-DSL-IBM-JDK #4

Apache Jenkins Server
See <https://ci-builds.apache.org/job/POI/job/POI-DSL-IBM-JDK/4/display/redirect?page=changes>

Changes:

[Andreas Beeker] PPTXPNG - simplify instructions, now that auxiliary are in the binary bundle

[Andreas Beeker] PPTXPNG - parent directory of relative input file was null

[Andreas Beeker] add "provided" jars to binary dist bundle
add instruction to pptx rendering
case-insensitive argument handling in PPTX2PNG

[Andreas Beeker] fix typo

[Andreas Beeker] Adapt to new XmlBeans changes of r1881383

[PJ Fanning] [github-192] Fix DOUGHNUT chart creation. Thanks to Tomás Cerdá. This closes #192

[Bida Fan] CTRow removes tc when row removes cell

[Andreas Beeker] #64693 - POI HwmfGraphics cannot read the embedded document title


------------------------------------------
[...truncated 1.54 KB...]
U         src/ooxml/testcases/org/apache/poi/xwpf/usermodel/TestXWPFTableRow.java
U         src/ooxml/testcases/org/apache/poi/xslf/usermodel/TestPPTX2PNG.java
U         src/java/org/apache/poi/sl/draw/Drawable.java
U         src/java/org/apache/poi/sl/draw/ImageRenderer.java
U         src/java/org/apache/poi/util/GenericRecordJsonWriter.java
U         src/resources/devtools/forbidden-signatures.txt
U         src/scratchpad/src/org/apache/poi/hemf/draw/HemfImageRenderer.java
U         src/scratchpad/src/org/apache/poi/hemf/record/emf/HemfComment.java
U         src/scratchpad/src/org/apache/poi/hemf/record/emf/HemfText.java
U         src/scratchpad/src/org/apache/poi/hemf/record/emfplus/HemfPlusDraw.java
U         src/scratchpad/src/org/apache/poi/hemf/usermodel/HemfPicture.java
U         src/scratchpad/src/org/apache/poi/hwmf/draw/HwmfGraphics.java
U         src/scratchpad/src/org/apache/poi/hwmf/draw/HwmfImageRenderer.java
U         src/scratchpad/src/org/apache/poi/hwmf/record/HwmfBitmapDib.java
U         src/scratchpad/src/org/apache/poi/hwmf/record/HwmfText.java
AU        src/scratchpad/src/org/apache/poi/hwmf/usermodel/HwmfCharsetAware.java
U         src/scratchpad/src/org/apache/poi/hwmf/usermodel/HwmfPicture.java
U         src/testcases/org/apache/poi/poifs/filesystem/TestFileMagic.java
U         build.xml
AU        test-data/slideshow/bug64693.pptx

<-- Got one external: documentation, svn url: https://svn.apache.org/repos/asf/poi/site/src/documentation -->
Fetching 'https://svn.apache.org/repos/asf/poi/site/src/documentation' at -1 into '<https://ci-builds.apache.org/job/POI/job/POI-DSL-IBM-JDK/ws/src/documentation'>
U         src/documentation/content/xdocs/components/slideshow/ppt-wmf-emf-renderer.xml
U         src/documentation/content/xdocs/changes.xml
At revision 1881506


<-- Got one external: forrest.properties, svn url: https://svn.apache.org/repos/asf/poi/site/forrest.properties -->
Fetching 'https://svn.apache.org/repos/asf/poi/site/forrest.properties' at -1 into '<https://ci-builds.apache.org/job/POI/job/POI-DSL-IBM-JDK/ws/forrest.properties'>
At revision 1881506

At revision 1881506

No changes for https://svn.apache.org/repos/asf/poi/site/forrest.properties since the previous build
No JDK named ?IBM 1.8 64-bit (on Ubuntu only)? found
[POI-DSL-IBM-JDK] $ /bin/sh -xe /tmp/jenkins1630750077097735675.sh
+ svn status
    X   forrest.properties
X       src/documentation

Performing status on external item at 'src/documentation':
+ echo Java-Home:
Java-Home:
+ ls -al /
total 10297
drwxr-xr-x  25 root root     4096 Sep  2 06:13 .
drwxr-xr-x  25 root root     4096 Sep  2 06:13 ..
drwxr-xr-x   2 root root     4096 Aug  6 06:03 bin
drwxr-xr-x   4 root root     1024 Sep  4 06:03 boot
-rw-r--r--   1 root root      530 Feb  4  2020 chboot
drwxr-xr-x  20 root root     4040 Jul 15 13:47 dev
drwxr-xr-x 121 root root    12288 Sep  4 06:04 etc
drwxr-xr-x  11 root root     4096 Aug  9 05:36 home
lrwxrwxrwx   1 root root       34 Sep  2 06:13 initrd.img -> boot/initrd.img-4.15.0-115-generic
lrwxrwxrwx   1 root root       34 Sep  2 06:13 initrd.img.old -> boot/initrd.img-4.15.0-112-generic
drwxr-xr-x  19 root root     4096 Jul  6 18:46 lib
drwxr-xr-x   2 root root    12288 Jul  6 18:46 lib32
drwxr-xr-x   3 root root     4096 Jul  6 18:46 lib64
drwxr-xr-x   2 root root    12288 Jul  6 18:46 libx32
drwx------   2 root root    16384 Feb  4  2020 lost+found
drwxr-xr-x   2 root root     4096 Feb  4  2020 media
drwxr-xr-x   2 root root     4096 Feb  4  2020 mnt
drwxr-xr-x  10 root root     4096 Aug 28 14:33 opt
dr-xr-xr-x 363 root root        0 Jun 26 23:40 proc
-rw-r--r--   1 root root    11724 Jun 19  2019 puppet-release-bionic.deb
drwx------   6 root root     4096 Jun 25 17:46 root
drwxr-xr-x  31 root root     1100 Sep  6 06:45 run
drwxr-xr-x   2 root root    12288 Aug 26 06:45 sbin
drwxr-xr-x   8 root root     4096 Feb  7  2020 snap
drwxr-xr-x   2 root root     4096 Feb  4  2020 srv
dr-xr-xr-x  13 root root        0 Aug 16 07:32 sys
drwxrwxrwt   1 root root 10395648 Sep  6 07:28 tmp
drwxr-xr-x  15 root root     4096 Feb  7  2020 usr
drwxr-xr-x  13 root root     4096 Feb  7  2020 var
lrwxrwxrwx   1 root root       31 Sep  2 06:13 vmlinuz -> boot/vmlinuz-4.15.0-115-generic
lrwxrwxrwx   1 root root       31 Sep  2 06:13 vmlinuz.old -> boot/vmlinuz-4.15.0-112-generic
+ ls -al /bin
total 11580
drwxr-xr-x  2 root root    4096 Aug  6 06:03 .
drwxr-xr-x 25 root root    4096 Sep  2 06:13 ..
-rwxr-xr-x  1 root root 1113504 Jun  6  2019 bash
-rwxr-xr-x  3 root root   34888 Jul  4  2019 bunzip2
-rwxr-xr-x  1 root root 2062296 Mar  6  2019 busybox
-rwxr-xr-x  3 root root   34888 Jul  4  2019 bzcat
lrwxrwxrwx  1 root root       6 Jul  4  2019 bzcmp -> bzdiff
-rwxr-xr-x  1 root root    2140 Jul  4  2019 bzdiff
lrwxrwxrwx  1 root root       6 Jul  4  2019 bzegrep -> bzgrep
-rwxr-xr-x  1 root root    4877 Jul  4  2019 bzexe
lrwxrwxrwx  1 root root       6 Jul  4  2019 bzfgrep -> bzgrep
-rwxr-xr-x  1 root root    3642 Jul  4  2019 bzgrep
-rwxr-xr-x  3 root root   34888 Jul  4  2019 bzip2
-rwxr-xr-x  1 root root   14328 Jul  4  2019 bzip2recover
lrwxrwxrwx  1 root root       6 Jul  4  2019 bzless -> bzmore
-rwxr-xr-x  1 root root    1297 Jul  4  2019 bzmore
-rwxr-xr-x  1 root root   35064 Jan 18  2018 cat
-rwxr-xr-x  1 root root   63672 Jan 18  2018 chgrp
-rwxr-xr-x  1 root root   59608 Jan 18  2018 chmod
-rwxr-xr-x  1 root root   67768 Jan 18  2018 chown
-rwxr-xr-x  1 root root   10312 Jan 22  2018 chvt
-rwxr-xr-x  1 root root  141528 Jan 18  2018 cp
-rwxr-xr-x  1 root root  157224 Nov  5  2019 cpio
-rwxr-xr-x  1 root root  121432 Jan 25  2018 dash
-rwxr-xr-x  1 root root  100568 Jan 18  2018 date
-rwxr-xr-x  1 root root   76000 Jan 18  2018 dd
-rwxr-xr-x  1 root root   84776 Jan 18  2018 df
-rwxr-xr-x  1 root root  133792 Jan 18  2018 dir
-rwxr-xr-x  1 root root   72000 Mar  5  2020 dmesg
lrwxrwxrwx  1 root root       8 Jan 31  2018 dnsdomainname -> hostname
lrwxrwxrwx  1 root root       8 Jan 31  2018 domainname -> hostname
-rwxr-xr-x  1 root root  170520 Jan 22  2018 dumpkeys
-rwxr-xr-x  1 root root   35000 Jan 18  2018 echo
-rwxr-xr-x  1 root root   51512 Apr 26  2016 ed
-rwxr-xr-x  1 root root      28 Sep 18  2019 egrep
-rwxr-xr-x  1 root root   30904 Jan 18  2018 false
-rwxr-xr-x  1 root root   10312 Jan 22  2018 fgconsole
-rwxr-xr-x  1 root root      28 Sep 18  2019 fgrep
-rwxr-xr-x  1 root root   64784 Mar  5  2020 findmnt
-rwxr-xr-x  1 root root   35928 Dec 11  2018 fuser
-rwsr-xr-x  1 root root   30800 Aug 11  2016 fusermount
-rwxr-xr-x  1 root root  219456 Sep 18  2019 grep
-rwxr-xr-x  2 root root    2301 Apr 28  2017 gunzip
-rwxr-xr-x  1 root root    5927 Apr 28  2017 gzexe
-rwxr-xr-x  1 root root  101560 Apr 28  2017 gzip
-rwxr-xr-x  1 root root   18504 Jan 31  2018 hostname
-rwxr-xr-x  1 root root  558200 Jul 15 15:16 ip
-rwxr-xr-x  1 root root   63576 Jul  8 18:59 journalctl
-rwxr-xr-x  1 root root   10312 Jan 22  2018 kbd_mode
-rwxr-xr-x  1 root root   26704 Aug  9  2019 kill
-rwxr-xr-x  1 root root  149688 Jul 28 14:46 kmod
-rwxr-xr-x  1 root root  170760 Dec  1  2017 less
-rwxr-xr-x  1 root root   10256 Dec  1  2017 lessecho
lrwxrwxrwx  1 root root       8 Dec  1  2017 lessfile -> lesspipe
-rwxr-xr-x  1 root root   19856 Dec  1  2017 lesskey
-rwxr-xr-x  1 root root    8564 Dec  1  2017 lesspipe
-rwxr-xr-x  1 root root   67808 Jan 18  2018 ln
-rwxr-xr-x  1 root root  211528 Jan 22  2018 loadkeys
-rwxr-xr-x  1 root root   52664 Mar 22  2019 login
-rwxr-xr-x  1 root root   51280 Jul  8 18:59 loginctl
-rwxr-xr-x  1 root root  109232 Mar 21  2019 lowntfs-3g
-rwxr-xr-x  1 root root  133792 Jan 18  2018 ls
-rwxr-xr-x  1 root root   84048 Mar  5  2020 lsblk
lrwxrwxrwx  1 root root       4 Jul 28 14:46 lsmod -> kmod
-rwxr-xr-x  1 root root   80056 Jan 18  2018 mkdir
-rwxr-xr-x  1 root root   67768 Jan 18  2018 mknod
-rwxr-xr-x  1 root root   43192 Jan 18  2018 mktemp
-rwxr-xr-x  1 root root   38952 Mar  5  2020 more
-rwsr-xr-x  1 root root   43088 Mar  5  2020 mount
-rwxr-xr-x  1 root root   14408 Mar  5  2020 mountpoint
lrwxrwxrwx  1 root root      20 Feb  4  2020 mt -> /etc/alternatives/mt
-rwxr-xr-x  1 root root   80512 Nov  5  2019 mt-gnu
-rwxr-xr-x  1 root root  137440 Jan 18  2018 mv
-rwxr-xr-x  1 root root  245872 Mar  6  2018 nano
lrwxrwxrwx  1 root root      20 Feb  4  2020 nc -> /etc/alternatives/nc
-rwxr-xr-x  1 root root   35312 May 14  2018 nc.openbsd
lrwxrwxrwx  1 root root      24 Feb  4  2020 netcat -> /etc/alternatives/netcat
-rwxr-xr-x  1 root root  154192 Jan 10  2017 netstat
-rwxr-xr-x  1 root root   43080 Jul  8 18:59 networkctl
lrwxrwxrwx  1 root root       8 Jan 31  2018 nisdomainname -> hostname
-rwxr-xr-x  1 root root  146128 Mar 21  2019 ntfs-3g
-rwxr-xr-x  1 root root   10312 Mar 21  2019 ntfs-3g.probe
-rwxr-xr-x  1 root root   26728 Mar 21  2019 ntfscat
-rwxr-xr-x  1 root root   34920 Mar 21  2019 ntfscluster
-rwxr-xr-x  1 root root   34920 Mar 21  2019 ntfscmp
-rwxr-xr-x  1 root root   34928 Mar 21  2019 ntfsfallocate
-rwxr-xr-x  1 root root   43120 Mar 21  2019 ntfsfix
-rwxr-xr-x  1 root root   55416 Mar 21  2019 ntfsinfo
-rwxr-xr-x  1 root root   31928 Mar 21  2019 ntfsls
-rwxr-xr-x  1 root root   30824 Mar 21  2019 ntfsmove
-rwxr-xr-x  1 root root  116840 Mar 21  2019 ntfsrecover
-rwxr-xr-x  1 root root   88672 Mar 21  2019 ntfssecaudit
-rwxr-xr-x  1 root root   38944 Mar 21  2019 ntfstruncate
-rwxr-xr-x  1 root root   30744 Mar 21  2019 ntfsusermap
-rwxr-xr-x  1 root root   47752 Mar 21  2019 ntfswipe
lrwxrwxrwx  1 root root       6 Jan 22  2018 open -> openvt
-rwxr-xr-x  1 root root   18872 Jan 22  2018 openvt
lrwxrwxrwx  1 root root      14 Nov  1  2017 pidof -> /sbin/killall5
-rwsr-xr-x  1 root root   64424 Jun 28  2019 ping
lrwxrwxrwx  1 root root       4 Jun 28  2019 ping4 -> ping
lrwxrwxrwx  1 root root       4 Jun 28  2019 ping6 -> ping
-rwxr-xr-x  1 root root   38904 Apr  4  2019 plymouth
-rwxr-xr-x  1 root root  133432 Aug  9  2019 ps
-rwxr-xr-x  1 root root   35000 Jan 18  2018 pwd
lrwxrwxrwx  1 root root       4 Jun  6  2019 rbash -> bash
-rwxr-xr-x  1 root root   43192 Jan 18  2018 readlink
-rwxr-xr-x  1 root root      89 Apr 26  2016 red
-rwxr-xr-x  1 root root   63704 Jan 18  2018 rm
-rwxr-xr-x  1 root root   43192 Jan 18  2018 rmdir
lrwxrwxrwx  1 root root       4 Mar  6  2018 rnano -> nano
-rwxr-xr-x  1 root root   18760 Dec 30  2017 run-parts
-rwxr-xr-x  1 root root  109000 Jan 30  2018 sed
-rwxr-xr-x  1 root root   43144 Jan 22  2018 setfont
-rwxr-xr-x  1 root root   39103 Apr 23  2019 setupcon
lrwxrwxrwx  1 root root       4 Feb  4  2020 sh -> dash
lrwxrwxrwx  1 root root       4 Feb  4  2020 sh.distrib -> dash
-rwxr-xr-x  1 root root   35000 Jan 18  2018 sleep
-rwxr-xr-x  1 root root  139904 Jul 15 15:16 ss
lrwxrwxrwx  1 root root       7 Mar  6  2019 static-sh -> busybox
-rwxr-xr-x  1 root root   75992 Jan 18  2018 stty
-rwsr-xr-x  1 root root   44664 Mar 22  2019 su
-rwxr-xr-x  1 root root   35000 Jan 18  2018 sync
-rwxr-xr-x  1 root root  182352 Jul  8 18:59 systemctl
lrwxrwxrwx  1 root root      20 Jul  8 18:59 systemd -> /lib/systemd/systemd
-rwxr-xr-x  1 root root   10320 Jul  8 18:59 systemd-ask-password
-rwxr-xr-x  1 root root   14400 Jul  8 18:59 systemd-escape
-rwxr-xr-x  1 root root   84328 Jul  8 18:59 systemd-hwdb
-rwxr-xr-x  1 root root   14416 Jul  8 18:59 systemd-inhibit
-rwxr-xr-x  1 root root   18496 Jul  8 18:59 systemd-machine-id-setup
-rwxr-xr-x  1 root root   14408 Jul  8 18:59 systemd-notify
-rwxr-xr-x  1 root root   43080 Jul  8 18:59 systemd-sysusers
-rwxr-xr-x  1 root root   71752 Jul  8 18:59 systemd-tmpfiles
-rwxr-xr-x  1 root root   26696 Jul  8 18:59 systemd-tty-ask-password-agent
-rwxr-xr-x  1 root root  423312 Jan 21  2019 tar
-rwxr-xr-x  1 root root   10104 Dec 30  2017 tempfile
-rwxr-xr-x  1 root root   88280 Jan 18  2018 touch
-rwxr-xr-x  1 root root   30904 Jan 18  2018 true
-rwxr-xr-x  1 root root  584072 Jul  8 18:59 udevadm
-rwxr-xr-x  1 root root   14328 Aug 11  2016 ulockmgr_server
-rwsr-xr-x  1 root root   26696 Mar  5  2020 umount
-rwxr-xr-x  1 root root   35032 Jan 18  2018 uname
-rwxr-xr-x  2 root root    2301 Apr 28  2017 uncompress
-rwxr-xr-x  1 root root    2762 Jan 22  2018 unicode_start
-rwxr-xr-x  1 root root  133792 Jan 18  2018 vdir
-rwxr-xr-x  1 root root   30800 Mar  5  2020 wdctl
-rwxr-xr-x  1 root root     946 Dec 30  2017 which
-rwxr-xr-x  1 root root   26632 Jan 12  2018 whiptail
lrwxrwxrwx  1 root root       8 Jan 31  2018 ypdomainname -> hostname
-rwxr-xr-x  1 root root    1937 Apr 28  2017 zcat
-rwxr-xr-x  1 root root    1777 Apr 28  2017 zcmp
-rwxr-xr-x  1 root root    5764 Apr 28  2017 zdiff
-rwxr-xr-x  1 root root     140 Apr 28  2017 zegrep
-rwxr-xr-x  1 root root     140 Apr 28  2017 zfgrep
-rwxr-xr-x  1 root root    2131 Apr 28  2017 zforce
-rwxr-xr-x  1 root root    5938 Apr 28  2017 zgrep
-rwxr-xr-x  1 root root    2037 Apr 28  2017 zless
-rwxr-xr-x  1 root root    1910 Apr 28  2017 zmore
-rwxr-xr-x  1 root root    5047 Apr 28  2017 znew
+ /bin/java -version
/tmp/jenkins1630750077097735675.sh: 9: /tmp/jenkins1630750077097735675.sh: /bin/java: not found
Build step 'Execute shell' marked build as failure
[SpotBugs] Skipping execution of recorder since overall result is 'FAILURE'
Archiving artifacts
No JDK named ?IBM 1.8 64-bit (on Ubuntu only)? found
Skipping publisher since build result is FAILURE
Recording test results
No JDK named ?IBM 1.8 64-bit (on Ubuntu only)? found
ERROR: Step ?Publish JUnit test result report? failed: No test report files were found. Configuration error?
No JDK named ?IBM 1.8 64-bit (on Ubuntu only)? found
No JDK named ?IBM 1.8 64-bit (on Ubuntu only)? found

---------------------------------------------------------------------
To unsubscribe, e-mail: [hidden email]
For additional commands, e-mail: [hidden email]

Reply | Threaded
Open this post in threaded view
|

Build failed in Jenkins: POI » POI-DSL-IBM-JDK #5

Apache Jenkins Server
See <https://ci-builds.apache.org/job/POI/job/POI-DSL-IBM-JDK/5/display/redirect>

Changes:


------------------------------------------
[...truncated 495.28 KB...]
    [junit] Tests run: 1, Failures: 0, Errors: 0, Skipped: 0, Time elapsed: 0.005 sec
    [junit] Running org.apache.poi.hslf.record.TestUserEditAtom
    [junit] Tests run: 3, Failures: 0, Errors: 0, Skipped: 0, Time elapsed: 0.268 sec
    [junit] Running org.apache.poi.hslf.usermodel.TestAddingSlides
    [junit] Tests run: 5, Failures: 0, Errors: 0, Skipped: 0, Time elapsed: 0.043 sec
    [junit] Running org.apache.poi.hslf.usermodel.TestBackground
    [junit] Tests run: 3, Failures: 0, Errors: 0, Skipped: 0, Time elapsed: 0.021 sec
    [junit] Running org.apache.poi.hslf.usermodel.TestBugs
    [junit] Tests run: 41, Failures: 0, Errors: 0, Skipped: 0, Time elapsed: 1.108 sec
    [junit] Running org.apache.poi.hslf.usermodel.TestCounts
    [junit] Tests run: 2, Failures: 0, Errors: 0, Skipped: 0, Time elapsed: 0.014 sec
    [junit] Running org.apache.poi.hslf.usermodel.TestFontRendering
    [junit] Tests run: 1, Failures: 0, Errors: 0, Skipped: 1, Time elapsed: 0.004 sec
    [junit] Running org.apache.poi.hslf.usermodel.TestHSLFSlideShow
    [junit] Tests run: 8, Failures: 0, Errors: 0, Skipped: 0, Time elapsed: 0.073 sec
    [junit] Running org.apache.poi.hslf.usermodel.TestHSLFSlideShowFactory
    [junit] Tests run: 1, Failures: 0, Errors: 0, Skipped: 0, Time elapsed: 0.021 sec
    [junit] Running org.apache.poi.hslf.usermodel.TestMostRecentRecords
    [junit] Tests run: 3, Failures: 0, Errors: 0, Skipped: 0, Time elapsed: 0.018 sec
    [junit] Running org.apache.poi.hslf.usermodel.TestNotesText
    [junit] Tests run: 2, Failures: 0, Errors: 0, Skipped: 0, Time elapsed: 0.011 sec
    [junit] Running org.apache.poi.hslf.usermodel.TestNumberedList
    [junit] Tests run: 1, Failures: 0, Errors: 0, Skipped: 0, Time elapsed: 0.005 sec
    [junit] Running org.apache.poi.hslf.usermodel.TestNumberedList2
    [junit] Tests run: 1, Failures: 0, Errors: 0, Skipped: 0, Time elapsed: 0.005 sec
    [junit] Running org.apache.poi.hslf.usermodel.TestNumberedList3
    [junit] Tests run: 1, Failures: 0, Errors: 0, Skipped: 0, Time elapsed: 0.005 sec
    [junit] Running org.apache.poi.hslf.usermodel.TestPicture
    [junit] Tests run: 3, Failures: 0, Errors: 0, Skipped: 0, Time elapsed: 0.113 sec
    [junit] Running org.apache.poi.hslf.usermodel.TestPictures
    [junit] Tests run: 11, Failures: 0, Errors: 0, Skipped: 1, Time elapsed: 0.082 sec
    [junit] Running org.apache.poi.hslf.usermodel.TestReOrderingSlides
    [junit] Tests run: 5, Failures: 0, Errors: 0, Skipped: 0, Time elapsed: 0.038 sec
    [junit] Running org.apache.poi.hslf.usermodel.TestRecordSetup
    [junit] Tests run: 1, Failures: 0, Errors: 0, Skipped: 0, Time elapsed: 0.003 sec
    [junit] Running org.apache.poi.hslf.usermodel.TestRichTextRun
    [junit] Tests run: 11, Failures: 0, Errors: 0, Skipped: 0, Time elapsed: 0.25 sec
    [junit] Running org.apache.poi.hslf.usermodel.TestSheetText
    [junit] Tests run: 1, Failures: 0, Errors: 0, Skipped: 0, Time elapsed: 0.005 sec
    [junit] Running org.apache.poi.hslf.usermodel.TestSlideOrdering
    [junit] Tests run: 3, Failures: 0, Errors: 0, Skipped: 0, Time elapsed: 0.023 sec
    [junit] Running org.apache.poi.hslf.usermodel.TestSoundData
    [junit] Tests run: 1, Failures: 0, Errors: 0, Skipped: 0, Time elapsed: 0.004 sec
    [junit] Running org.apache.poi.hslf.usermodel.TestTable
    [junit] Tests run: 3, Failures: 0, Errors: 0, Skipped: 0, Time elapsed: 0.029 sec
    [junit] Running org.apache.poi.hslf.usermodel.TestTextRun
    [junit] Tests run: 14, Failures: 0, Errors: 0, Skipped: 0, Time elapsed: 0.129 sec
    [junit] Running org.apache.poi.hslf.usermodel.TestTextShape
    [junit] Tests run: 6, Failures: 0, Errors: 0, Skipped: 0, Time elapsed: 0.042 sec
    [junit] Running org.apache.poi.hslf.util.TestSystemTimeUtils
    [junit] Tests run: 4, Failures: 0, Errors: 0, Skipped: 0, Time elapsed: 0.027 sec
    [junit] Running org.apache.poi.hsmf.Test7BitCodepage
    [junit] Tests run: 1, Failures: 0, Errors: 0, Skipped: 0, Time elapsed: 0.078 sec
    [junit] Running org.apache.poi.hsmf.TestBasics
    [junit] Tests run: 9, Failures: 0, Errors: 0, Skipped: 0, Time elapsed: 0.379 sec
    [junit] Running org.apache.poi.hsmf.TestBlankFileRead
    [junit] Tests run: 7, Failures: 0, Errors: 0, Skipped: 0, Time elapsed: 0.051 sec
    [junit] Running org.apache.poi.hsmf.TestExtractEmbeddedMSG
    [junit] Tests run: 1, Failures: 0, Errors: 0, Skipped: 0, Time elapsed: 0.019 sec
    [junit] Running org.apache.poi.hsmf.TestFileWithAttachmentsRead
    [junit] Tests run: 4, Failures: 0, Errors: 0, Skipped: 0, Time elapsed: 0.045 sec
    [junit] Running org.apache.poi.hsmf.TestFixedSizedProperties
    [junit] Tests run: 7, Failures: 0, Errors: 0, Skipped: 0, Time elapsed: 0.114 sec
    [junit] Running org.apache.poi.hsmf.TestMessageSubmissionChunk
    [junit] Tests run: 2, Failures: 0, Errors: 0, Skipped: 0, Time elapsed: 0.009 sec
    [junit] Running org.apache.poi.hsmf.TestMessageSubmissionChunkY2KRead
    [junit] Tests run: 3, Failures: 0, Errors: 0, Skipped: 0, Time elapsed: 0.023 sec
    [junit] Running org.apache.poi.hsmf.TestNameIdChunks
    [junit] Tests run: 2, Failures: 0, Errors: 0, Skipped: 0, Time elapsed: 0.024 sec
    [junit] Running org.apache.poi.hsmf.TestOutlook30FileRead
    [junit] Tests run: 9, Failures: 0, Errors: 0, Skipped: 0, Time elapsed: 0.091 sec
    [junit] Running org.apache.poi.hsmf.TestSimpleFileRead
    [junit] Tests run: 9, Failures: 0, Errors: 0, Skipped: 0, Time elapsed: 0.09 sec
    [junit] Running org.apache.poi.hsmf.datatypes.TestChunkData
    [junit] Tests run: 6, Failures: 0, Errors: 0, Skipped: 0, Time elapsed: 0.041 sec
    [junit] Running org.apache.poi.hsmf.datatypes.TestMAPIProperty
    [junit] Tests run: 3, Failures: 0, Errors: 0, Skipped: 0, Time elapsed: 0.02 sec
    [junit] Running org.apache.poi.hsmf.datatypes.TestSorters
    [junit] Tests run: 2, Failures: 0, Errors: 0, Skipped: 0, Time elapsed: 0.011 sec
    [junit] Running org.apache.poi.hsmf.datatypes.TestTypes
    [junit] Tests run: 3, Failures: 0, Errors: 0, Skipped: 0, Time elapsed: 0.025 sec
    [junit] Running org.apache.poi.hsmf.extractor.TestOutlookTextExtractor
    [junit] Tests run: 8, Failures: 0, Errors: 0, Skipped: 0, Time elapsed: 0.113 sec
    [junit] Running org.apache.poi.hsmf.parsers.TestPOIFSChunkParser
    [junit] Tests run: 6, Failures: 0, Errors: 0, Skipped: 0, Time elapsed: 0.084 sec
    [junit] Running org.apache.poi.hssf.converter.TestExcelConverterSuite
    [junit] Tests run: 778, Failures: 0, Errors: 0, Skipped: 0, Time elapsed: 22.509 sec
    [junit] Running org.apache.poi.hwmf.TestHwmfParsing
    [junit] Tests run: 5, Failures: 0, Errors: 0, Skipped: 1, Time elapsed: 0.038 sec
    [junit] Running org.apache.poi.hwpf.TestFieldsTables
    [junit] Tests run: 1, Failures: 0, Errors: 0, Skipped: 0, Time elapsed: 0.006 sec
    [junit] Running org.apache.poi.hwpf.TestHWPFPictures
    [junit] Tests run: 6, Failures: 0, Errors: 0, Skipped: 0, Time elapsed: 0.151 sec
    [junit] Running org.apache.poi.hwpf.TestHWPFRangeParts
    [junit] Tests run: 2, Failures: 0, Errors: 0, Skipped: 0, Time elapsed: 0.02 sec
    [junit] Running org.apache.poi.hwpf.converter.TestNumberFormatter
    [junit] Tests run: 2, Failures: 0, Errors: 0, Skipped: 0, Time elapsed: 0.167 sec
    [junit] Running org.apache.poi.hwpf.converter.TestWordToConverterSuite
    [junit] Tests run: 411, Failures: 0, Errors: 0, Skipped: 0, Time elapsed: 7.848 sec
    [junit] Running org.apache.poi.hwpf.converter.TestWordToFoConverter
    [junit] Tests run: 8, Failures: 0, Errors: 0, Skipped: 0, Time elapsed: 0.054 sec
    [junit] Running org.apache.poi.hwpf.converter.TestWordToHtmlConverter
    [junit] Tests run: 21, Failures: 0, Errors: 0, Skipped: 0, Time elapsed: 0.21 sec
    [junit] Running org.apache.poi.hwpf.converter.TestWordToTextConverter
    [junit] Tests run: 3, Failures: 0, Errors: 0, Skipped: 0, Time elapsed: 0.071 sec
    [junit] Running org.apache.poi.hwpf.dev.TestHWPFLister
    [junit] Tests run: 2, Failures: 0, Errors: 0, Skipped: 0, Time elapsed: 0.053 sec
    [junit] Running org.apache.poi.hwpf.extractor.TestDifferentRoutes
    [junit] Tests run: 2, Failures: 0, Errors: 0, Skipped: 0, Time elapsed: 0.021 sec
    [junit] Running org.apache.poi.hwpf.extractor.TestWordExtractor
    [junit] Tests run: 18, Failures: 0, Errors: 0, Skipped: 0, Time elapsed: 0.17 sec
    [junit] Running org.apache.poi.hwpf.extractor.TestWordExtractorBugs
    [junit] Tests run: 3, Failures: 0, Errors: 0, Skipped: 0, Time elapsed: 0.189 sec
    [junit] Running org.apache.poi.hwpf.model.TestBookmarksTables
    [junit] Tests run: 5, Failures: 0, Errors: 0, Skipped: 0, Time elapsed: 0.033 sec
    [junit] Running org.apache.poi.hwpf.model.TestCHPBinTable
    [junit] Tests run: 1, Failures: 0, Errors: 0, Skipped: 0, Time elapsed: 0.041 sec
    [junit] Running org.apache.poi.hwpf.model.TestDocumentProperties
    [junit] Tests run: 1, Failures: 0, Errors: 0, Skipped: 0, Time elapsed: 0.273 sec
    [junit] Running org.apache.poi.hwpf.model.TestFileInformationBlock
    [junit] Tests run: 1, Failures: 0, Errors: 0, Skipped: 0, Time elapsed: 0.003 sec
    [junit] Running org.apache.poi.hwpf.model.TestFontTable
    [junit] Tests run: 1, Failures: 0, Errors: 0, Skipped: 0, Time elapsed: 0.002 sec
    [junit] Running org.apache.poi.hwpf.model.TestListTables
    [junit] Tests run: 1, Failures: 0, Errors: 0, Skipped: 0, Time elapsed: 0.002 sec
    [junit] Running org.apache.poi.hwpf.model.TestNotesTables
    [junit] Tests run: 1, Failures: 0, Errors: 0, Skipped: 0, Time elapsed: 0.121 sec
    [junit] Running org.apache.poi.hwpf.model.TestPAPBinTable
    [junit] Tests run: 2, Failures: 0, Errors: 0, Skipped: 0, Time elapsed: 0.015 sec
    [junit] Running org.apache.poi.hwpf.model.TestPlexOfCps
    [junit] Tests run: 1, Failures: 0, Errors: 0, Skipped: 0, Time elapsed: 0.004 sec
    [junit] Running org.apache.poi.hwpf.model.TestRevisionMarkAuthorTable
    [junit] Tests run: 3, Failures: 0, Errors: 0, Skipped: 0, Time elapsed: 0.02 sec
    [junit] Running org.apache.poi.hwpf.model.TestSavedByTable
    [junit] Tests run: 1, Failures: 0, Errors: 0, Skipped: 0, Time elapsed: 0.017 sec
    [junit] Running org.apache.poi.hwpf.model.TestSectionTable
    [junit] Tests run: 1, Failures: 0, Errors: 0, Skipped: 0, Time elapsed: 0.002 sec
    [junit] Running org.apache.poi.hwpf.model.TestStyleSheet
    [junit] Tests run: 2, Failures: 0, Errors: 0, Skipped: 0, Time elapsed: 0.028 sec
    [junit] Running org.apache.poi.hwpf.model.TestTextPieceTable
    [junit] Tests run: 4, Failures: 0, Errors: 0, Skipped: 0, Time elapsed: 0.044 sec
    [junit] Running org.apache.poi.hwpf.sprm.TestSprms
    [junit] Tests run: 2, Failures: 0, Errors: 0, Skipped: 0, Time elapsed: 0.013 sec
    [junit] Running org.apache.poi.hwpf.usermodel.TestBorderCode
    [junit] Tests run: 1, Failures: 0, Errors: 0, Skipped: 0, Time elapsed: 0.002 sec
    [junit] Running org.apache.poi.hwpf.usermodel.TestBug46610
    [junit] Tests run: 3, Failures: 0, Errors: 0, Skipped: 0, Time elapsed: 0.024 sec
    [junit] Running org.apache.poi.hwpf.usermodel.TestBug47563
    [junit] Tests run: 8, Failures: 0, Errors: 0, Skipped: 0, Time elapsed: 0.062 sec
    [junit] Running org.apache.poi.hwpf.usermodel.TestBug49820
    [junit] Tests run: 1, Failures: 0, Errors: 0, Skipped: 0, Time elapsed: 0.002 sec
    [junit] Running org.apache.poi.hwpf.usermodel.TestBug50075
    [junit] Tests run: 1, Failures: 0, Errors: 0, Skipped: 0, Time elapsed: 0.002 sec
    [junit] Running org.apache.poi.hwpf.usermodel.TestBugs
    [junit] Tests run: 41, Failures: 0, Errors: 0, Skipped: 0, Time elapsed: 0.736 sec
    [junit] Running org.apache.poi.hwpf.usermodel.TestHWPFOldDocument
    [junit] Tests run: 14, Failures: 0, Errors: 0, Skipped: 0, Time elapsed: 0.136 sec
    [junit] Running org.apache.poi.hwpf.usermodel.TestHWPFWrite
    [junit] Tests run: 5, Failures: 0, Errors: 0, Skipped: 0, Time elapsed: 0.041 sec
    [junit] Running org.apache.poi.hwpf.usermodel.TestHeaderStories
    [junit] Tests run: 8, Failures: 0, Errors: 0, Skipped: 0, Time elapsed: 0.067 sec
    [junit] Running org.apache.poi.hwpf.usermodel.TestLists
    [junit] Tests run: 7, Failures: 0, Errors: 0, Skipped: 0, Time elapsed: 0.048 sec
    [junit] Running org.apache.poi.hwpf.usermodel.TestOfficeDrawings
    [junit] Tests run: 1, Failures: 0, Errors: 0, Skipped: 0, Time elapsed: 0.003 sec
    [junit] Running org.apache.poi.hwpf.usermodel.TestPictures
    [junit] Tests run: 16, Failures: 0, Errors: 0, Skipped: 2, Time elapsed: 0.11 sec
    [junit] Running org.apache.poi.hwpf.usermodel.TestProblems
    [junit] Tests run: 10, Failures: 0, Errors: 0, Skipped: 0, Time elapsed: 0.076 sec
    [junit] Running org.apache.poi.hwpf.usermodel.TestRange
    [junit] Tests run: 2, Failures: 0, Errors: 0, Skipped: 0, Time elapsed: 0.01 sec
    [junit] Running org.apache.poi.hwpf.usermodel.TestRangeDelete
    [junit] Tests run: 4, Failures: 0, Errors: 0, Skipped: 0, Time elapsed: 0.028 sec
    [junit] Running org.apache.poi.hwpf.usermodel.TestRangeInsertion
    [junit] Tests run: 3, Failures: 0, Errors: 0, Skipped: 0, Time elapsed: 0.014 sec
    [junit] Running org.apache.poi.hwpf.usermodel.TestRangeProperties
    [junit] Tests run: 5, Failures: 0, Errors: 0, Skipped: 0, Time elapsed: 0.036 sec
    [junit] Running org.apache.poi.hwpf.usermodel.TestRangeReplacement
    [junit] Tests run: 3, Failures: 0, Errors: 0, Skipped: 0, Time elapsed: 0.018 sec
    [junit] Running org.apache.poi.hwpf.usermodel.TestRangeSymbols
    [junit] Tests run: 2, Failures: 0, Errors: 0, Skipped: 0, Time elapsed: 0.011 sec
    [junit] Running org.apache.poi.hwpf.usermodel.TestTableRow
    [junit] Tests run: 2, Failures: 0, Errors: 0, Skipped: 0, Time elapsed: 0.012 sec

-test-scratchpad-write-testfile:

-test-ooxml-check:

test-ooxml:
[jacoco:coverage] Enhancing junit with coverage
    [junit] Running org.apache.poi.extractor.ooxml.TestExtractorFactory
    [junit] Tests run: 13, Failures: 0, Errors: 0, Skipped: 0, Time elapsed: 6.062 sec
    [junit] Running org.apache.poi.ooxml.TestDetectAsOOXML
    [junit] Tests run: 3, Failures: 0, Errors: 0, Skipped: 0, Time elapsed: 0.029 sec
    [junit] Running org.apache.poi.ooxml.TestEmbedded
    [junit] Tests run: 3, Failures: 0, Errors: 0, Skipped: 0, Time elapsed: 0.476 sec
    [junit] Running org.apache.poi.ooxml.TestPOIXMLDocument
    [junit] Tests run: 11, Failures: 0, Errors: 0, Skipped: 0, Time elapsed: 3.836 sec
    [junit] Running org.apache.poi.ooxml.TestPOIXMLProperties
    [junit] Tests run: 10, Failures: 0, Errors: 0, Skipped: 1, Time elapsed: 0.601 sec
    [junit] Running org.apache.poi.ooxml.TestXMLPropertiesTextExtractor
    [junit] Tests run: 5, Failures: 0, Errors: 0, Skipped: 0, Time elapsed: 0.246 sec
    [junit] Running org.apache.poi.openxml4j.opc.TestContentType
    [junit] Tests run: 7, Failures: 0, Errors: 0, Skipped: 0, Time elapsed: 0.085 sec
    [junit] Running org.apache.poi.openxml4j.opc.TestFileHelper
    [junit] Tests run: 1, Failures: 0, Errors: 0, Skipped: 0, Time elapsed: 0.002 sec
    [junit] Running org.apache.poi.openxml4j.opc.TestListParts
    [junit] Tests run: 1, Failures: 0, Errors: 0, Skipped: 0, Time elapsed: 0.007 sec
    [junit] Running org.apache.poi.openxml4j.opc.TestPackage
    [junit] Tests run: 39, Failures: 0, Errors: 0, Skipped: 1, Time elapsed: 2.826 sec
    [junit] Running org.apache.poi.openxml4j.opc.TestPackageCoreProperties
    [junit] Tests run: 7, Failures: 0, Errors: 0, Skipped: 0, Time elapsed: 0.106 sec
    [junit] Running org.apache.poi.openxml4j.opc.TestPackagePartName
    [junit] Tests run: 1, Failures: 0, Errors: 0, Skipped: 0, Time elapsed: 0.002 sec
    [junit] Running org.apache.poi.openxml4j.opc.TestPackageThumbnail
    [junit] Tests run: 1, Failures: 0, Errors: 0, Skipped: 0, Time elapsed: 0.019 sec
    [junit] Running org.apache.poi.openxml4j.opc.TestPackagingURIHelper
    [junit] Tests run: 5, Failures: 0, Errors: 0, Skipped: 0, Time elapsed: 0.035 sec
    [junit] Running org.apache.poi.openxml4j.opc.TestRelationships
    [junit] Tests run: 9, Failures: 0, Errors: 0, Skipped: 0, Time elapsed: 0.094 sec
    [junit] Running org.apache.poi.openxml4j.opc.compliance.TestOPCComplianceCoreProperties
    [junit] Tests run: 11, Failures: 0, Errors: 0, Skipped: 0, Time elapsed: 0.146 sec
    [junit] Running org.apache.poi.openxml4j.opc.compliance.TestOPCCompliancePackageModel
    [junit] Tests run: 5, Failures: 0, Errors: 0, Skipped: 0, Time elapsed: 0.036 sec
    [junit] Running org.apache.poi.openxml4j.opc.compliance.TestOPCCompliancePartName
    [junit] Tests run: 10, Failures: 0, Errors: 0, Skipped: 0, Time elapsed: 0.107 sec
    [junit] Running org.apache.poi.openxml4j.opc.internal.TestContentTypeManager
    [junit] Tests run: 5, Failures: 0, Errors: 0, Skipped: 1, Time elapsed: 0.25 sec
    [junit] Running org.apache.poi.openxml4j.opc.internal.marshallers.TestZipPackagePropertiesMarshaller
    [junit] Tests run: 4, Failures: 0, Errors: 0, Skipped: 0, Time elapsed: 0.066 sec
    [junit] Running org.apache.poi.openxml4j.util.TestZipSecureFile
    [junit] Tests run: 1, Failures: 0, Errors: 0, Skipped: 0, Time elapsed: 0.003 sec
    [junit] Running org.apache.poi.poifs.crypt.dsig.TestSignatureConfig
    [junit] Tests run: 2, Failures: 0, Errors: 0, Skipped: 1, Time elapsed: 0.005 sec
    [junit] Running org.apache.poi.poifs.crypt.dsig.TestSignatureInfo
    [junit] Tests run: 14, Failures: 1, Errors: 0, Skipped: 1, Time elapsed: 10.243 sec

BUILD FAILED
<https://ci-builds.apache.org/job/POI/job/POI-DSL-IBM-JDK/ws/build.xml>:1542: The following error occurred while executing this line:
<https://ci-builds.apache.org/job/POI/job/POI-DSL-IBM-JDK/ws/build.xml>:1510: The following error occurred while executing this line:
<https://ci-builds.apache.org/job/POI/job/POI-DSL-IBM-JDK/ws/build.xml>:1138: Tests failed

Total time: 8 minutes 8 seconds
Build step 'Invoke Ant' marked build as failure
[SpotBugs] Skipping execution of recorder since overall result is 'FAILURE'
Archiving artifacts
[Fast Archiver] No prior successful build to compare, so performing full copy of artifacts
[WARNINGS] Skipping publisher since build result is FAILURE
Recording test results

---------------------------------------------------------------------
To unsubscribe, e-mail: [hidden email]
For additional commands, e-mail: [hidden email]

Reply | Threaded
Open this post in threaded view
|

Jenkins build is back to normal : POI » POI-DSL-IBM-JDK #6

Apache Jenkins Server
See <https://ci-builds.apache.org/job/POI/job/POI-DSL-IBM-JDK/6/display/redirect?page=changes>


---------------------------------------------------------------------
To unsubscribe, e-mail: [hidden email]
For additional commands, e-mail: [hidden email]