Build failed in Jenkins: POI » POI-DSL-Github-PullRequests #2

classic Classic list List threaded Threaded
5 messages Options
Reply | Threaded
Open this post in threaded view
|

Build failed in Jenkins: POI » POI-DSL-Github-PullRequests #2

Apache Jenkins Server
See <https://ci-builds.apache.org/job/POI/job/POI-DSL-Github-PullRequests/2/display/redirect?page=changes>

Changes:

[Marius Volkhart] Use Log4j 2 for logging


------------------------------------------
[...truncated 145.87 KB...]
[junitlauncher] Running org.apache.poi.hwpf.converter.TestNumberFormatter
[junitlauncher] Tests run: 2, Failures: 0, Aborted: 0, Skipped: 0, Time elapsed: 0.088000 sec
[junitlauncher]
[junitlauncher] Running org.apache.poi.hwpf.converter.TestWordToConverterSuite
[junitlauncher] Tests run: 402, Failures: 0, Aborted: 0, Skipped: 0, Time elapsed: 4.824000 sec
[junitlauncher]
[junitlauncher] Running org.apache.poi.hwpf.converter.TestWordToFoConverter
[junitlauncher] Tests run: 8, Failures: 0, Aborted: 0, Skipped: 0, Time elapsed: 0.015000 sec
[junitlauncher]
[junitlauncher] Running org.apache.poi.hwpf.converter.TestWordToHtmlConverter
[junitlauncher] Tests run: 21, Failures: 0, Aborted: 0, Skipped: 0, Time elapsed: 0.128000 sec
[junitlauncher]
[junitlauncher] Running org.apache.poi.hwpf.converter.TestWordToTextConverter
[junitlauncher] Tests run: 3, Failures: 0, Aborted: 0, Skipped: 0, Time elapsed: 0.063000 sec
[junitlauncher]
[junitlauncher] Running org.apache.poi.hwpf.dev.TestHWPFLister
[junitlauncher] Tests run: 2, Failures: 0, Aborted: 0, Skipped: 0, Time elapsed: 0.019000 sec
[junitlauncher]
[junitlauncher] Running org.apache.poi.hwpf.extractor.TestDifferentRoutes
[junitlauncher] Tests run: 2, Failures: 0, Aborted: 0, Skipped: 0, Time elapsed: 0.003000 sec
[junitlauncher]
[junitlauncher] Running org.apache.poi.hwpf.extractor.TestWordExtractor
[junitlauncher] Tests run: 18, Failures: 0, Aborted: 0, Skipped: 0, Time elapsed: 0.049000 sec
[junitlauncher]
[junitlauncher] Running org.apache.poi.hwpf.extractor.TestWordExtractorBugs
[junitlauncher] Tests run: 3, Failures: 0, Aborted: 0, Skipped: 0, Time elapsed: 0.167000 sec
[junitlauncher]
[junitlauncher] Running org.apache.poi.hwpf.model.TestBookmarksTables
[junitlauncher] Tests run: 5, Failures: 0, Aborted: 0, Skipped: 0, Time elapsed: 0.006000 sec
[junitlauncher]
[junitlauncher] Running org.apache.poi.hwpf.model.TestCHPBinTable
[junitlauncher] Tests run: 1, Failures: 0, Aborted: 0, Skipped: 0, Time elapsed: 0.002000 sec
[junitlauncher]
[junitlauncher] Running org.apache.poi.hwpf.model.TestDocumentProperties
[junitlauncher] Tests run: 1, Failures: 0, Aborted: 0, Skipped: 0, Time elapsed: 0.145000 sec
[junitlauncher]
[junitlauncher] Running org.apache.poi.hwpf.model.TestFileInformationBlock
[junitlauncher] Tests run: 1, Failures: 0, Aborted: 0, Skipped: 0, Time elapsed: 0.005000 sec
[junitlauncher]
[junitlauncher] Running org.apache.poi.hwpf.model.TestFontTable
[junitlauncher] Tests run: 1, Failures: 0, Aborted: 0, Skipped: 0, Time elapsed: 0.001000 sec
[junitlauncher]
[junitlauncher] Running org.apache.poi.hwpf.model.TestListTables
[junitlauncher] Tests run: 1, Failures: 0, Aborted: 0, Skipped: 0, Time elapsed: 0.001000 sec
[junitlauncher]
[junitlauncher] Running org.apache.poi.hwpf.model.TestNotesTables
[junitlauncher] Tests run: 1, Failures: 0, Aborted: 0, Skipped: 0, Time elapsed: 0.002000 sec
[junitlauncher]
[junitlauncher] Running org.apache.poi.hwpf.model.TestPAPBinTable
[junitlauncher] Tests run: 2, Failures: 0, Aborted: 0, Skipped: 0, Time elapsed: 0.023000 sec
[junitlauncher]
[junitlauncher] Running org.apache.poi.hwpf.model.TestPlexOfCps
[junitlauncher] Tests run: 1, Failures: 0, Aborted: 0, Skipped: 0, Time elapsed: 0.002000 sec
[junitlauncher]
[junitlauncher] Running org.apache.poi.hwpf.model.TestPlfLfo
[junitlauncher] Tests run: 2, Failures: 0, Aborted: 0, Skipped: 0, Time elapsed: 0.002000 sec
[junitlauncher]
[junitlauncher] Running org.apache.poi.hwpf.model.TestRevisionMarkAuthorTable
[junitlauncher] Tests run: 3, Failures: 0, Aborted: 0, Skipped: 0, Time elapsed: 0.006000 sec
[junitlauncher]
[junitlauncher] Running org.apache.poi.hwpf.model.TestSavedByTable
[junitlauncher] Tests run: 1, Failures: 0, Aborted: 0, Skipped: 0, Time elapsed: 0.020000 sec
[junitlauncher]
[junitlauncher] Running org.apache.poi.hwpf.model.TestSectionTable
[junitlauncher] Tests run: 1, Failures: 0, Aborted: 0, Skipped: 0, Time elapsed: 0.002000 sec
[junitlauncher]
[junitlauncher] Running org.apache.poi.hwpf.model.TestStyleSheet
[junitlauncher] Tests run: 2, Failures: 0, Aborted: 0, Skipped: 0, Time elapsed: 0.004000 sec
[junitlauncher]
[junitlauncher] Running org.apache.poi.hwpf.model.TestTextPieceTable
[junitlauncher] Tests run: 4, Failures: 0, Aborted: 0, Skipped: 0, Time elapsed: 0.013000 sec
[junitlauncher]
[junitlauncher] Running org.apache.poi.hwpf.model.types.TestLFOLVLBaseAbstractType
[junitlauncher] Tests run: 1, Failures: 0, Aborted: 0, Skipped: 0, Time elapsed: 0.000000 sec
[junitlauncher]
[junitlauncher] Running org.apache.poi.hwpf.model.types.TestLVLFAbstractType
[junitlauncher] Tests run: 1, Failures: 0, Aborted: 0, Skipped: 0, Time elapsed: 0.001000 sec
[junitlauncher]
[junitlauncher] Running org.apache.poi.hwpf.sprm.TestSprms
[junitlauncher] Tests run: 2, Failures: 0, Aborted: 0, Skipped: 0, Time elapsed: 0.017000 sec
[junitlauncher]
[junitlauncher] Running org.apache.poi.hwpf.usermodel.TestBorderCode
[junitlauncher] Tests run: 1, Failures: 0, Aborted: 0, Skipped: 0, Time elapsed: 0.003000 sec
[junitlauncher]
[junitlauncher] Running org.apache.poi.hwpf.usermodel.TestBug46610
[junitlauncher] Tests run: 3, Failures: 0, Aborted: 0, Skipped: 0, Time elapsed: 0.009000 sec
[junitlauncher]
[junitlauncher] Running org.apache.poi.hwpf.usermodel.TestBug47563
[junitlauncher] Tests run: 8, Failures: 0, Aborted: 0, Skipped: 0, Time elapsed: 0.036000 sec
[junitlauncher]
[junitlauncher] Running org.apache.poi.hwpf.usermodel.TestBug49820
[junitlauncher] Tests run: 1, Failures: 0, Aborted: 0, Skipped: 0, Time elapsed: 0.002000 sec
[junitlauncher]
[junitlauncher] Running org.apache.poi.hwpf.usermodel.TestBug50075
[junitlauncher] Tests run: 1, Failures: 0, Aborted: 0, Skipped: 0, Time elapsed: 0.002000 sec
[junitlauncher]
[junitlauncher] Running org.apache.poi.hwpf.usermodel.TestBugs
[junitlauncher] Tests run: 43, Failures: 0, Aborted: 0, Skipped: 0, Time elapsed: 0.698000 sec
[junitlauncher]
[junitlauncher] Running org.apache.poi.hwpf.usermodel.TestHWPFOldDocument
[junitlauncher] Tests run: 14, Failures: 0, Aborted: 0, Skipped: 0, Time elapsed: 0.063000 sec
[junitlauncher]
[junitlauncher] Running org.apache.poi.hwpf.usermodel.TestHWPFWrite
[junitlauncher] Tests run: 5, Failures: 0, Aborted: 0, Skipped: 0, Time elapsed: 0.020000 sec
[junitlauncher]
[junitlauncher] Running org.apache.poi.hwpf.usermodel.TestHeaderStories
[junitlauncher] Tests run: 8, Failures: 0, Aborted: 0, Skipped: 0, Time elapsed: 0.026000 sec
[junitlauncher]
[junitlauncher] Running org.apache.poi.hwpf.usermodel.TestLists
[junitlauncher] Tests run: 7, Failures: 0, Aborted: 0, Skipped: 0, Time elapsed: 0.012000 sec
[junitlauncher]
[junitlauncher] Running org.apache.poi.hwpf.usermodel.TestOfficeDrawings
[junitlauncher] Tests run: 1, Failures: 0, Aborted: 0, Skipped: 0, Time elapsed: 0.003000 sec
[junitlauncher]
[junitlauncher] Running org.apache.poi.hwpf.usermodel.TestPictures
[junitlauncher] Tests run: 16, Failures: 0, Aborted: 0, Skipped: 2, Time elapsed: 0.039000 sec
[junitlauncher]
[junitlauncher] Running org.apache.poi.hwpf.usermodel.TestProblems
[junitlauncher] Tests run: 10, Failures: 0, Aborted: 0, Skipped: 0, Time elapsed: 0.023000 sec
[junitlauncher]
[junitlauncher] Running org.apache.poi.hwpf.usermodel.TestRange
[junitlauncher] Tests run: 2, Failures: 0, Aborted: 0, Skipped: 0, Time elapsed: 0.003000 sec
[junitlauncher]
[junitlauncher] Running org.apache.poi.hwpf.usermodel.TestRangeDelete
[junitlauncher] Tests run: 4, Failures: 0, Aborted: 0, Skipped: 0, Time elapsed: 0.007000 sec
[junitlauncher]
[junitlauncher] Running org.apache.poi.hwpf.usermodel.TestRangeInsertion
[junitlauncher] Tests run: 3, Failures: 0, Aborted: 0, Skipped: 0, Time elapsed: 0.002000 sec
[junitlauncher]
[junitlauncher] Running org.apache.poi.hwpf.usermodel.TestRangeProperties
[junitlauncher] Tests run: 5, Failures: 0, Aborted: 0, Skipped: 0, Time elapsed: 0.008000 sec
[junitlauncher]
[junitlauncher] Running org.apache.poi.hwpf.usermodel.TestRangeReplacement
[junitlauncher] Tests run: 3, Failures: 0, Aborted: 0, Skipped: 0, Time elapsed: 0.004000 sec
[junitlauncher]
[junitlauncher] Running org.apache.poi.hwpf.usermodel.TestRangeSymbols
[junitlauncher] Tests run: 2, Failures: 0, Aborted: 0, Skipped: 0, Time elapsed: 0.002000 sec
[junitlauncher]
[junitlauncher] Running org.apache.poi.hwpf.usermodel.TestTableRow
[junitlauncher] Tests run: 2, Failures: 0, Aborted: 0, Skipped: 0, Time elapsed: 0.002000 sec
[junitlauncher]
[junitlauncher] Running org.apache.poi.hwpf.util.TestLittleEndianCP950Reader
[junitlauncher] Tests run: 1, Failures: 0, Aborted: 0, Skipped: 0, Time elapsed: 0.000000 sec

-test-scratchpad-write-testfile:

-test-ooxml-check:

test-ooxml:
[junitlauncher]
[junitlauncher] Running org.apache.poi.extractor.ooxml.TestExtractorFactory
[junitlauncher] Tests run: 117, Failures: 0, Aborted: 0, Skipped: 0, Time elapsed: 5.977000 sec
[junitlauncher]
[junitlauncher] Running org.apache.poi.ooxml.TestDetectAsOOXML
[junitlauncher] Tests run: 5, Failures: 0, Aborted: 0, Skipped: 0, Time elapsed: 0.056000 sec
[junitlauncher]
[junitlauncher] Running org.apache.poi.ooxml.TestEmbedded
[junitlauncher] Tests run: 3, Failures: 0, Aborted: 0, Skipped: 0, Time elapsed: 0.358000 sec
[junitlauncher]
[junitlauncher] Running org.apache.poi.ooxml.TestPOIXMLDocument
[junitlauncher] Tests run: 11, Failures: 0, Aborted: 0, Skipped: 0, Time elapsed: 1.922000 sec
[junitlauncher]
[junitlauncher] Running org.apache.poi.ooxml.TestPOIXMLProperties
[junitlauncher] Tests run: 10, Failures: 0, Aborted: 0, Skipped: 1, Time elapsed: 0.337000 sec
[junitlauncher]
[junitlauncher] Running org.apache.poi.ooxml.TestTriggerCoverage
[junitlauncher]    Aborted: [15] <https://ci-builds.apache.org/job/POI/job/POI-DSL-Github-PullRequests/ws/test-data/integration/stress025.docx>
[junitlauncher] Tests run: 25, Failures: 0, Aborted: 1, Skipped: 0, Time elapsed: 14.717000 sec
[junitlauncher]
[junitlauncher] Running org.apache.poi.ooxml.TestXMLPropertiesTextExtractor
[junitlauncher] Tests run: 5, Failures: 0, Aborted: 0, Skipped: 0, Time elapsed: 0.069000 sec
[junitlauncher]
[junitlauncher] Running org.apache.poi.openxml4j.opc.TestContentType
[junitlauncher] Tests run: 39, Failures: 0, Aborted: 0, Skipped: 0, Time elapsed: 0.053000 sec
[junitlauncher]
[junitlauncher] Running org.apache.poi.openxml4j.opc.TestFileHelper
[junitlauncher] Tests run: 1, Failures: 0, Aborted: 0, Skipped: 0, Time elapsed: 0.001000 sec
[junitlauncher]
[junitlauncher] Running org.apache.poi.openxml4j.opc.TestListParts
[junitlauncher] Tests run: 1, Failures: 0, Aborted: 0, Skipped: 0, Time elapsed: 0.006000 sec
[junitlauncher]
[junitlauncher] Running org.apache.poi.openxml4j.opc.TestPackage
[junitlauncher] Tests run: 42, Failures: 0, Aborted: 0, Skipped: 1, Time elapsed: 1.321000 sec
[junitlauncher]
[junitlauncher] Running org.apache.poi.openxml4j.opc.TestPackageCoreProperties
[junitlauncher] Tests run: 7, Failures: 0, Aborted: 0, Skipped: 0, Time elapsed: 0.071000 sec
[junitlauncher]
[junitlauncher] Running org.apache.poi.openxml4j.opc.TestPackagePartName
[junitlauncher] Tests run: 1, Failures: 0, Aborted: 0, Skipped: 0, Time elapsed: 0.001000 sec
[junitlauncher]
[junitlauncher] Running org.apache.poi.openxml4j.opc.TestPackageThumbnail
[junitlauncher] Tests run: 1, Failures: 0, Aborted: 0, Skipped: 0, Time elapsed: 0.020000 sec
[junitlauncher]
[junitlauncher] Running org.apache.poi.openxml4j.opc.TestPackagingURIHelper
[junitlauncher] Tests run: 5, Failures: 0, Aborted: 0, Skipped: 0, Time elapsed: 0.005000 sec
[junitlauncher]
[junitlauncher] Running org.apache.poi.openxml4j.opc.TestRelationships
[junitlauncher] Tests run: 9, Failures: 0, Aborted: 0, Skipped: 0, Time elapsed: 0.062000 sec
[junitlauncher]
[junitlauncher] Running org.apache.poi.openxml4j.opc.compliance.TestOPCComplianceCoreProperties
[junitlauncher] Tests run: 11, Failures: 0, Aborted: 0, Skipped: 0, Time elapsed: 0.077000 sec
[junitlauncher]
[junitlauncher] Running org.apache.poi.openxml4j.opc.compliance.TestOPCCompliancePackageModel
[junitlauncher] Tests run: 6, Failures: 0, Aborted: 0, Skipped: 0, Time elapsed: 0.025000 sec
[junitlauncher]
[junitlauncher] Running org.apache.poi.openxml4j.opc.compliance.TestOPCCompliancePartName
[junitlauncher] Tests run: 10, Failures: 0, Aborted: 0, Skipped: 0, Time elapsed: 0.011000 sec
[junitlauncher]
[junitlauncher] Running org.apache.poi.openxml4j.opc.internal.TestContentTypeManager
[junitlauncher] Tests run: 4, Failures: 0, Aborted: 0, Skipped: 0, Time elapsed: 0.168000 sec
[junitlauncher]
[junitlauncher] Running org.apache.poi.openxml4j.opc.internal.marshallers.TestZipPackagePropertiesMarshaller
[junitlauncher] Tests run: 3, Failures: 0, Aborted: 0, Skipped: 0, Time elapsed: 0.004000 sec
[junitlauncher]
[junitlauncher] Running org.apache.poi.openxml4j.util.TestZipSecureFile
[junitlauncher] Tests run: 1, Failures: 0, Aborted: 0, Skipped: 0, Time elapsed: 0.003000 sec
[junitlauncher]
[junitlauncher] Running org.apache.poi.poifs.crypt.dsig.TestSignatureConfig
[junitlauncher] Tests run: 2, Failures: 0, Aborted: 0, Skipped: 1, Time elapsed: 0.010000 sec
[junitlauncher]
[junitlauncher] Running org.apache.poi.poifs.crypt.dsig.TestSignatureInfo
[junitlauncher]    Failed: testRetrieveCertificate()
[junitlauncher]    Failed: testSignatureImage()
[junitlauncher]    Failed: bug58630()
[junitlauncher]    Failed: getSignerUnsigned()
[junitlauncher]    Failed: office2007prettyPrintedRels()
[junitlauncher]    Failed: testCertChain()
[junitlauncher]    Failed: testMultiSign()
[junitlauncher]    Failed: testManipulation()
[junitlauncher]    Failed: testSignSpreadsheet()
[junitlauncher]    Failed: getSigner()
[junitlauncher]    Failed: testSignSpreadsheetWithSignatureInfo()
[junitlauncher]    Failed: testSignEnvelopingDocument()
[junitlauncher]    Failed: testNonSha1()
[junitlauncher]    Failed: getMultiSigners()
[junitlauncher] Tests run: 15, Failures: 14, Aborted: 0, Skipped: 1, Time elapsed: 3.648000 sec

BUILD FAILED
<https://ci-builds.apache.org/job/POI/job/POI-DSL-Github-PullRequests/ws/build.xml>:1660: The following error occurred while executing this line:
<https://ci-builds.apache.org/job/POI/job/POI-DSL-Github-PullRequests/ws/build.xml>:1632: The following error occurred while executing this line:
<https://ci-builds.apache.org/job/POI/job/POI-DSL-Github-PullRequests/ws/build.xml>:1250: Some test(s) have failure(s)

Total time: 8 minutes 5 seconds
Build step 'Invoke Ant' marked build as failure
[SpotBugs] Skipping execution of recorder since overall result is 'FAILURE'
Archiving artifacts
[Fast Archiver] Compressed 3.09 MB of artifacts by 99.2% relative to #1
Skipping publisher since build result is FAILURE
Recording test results

---------------------------------------------------------------------
To unsubscribe, e-mail: [hidden email]
For additional commands, e-mail: [hidden email]

Reply | Threaded
Open this post in threaded view
|

Build failed in Jenkins: POI » POI-DSL-Github-PullRequests #3

Apache Jenkins Server
See <https://ci-builds.apache.org/job/POI/job/POI-DSL-Github-PullRequests/3/display/redirect?page=changes>

Changes:

[Marius Volkhart] Use Log4j 2 for logging

[Marius Volkhart] fixup! Use Log4j 2 for logging


------------------------------------------
[...truncated 145.87 KB...]
[junitlauncher] Running org.apache.poi.hwpf.converter.TestNumberFormatter
[junitlauncher] Tests run: 2, Failures: 0, Aborted: 0, Skipped: 0, Time elapsed: 0.092000 sec
[junitlauncher]
[junitlauncher] Running org.apache.poi.hwpf.converter.TestWordToConverterSuite
[junitlauncher] Tests run: 402, Failures: 0, Aborted: 0, Skipped: 0, Time elapsed: 4.781000 sec
[junitlauncher]
[junitlauncher] Running org.apache.poi.hwpf.converter.TestWordToFoConverter
[junitlauncher] Tests run: 8, Failures: 0, Aborted: 0, Skipped: 0, Time elapsed: 0.015000 sec
[junitlauncher]
[junitlauncher] Running org.apache.poi.hwpf.converter.TestWordToHtmlConverter
[junitlauncher] Tests run: 21, Failures: 0, Aborted: 0, Skipped: 0, Time elapsed: 0.191000 sec
[junitlauncher]
[junitlauncher] Running org.apache.poi.hwpf.converter.TestWordToTextConverter
[junitlauncher] Tests run: 3, Failures: 0, Aborted: 0, Skipped: 0, Time elapsed: 0.051000 sec
[junitlauncher]
[junitlauncher] Running org.apache.poi.hwpf.dev.TestHWPFLister
[junitlauncher] Tests run: 2, Failures: 0, Aborted: 0, Skipped: 0, Time elapsed: 0.018000 sec
[junitlauncher]
[junitlauncher] Running org.apache.poi.hwpf.extractor.TestDifferentRoutes
[junitlauncher] Tests run: 2, Failures: 0, Aborted: 0, Skipped: 0, Time elapsed: 0.003000 sec
[junitlauncher]
[junitlauncher] Running org.apache.poi.hwpf.extractor.TestWordExtractor
[junitlauncher] Tests run: 18, Failures: 0, Aborted: 0, Skipped: 0, Time elapsed: 0.053000 sec
[junitlauncher]
[junitlauncher] Running org.apache.poi.hwpf.extractor.TestWordExtractorBugs
[junitlauncher] Tests run: 3, Failures: 0, Aborted: 0, Skipped: 0, Time elapsed: 0.157000 sec
[junitlauncher]
[junitlauncher] Running org.apache.poi.hwpf.model.TestBookmarksTables
[junitlauncher] Tests run: 5, Failures: 0, Aborted: 0, Skipped: 0, Time elapsed: 0.004000 sec
[junitlauncher]
[junitlauncher] Running org.apache.poi.hwpf.model.TestCHPBinTable
[junitlauncher] Tests run: 1, Failures: 0, Aborted: 0, Skipped: 0, Time elapsed: 0.002000 sec
[junitlauncher]
[junitlauncher] Running org.apache.poi.hwpf.model.TestDocumentProperties
[junitlauncher] Tests run: 1, Failures: 0, Aborted: 0, Skipped: 0, Time elapsed: 0.154000 sec
[junitlauncher]
[junitlauncher] Running org.apache.poi.hwpf.model.TestFileInformationBlock
[junitlauncher] Tests run: 1, Failures: 0, Aborted: 0, Skipped: 0, Time elapsed: 0.003000 sec
[junitlauncher]
[junitlauncher] Running org.apache.poi.hwpf.model.TestFontTable
[junitlauncher] Tests run: 1, Failures: 0, Aborted: 0, Skipped: 0, Time elapsed: 0.001000 sec
[junitlauncher]
[junitlauncher] Running org.apache.poi.hwpf.model.TestListTables
[junitlauncher] Tests run: 1, Failures: 0, Aborted: 0, Skipped: 0, Time elapsed: 0.002000 sec
[junitlauncher]
[junitlauncher] Running org.apache.poi.hwpf.model.TestNotesTables
[junitlauncher] Tests run: 1, Failures: 0, Aborted: 0, Skipped: 0, Time elapsed: 0.002000 sec
[junitlauncher]
[junitlauncher] Running org.apache.poi.hwpf.model.TestPAPBinTable
[junitlauncher] Tests run: 2, Failures: 0, Aborted: 0, Skipped: 0, Time elapsed: 0.023000 sec
[junitlauncher]
[junitlauncher] Running org.apache.poi.hwpf.model.TestPlexOfCps
[junitlauncher] Tests run: 1, Failures: 0, Aborted: 0, Skipped: 0, Time elapsed: 0.001000 sec
[junitlauncher]
[junitlauncher] Running org.apache.poi.hwpf.model.TestPlfLfo
[junitlauncher] Tests run: 2, Failures: 0, Aborted: 0, Skipped: 0, Time elapsed: 0.001000 sec
[junitlauncher]
[junitlauncher] Running org.apache.poi.hwpf.model.TestRevisionMarkAuthorTable
[junitlauncher] Tests run: 3, Failures: 0, Aborted: 0, Skipped: 0, Time elapsed: 0.006000 sec
[junitlauncher]
[junitlauncher] Running org.apache.poi.hwpf.model.TestSavedByTable
[junitlauncher] Tests run: 1, Failures: 0, Aborted: 0, Skipped: 0, Time elapsed: 0.017000 sec
[junitlauncher]
[junitlauncher] Running org.apache.poi.hwpf.model.TestSectionTable
[junitlauncher] Tests run: 1, Failures: 0, Aborted: 0, Skipped: 0, Time elapsed: 0.002000 sec
[junitlauncher]
[junitlauncher] Running org.apache.poi.hwpf.model.TestStyleSheet
[junitlauncher] Tests run: 2, Failures: 0, Aborted: 0, Skipped: 0, Time elapsed: 0.003000 sec
[junitlauncher]
[junitlauncher] Running org.apache.poi.hwpf.model.TestTextPieceTable
[junitlauncher] Tests run: 4, Failures: 0, Aborted: 0, Skipped: 0, Time elapsed: 0.013000 sec
[junitlauncher]
[junitlauncher] Running org.apache.poi.hwpf.model.types.TestLFOLVLBaseAbstractType
[junitlauncher] Tests run: 1, Failures: 0, Aborted: 0, Skipped: 0, Time elapsed: 0.001000 sec
[junitlauncher]
[junitlauncher] Running org.apache.poi.hwpf.model.types.TestLVLFAbstractType
[junitlauncher] Tests run: 1, Failures: 0, Aborted: 0, Skipped: 0, Time elapsed: 0.001000 sec
[junitlauncher]
[junitlauncher] Running org.apache.poi.hwpf.sprm.TestSprms
[junitlauncher] Tests run: 2, Failures: 0, Aborted: 0, Skipped: 0, Time elapsed: 0.008000 sec
[junitlauncher]
[junitlauncher] Running org.apache.poi.hwpf.usermodel.TestBorderCode
[junitlauncher] Tests run: 1, Failures: 0, Aborted: 0, Skipped: 0, Time elapsed: 0.002000 sec
[junitlauncher]
[junitlauncher] Running org.apache.poi.hwpf.usermodel.TestBug46610
[junitlauncher] Tests run: 3, Failures: 0, Aborted: 0, Skipped: 0, Time elapsed: 0.008000 sec
[junitlauncher]
[junitlauncher] Running org.apache.poi.hwpf.usermodel.TestBug47563
[junitlauncher] Tests run: 8, Failures: 0, Aborted: 0, Skipped: 0, Time elapsed: 0.036000 sec
[junitlauncher]
[junitlauncher] Running org.apache.poi.hwpf.usermodel.TestBug49820
[junitlauncher] Tests run: 1, Failures: 0, Aborted: 0, Skipped: 0, Time elapsed: 0.002000 sec
[junitlauncher]
[junitlauncher] Running org.apache.poi.hwpf.usermodel.TestBug50075
[junitlauncher] Tests run: 1, Failures: 0, Aborted: 0, Skipped: 0, Time elapsed: 0.003000 sec
[junitlauncher]
[junitlauncher] Running org.apache.poi.hwpf.usermodel.TestBugs
[junitlauncher] Tests run: 43, Failures: 0, Aborted: 0, Skipped: 0, Time elapsed: 0.726000 sec
[junitlauncher]
[junitlauncher] Running org.apache.poi.hwpf.usermodel.TestHWPFOldDocument
[junitlauncher] Tests run: 14, Failures: 0, Aborted: 0, Skipped: 0, Time elapsed: 0.078000 sec
[junitlauncher]
[junitlauncher] Running org.apache.poi.hwpf.usermodel.TestHWPFWrite
[junitlauncher] Tests run: 5, Failures: 0, Aborted: 0, Skipped: 0, Time elapsed: 0.021000 sec
[junitlauncher]
[junitlauncher] Running org.apache.poi.hwpf.usermodel.TestHeaderStories
[junitlauncher] Tests run: 8, Failures: 0, Aborted: 0, Skipped: 0, Time elapsed: 0.045000 sec
[junitlauncher]
[junitlauncher] Running org.apache.poi.hwpf.usermodel.TestLists
[junitlauncher] Tests run: 7, Failures: 0, Aborted: 0, Skipped: 0, Time elapsed: 0.010000 sec
[junitlauncher]
[junitlauncher] Running org.apache.poi.hwpf.usermodel.TestOfficeDrawings
[junitlauncher] Tests run: 1, Failures: 0, Aborted: 0, Skipped: 0, Time elapsed: 0.003000 sec
[junitlauncher]
[junitlauncher] Running org.apache.poi.hwpf.usermodel.TestPictures
[junitlauncher] Tests run: 16, Failures: 0, Aborted: 0, Skipped: 2, Time elapsed: 0.046000 sec
[junitlauncher]
[junitlauncher] Running org.apache.poi.hwpf.usermodel.TestProblems
[junitlauncher] Tests run: 10, Failures: 0, Aborted: 0, Skipped: 0, Time elapsed: 0.026000 sec
[junitlauncher]
[junitlauncher] Running org.apache.poi.hwpf.usermodel.TestRange
[junitlauncher] Tests run: 2, Failures: 0, Aborted: 0, Skipped: 0, Time elapsed: 0.003000 sec
[junitlauncher]
[junitlauncher] Running org.apache.poi.hwpf.usermodel.TestRangeDelete
[junitlauncher] Tests run: 4, Failures: 0, Aborted: 0, Skipped: 0, Time elapsed: 0.005000 sec
[junitlauncher]
[junitlauncher] Running org.apache.poi.hwpf.usermodel.TestRangeInsertion
[junitlauncher] Tests run: 3, Failures: 0, Aborted: 0, Skipped: 0, Time elapsed: 0.004000 sec
[junitlauncher]
[junitlauncher] Running org.apache.poi.hwpf.usermodel.TestRangeProperties
[junitlauncher] Tests run: 5, Failures: 0, Aborted: 0, Skipped: 0, Time elapsed: 0.018000 sec
[junitlauncher]
[junitlauncher] Running org.apache.poi.hwpf.usermodel.TestRangeReplacement
[junitlauncher] Tests run: 3, Failures: 0, Aborted: 0, Skipped: 0, Time elapsed: 0.004000 sec
[junitlauncher]
[junitlauncher] Running org.apache.poi.hwpf.usermodel.TestRangeSymbols
[junitlauncher] Tests run: 2, Failures: 0, Aborted: 0, Skipped: 0, Time elapsed: 0.003000 sec
[junitlauncher]
[junitlauncher] Running org.apache.poi.hwpf.usermodel.TestTableRow
[junitlauncher] Tests run: 2, Failures: 0, Aborted: 0, Skipped: 0, Time elapsed: 0.003000 sec
[junitlauncher]
[junitlauncher] Running org.apache.poi.hwpf.util.TestLittleEndianCP950Reader
[junitlauncher] Tests run: 1, Failures: 0, Aborted: 0, Skipped: 0, Time elapsed: 0.001000 sec

-test-scratchpad-write-testfile:

-test-ooxml-check:

test-ooxml:
[junitlauncher]
[junitlauncher] Running org.apache.poi.extractor.ooxml.TestExtractorFactory
[junitlauncher] Tests run: 117, Failures: 0, Aborted: 0, Skipped: 0, Time elapsed: 6.452000 sec
[junitlauncher]
[junitlauncher] Running org.apache.poi.ooxml.TestDetectAsOOXML
[junitlauncher] Tests run: 5, Failures: 0, Aborted: 0, Skipped: 0, Time elapsed: 0.069000 sec
[junitlauncher]
[junitlauncher] Running org.apache.poi.ooxml.TestEmbedded
[junitlauncher] Tests run: 3, Failures: 0, Aborted: 0, Skipped: 0, Time elapsed: 0.369000 sec
[junitlauncher]
[junitlauncher] Running org.apache.poi.ooxml.TestPOIXMLDocument
[junitlauncher] Tests run: 11, Failures: 0, Aborted: 0, Skipped: 0, Time elapsed: 1.928000 sec
[junitlauncher]
[junitlauncher] Running org.apache.poi.ooxml.TestPOIXMLProperties
[junitlauncher] Tests run: 10, Failures: 0, Aborted: 0, Skipped: 1, Time elapsed: 0.345000 sec
[junitlauncher]
[junitlauncher] Running org.apache.poi.ooxml.TestTriggerCoverage
[junitlauncher]    Aborted: [13] <https://ci-builds.apache.org/job/POI/job/POI-DSL-Github-PullRequests/ws/test-data/integration/stress025.docx>
[junitlauncher] Tests run: 25, Failures: 0, Aborted: 1, Skipped: 0, Time elapsed: 15.340000 sec
[junitlauncher]
[junitlauncher] Running org.apache.poi.ooxml.TestXMLPropertiesTextExtractor
[junitlauncher] Tests run: 5, Failures: 0, Aborted: 0, Skipped: 0, Time elapsed: 0.069000 sec
[junitlauncher]
[junitlauncher] Running org.apache.poi.openxml4j.opc.TestContentType
[junitlauncher] Tests run: 39, Failures: 0, Aborted: 0, Skipped: 0, Time elapsed: 0.057000 sec
[junitlauncher]
[junitlauncher] Running org.apache.poi.openxml4j.opc.TestFileHelper
[junitlauncher] Tests run: 1, Failures: 0, Aborted: 0, Skipped: 0, Time elapsed: 0.001000 sec
[junitlauncher]
[junitlauncher] Running org.apache.poi.openxml4j.opc.TestListParts
[junitlauncher] Tests run: 1, Failures: 0, Aborted: 0, Skipped: 0, Time elapsed: 0.008000 sec
[junitlauncher]
[junitlauncher] Running org.apache.poi.openxml4j.opc.TestPackage
[junitlauncher] Tests run: 42, Failures: 0, Aborted: 0, Skipped: 1, Time elapsed: 1.255000 sec
[junitlauncher]
[junitlauncher] Running org.apache.poi.openxml4j.opc.TestPackageCoreProperties
[junitlauncher] Tests run: 7, Failures: 0, Aborted: 0, Skipped: 0, Time elapsed: 0.066000 sec
[junitlauncher]
[junitlauncher] Running org.apache.poi.openxml4j.opc.TestPackagePartName
[junitlauncher] Tests run: 1, Failures: 0, Aborted: 0, Skipped: 0, Time elapsed: 0.000000 sec
[junitlauncher]
[junitlauncher] Running org.apache.poi.openxml4j.opc.TestPackageThumbnail
[junitlauncher] Tests run: 1, Failures: 0, Aborted: 0, Skipped: 0, Time elapsed: 0.017000 sec
[junitlauncher]
[junitlauncher] Running org.apache.poi.openxml4j.opc.TestPackagingURIHelper
[junitlauncher] Tests run: 5, Failures: 0, Aborted: 0, Skipped: 0, Time elapsed: 0.005000 sec
[junitlauncher]
[junitlauncher] Running org.apache.poi.openxml4j.opc.TestRelationships
[junitlauncher] Tests run: 9, Failures: 0, Aborted: 0, Skipped: 0, Time elapsed: 0.063000 sec
[junitlauncher]
[junitlauncher] Running org.apache.poi.openxml4j.opc.compliance.TestOPCComplianceCoreProperties
[junitlauncher] Tests run: 11, Failures: 0, Aborted: 0, Skipped: 0, Time elapsed: 0.095000 sec
[junitlauncher]
[junitlauncher] Running org.apache.poi.openxml4j.opc.compliance.TestOPCCompliancePackageModel
[junitlauncher] Tests run: 6, Failures: 0, Aborted: 0, Skipped: 0, Time elapsed: 0.027000 sec
[junitlauncher]
[junitlauncher] Running org.apache.poi.openxml4j.opc.compliance.TestOPCCompliancePartName
[junitlauncher] Tests run: 10, Failures: 0, Aborted: 0, Skipped: 0, Time elapsed: 0.010000 sec
[junitlauncher]
[junitlauncher] Running org.apache.poi.openxml4j.opc.internal.TestContentTypeManager
[junitlauncher] Tests run: 4, Failures: 0, Aborted: 0, Skipped: 0, Time elapsed: 0.149000 sec
[junitlauncher]
[junitlauncher] Running org.apache.poi.openxml4j.opc.internal.marshallers.TestZipPackagePropertiesMarshaller
[junitlauncher] Tests run: 3, Failures: 0, Aborted: 0, Skipped: 0, Time elapsed: 0.006000 sec
[junitlauncher]
[junitlauncher] Running org.apache.poi.openxml4j.util.TestZipSecureFile
[junitlauncher] Tests run: 1, Failures: 0, Aborted: 0, Skipped: 0, Time elapsed: 0.003000 sec
[junitlauncher]
[junitlauncher] Running org.apache.poi.poifs.crypt.dsig.TestSignatureConfig
[junitlauncher] Tests run: 2, Failures: 0, Aborted: 0, Skipped: 1, Time elapsed: 0.009000 sec
[junitlauncher]
[junitlauncher] Running org.apache.poi.poifs.crypt.dsig.TestSignatureInfo
[junitlauncher]    Failed: testRetrieveCertificate()
[junitlauncher]    Failed: testSignatureImage()
[junitlauncher]    Failed: bug58630()
[junitlauncher]    Failed: getSignerUnsigned()
[junitlauncher]    Failed: office2007prettyPrintedRels()
[junitlauncher]    Failed: testCertChain()
[junitlauncher]    Failed: testMultiSign()
[junitlauncher]    Failed: testManipulation()
[junitlauncher]    Failed: testSignSpreadsheet()
[junitlauncher]    Failed: getSigner()
[junitlauncher]    Failed: testSignSpreadsheetWithSignatureInfo()
[junitlauncher]    Failed: testSignEnvelopingDocument()
[junitlauncher]    Failed: testNonSha1()
[junitlauncher]    Failed: getMultiSigners()
[junitlauncher] Tests run: 15, Failures: 14, Aborted: 0, Skipped: 1, Time elapsed: 3.445000 sec

BUILD FAILED
<https://ci-builds.apache.org/job/POI/job/POI-DSL-Github-PullRequests/ws/build.xml>:1660: The following error occurred while executing this line:
<https://ci-builds.apache.org/job/POI/job/POI-DSL-Github-PullRequests/ws/build.xml>:1632: The following error occurred while executing this line:
<https://ci-builds.apache.org/job/POI/job/POI-DSL-Github-PullRequests/ws/build.xml>:1250: Some test(s) have failure(s)

Total time: 8 minutes 27 seconds
Build step 'Invoke Ant' marked build as failure
[SpotBugs] Skipping execution of recorder since overall result is 'FAILURE'
Archiving artifacts
[Fast Archiver] Compressed 3.09 MB of artifacts by 99.2% relative to #1
Skipping publisher since build result is FAILURE
Recording test results

---------------------------------------------------------------------
To unsubscribe, e-mail: [hidden email]
For additional commands, e-mail: [hidden email]

Reply | Threaded
Open this post in threaded view
|

Build failed in Jenkins: POI » POI-DSL-Github-PullRequests #4

Apache Jenkins Server
See <https://ci-builds.apache.org/job/POI/job/POI-DSL-Github-PullRequests/4/display/redirect?page=changes>

Changes:

[Marius Volkhart] Use Log4j 2 for logging

[Marius Volkhart] fixup! Use Log4j 2 for logging

[Marius Volkhart] fixup! Use Log4j 2 for logging


------------------------------------------
[...truncated 136.17 KB...]
[junitlauncher] Running org.apache.poi.hwpf.converter.TestNumberFormatter
[junitlauncher] Tests run: 2, Failures: 0, Aborted: 0, Skipped: 0, Time elapsed: 0.085000 sec
[junitlauncher]
[junitlauncher] Running org.apache.poi.hwpf.converter.TestWordToConverterSuite
[junitlauncher] Tests run: 402, Failures: 0, Aborted: 0, Skipped: 0, Time elapsed: 5.060000 sec
[junitlauncher]
[junitlauncher] Running org.apache.poi.hwpf.converter.TestWordToFoConverter
[junitlauncher] Tests run: 8, Failures: 0, Aborted: 0, Skipped: 0, Time elapsed: 0.013000 sec
[junitlauncher]
[junitlauncher] Running org.apache.poi.hwpf.converter.TestWordToHtmlConverter
[junitlauncher] Tests run: 21, Failures: 0, Aborted: 0, Skipped: 0, Time elapsed: 0.148000 sec
[junitlauncher]
[junitlauncher] Running org.apache.poi.hwpf.converter.TestWordToTextConverter
[junitlauncher] Tests run: 3, Failures: 0, Aborted: 0, Skipped: 0, Time elapsed: 0.050000 sec
[junitlauncher]
[junitlauncher] Running org.apache.poi.hwpf.dev.TestHWPFLister
[junitlauncher] Tests run: 2, Failures: 0, Aborted: 0, Skipped: 0, Time elapsed: 0.027000 sec
[junitlauncher]
[junitlauncher] Running org.apache.poi.hwpf.extractor.TestDifferentRoutes
[junitlauncher] Tests run: 2, Failures: 0, Aborted: 0, Skipped: 0, Time elapsed: 0.003000 sec
[junitlauncher]
[junitlauncher] Running org.apache.poi.hwpf.extractor.TestWordExtractor
[junitlauncher] Tests run: 18, Failures: 0, Aborted: 0, Skipped: 0, Time elapsed: 0.049000 sec
[junitlauncher]
[junitlauncher] Running org.apache.poi.hwpf.extractor.TestWordExtractorBugs
[junitlauncher] Tests run: 3, Failures: 0, Aborted: 0, Skipped: 0, Time elapsed: 0.160000 sec
[junitlauncher]
[junitlauncher] Running org.apache.poi.hwpf.model.TestBookmarksTables
[junitlauncher] Tests run: 5, Failures: 0, Aborted: 0, Skipped: 0, Time elapsed: 0.005000 sec
[junitlauncher]
[junitlauncher] Running org.apache.poi.hwpf.model.TestCHPBinTable
[junitlauncher] Tests run: 1, Failures: 0, Aborted: 0, Skipped: 0, Time elapsed: 0.002000 sec
[junitlauncher]
[junitlauncher] Running org.apache.poi.hwpf.model.TestDocumentProperties
[junitlauncher] Tests run: 1, Failures: 0, Aborted: 0, Skipped: 0, Time elapsed: 0.146000 sec
[junitlauncher]
[junitlauncher] Running org.apache.poi.hwpf.model.TestFileInformationBlock
[junitlauncher] Tests run: 1, Failures: 0, Aborted: 0, Skipped: 0, Time elapsed: 0.004000 sec
[junitlauncher]
[junitlauncher] Running org.apache.poi.hwpf.model.TestFontTable
[junitlauncher] Tests run: 1, Failures: 0, Aborted: 0, Skipped: 0, Time elapsed: 0.002000 sec
[junitlauncher]
[junitlauncher] Running org.apache.poi.hwpf.model.TestListTables
[junitlauncher] Tests run: 1, Failures: 0, Aborted: 0, Skipped: 0, Time elapsed: 0.001000 sec
[junitlauncher]
[junitlauncher] Running org.apache.poi.hwpf.model.TestNotesTables
[junitlauncher] Tests run: 1, Failures: 0, Aborted: 0, Skipped: 0, Time elapsed: 0.002000 sec
[junitlauncher]
[junitlauncher] Running org.apache.poi.hwpf.model.TestPAPBinTable
[junitlauncher] Tests run: 2, Failures: 0, Aborted: 0, Skipped: 0, Time elapsed: 0.053000 sec
[junitlauncher]
[junitlauncher] Running org.apache.poi.hwpf.model.TestPlexOfCps
[junitlauncher] Tests run: 1, Failures: 0, Aborted: 0, Skipped: 0, Time elapsed: 0.002000 sec
[junitlauncher]
[junitlauncher] Running org.apache.poi.hwpf.model.TestPlfLfo
[junitlauncher] Tests run: 2, Failures: 0, Aborted: 0, Skipped: 0, Time elapsed: 0.001000 sec
[junitlauncher]
[junitlauncher] Running org.apache.poi.hwpf.model.TestRevisionMarkAuthorTable
[junitlauncher] Tests run: 3, Failures: 0, Aborted: 0, Skipped: 0, Time elapsed: 0.005000 sec
[junitlauncher]
[junitlauncher] Running org.apache.poi.hwpf.model.TestSavedByTable
[junitlauncher] Tests run: 1, Failures: 0, Aborted: 0, Skipped: 0, Time elapsed: 0.020000 sec
[junitlauncher]
[junitlauncher] Running org.apache.poi.hwpf.model.TestSectionTable
[junitlauncher] Tests run: 1, Failures: 0, Aborted: 0, Skipped: 0, Time elapsed: 0.001000 sec
[junitlauncher]
[junitlauncher] Running org.apache.poi.hwpf.model.TestStyleSheet
[junitlauncher] Tests run: 2, Failures: 0, Aborted: 0, Skipped: 0, Time elapsed: 0.002000 sec
[junitlauncher]
[junitlauncher] Running org.apache.poi.hwpf.model.TestTextPieceTable
[junitlauncher] Tests run: 4, Failures: 0, Aborted: 0, Skipped: 0, Time elapsed: 0.010000 sec
[junitlauncher]
[junitlauncher] Running org.apache.poi.hwpf.model.types.TestLFOLVLBaseAbstractType
[junitlauncher] Tests run: 1, Failures: 0, Aborted: 0, Skipped: 0, Time elapsed: 0.000000 sec
[junitlauncher]
[junitlauncher] Running org.apache.poi.hwpf.model.types.TestLVLFAbstractType
[junitlauncher] Tests run: 1, Failures: 0, Aborted: 0, Skipped: 0, Time elapsed: 0.001000 sec
[junitlauncher]
[junitlauncher] Running org.apache.poi.hwpf.sprm.TestSprms
[junitlauncher] Tests run: 2, Failures: 0, Aborted: 0, Skipped: 0, Time elapsed: 0.007000 sec
[junitlauncher]
[junitlauncher] Running org.apache.poi.hwpf.usermodel.TestBorderCode
[junitlauncher] Tests run: 1, Failures: 0, Aborted: 0, Skipped: 0, Time elapsed: 0.002000 sec
[junitlauncher]
[junitlauncher] Running org.apache.poi.hwpf.usermodel.TestBug46610
[junitlauncher] Tests run: 3, Failures: 0, Aborted: 0, Skipped: 0, Time elapsed: 0.007000 sec
[junitlauncher]
[junitlauncher] Running org.apache.poi.hwpf.usermodel.TestBug47563
[junitlauncher] Tests run: 8, Failures: 0, Aborted: 0, Skipped: 0, Time elapsed: 0.035000 sec
[junitlauncher]
[junitlauncher] Running org.apache.poi.hwpf.usermodel.TestBug49820
[junitlauncher] Tests run: 1, Failures: 0, Aborted: 0, Skipped: 0, Time elapsed: 0.002000 sec
[junitlauncher]
[junitlauncher] Running org.apache.poi.hwpf.usermodel.TestBug50075
[junitlauncher] Tests run: 1, Failures: 0, Aborted: 0, Skipped: 0, Time elapsed: 0.002000 sec
[junitlauncher]
[junitlauncher] Running org.apache.poi.hwpf.usermodel.TestBugs
[junitlauncher] Tests run: 43, Failures: 0, Aborted: 0, Skipped: 0, Time elapsed: 0.799000 sec
[junitlauncher]
[junitlauncher] Running org.apache.poi.hwpf.usermodel.TestHWPFOldDocument
[junitlauncher] Tests run: 14, Failures: 0, Aborted: 0, Skipped: 0, Time elapsed: 0.062000 sec
[junitlauncher]
[junitlauncher] Running org.apache.poi.hwpf.usermodel.TestHWPFWrite
[junitlauncher] Tests run: 5, Failures: 0, Aborted: 0, Skipped: 0, Time elapsed: 0.018000 sec
[junitlauncher]
[junitlauncher] Running org.apache.poi.hwpf.usermodel.TestHeaderStories
[junitlauncher] Tests run: 8, Failures: 0, Aborted: 0, Skipped: 0, Time elapsed: 0.031000 sec
[junitlauncher]
[junitlauncher] Running org.apache.poi.hwpf.usermodel.TestLists
[junitlauncher] Tests run: 7, Failures: 0, Aborted: 0, Skipped: 0, Time elapsed: 0.009000 sec
[junitlauncher]
[junitlauncher] Running org.apache.poi.hwpf.usermodel.TestOfficeDrawings
[junitlauncher] Tests run: 1, Failures: 0, Aborted: 0, Skipped: 0, Time elapsed: 0.003000 sec
[junitlauncher]
[junitlauncher] Running org.apache.poi.hwpf.usermodel.TestPictures
[junitlauncher] Tests run: 16, Failures: 0, Aborted: 0, Skipped: 2, Time elapsed: 0.035000 sec
[junitlauncher]
[junitlauncher] Running org.apache.poi.hwpf.usermodel.TestProblems
[junitlauncher] Tests run: 10, Failures: 0, Aborted: 0, Skipped: 0, Time elapsed: 0.021000 sec
[junitlauncher]
[junitlauncher] Running org.apache.poi.hwpf.usermodel.TestRange
[junitlauncher] Tests run: 2, Failures: 0, Aborted: 0, Skipped: 0, Time elapsed: 0.002000 sec
[junitlauncher]
[junitlauncher] Running org.apache.poi.hwpf.usermodel.TestRangeDelete
[junitlauncher] Tests run: 4, Failures: 0, Aborted: 0, Skipped: 0, Time elapsed: 0.006000 sec
[junitlauncher]
[junitlauncher] Running org.apache.poi.hwpf.usermodel.TestRangeInsertion
[junitlauncher] Tests run: 3, Failures: 0, Aborted: 0, Skipped: 0, Time elapsed: 0.003000 sec
[junitlauncher]
[junitlauncher] Running org.apache.poi.hwpf.usermodel.TestRangeProperties
[junitlauncher] Tests run: 5, Failures: 0, Aborted: 0, Skipped: 0, Time elapsed: 0.008000 sec
[junitlauncher]
[junitlauncher] Running org.apache.poi.hwpf.usermodel.TestRangeReplacement
[junitlauncher] Tests run: 3, Failures: 0, Aborted: 0, Skipped: 0, Time elapsed: 0.003000 sec
[junitlauncher]
[junitlauncher] Running org.apache.poi.hwpf.usermodel.TestRangeSymbols
[junitlauncher] Tests run: 2, Failures: 0, Aborted: 0, Skipped: 0, Time elapsed: 0.002000 sec
[junitlauncher]
[junitlauncher] Running org.apache.poi.hwpf.usermodel.TestTableRow
[junitlauncher] Tests run: 2, Failures: 0, Aborted: 0, Skipped: 0, Time elapsed: 0.002000 sec
[junitlauncher]
[junitlauncher] Running org.apache.poi.hwpf.util.TestLittleEndianCP950Reader
[junitlauncher] Tests run: 1, Failures: 0, Aborted: 0, Skipped: 0, Time elapsed: 0.000000 sec

-test-scratchpad-write-testfile:

-test-ooxml-check:

test-ooxml:
[junitlauncher]
[junitlauncher] Running org.apache.poi.extractor.ooxml.TestExtractorFactory
[junitlauncher] Tests run: 117, Failures: 0, Aborted: 0, Skipped: 0, Time elapsed: 6.672000 sec
[junitlauncher]
[junitlauncher] Running org.apache.poi.ooxml.TestDetectAsOOXML
[junitlauncher] Tests run: 5, Failures: 0, Aborted: 0, Skipped: 0, Time elapsed: 0.057000 sec
[junitlauncher]
[junitlauncher] Running org.apache.poi.ooxml.TestEmbedded
[junitlauncher] Tests run: 3, Failures: 0, Aborted: 0, Skipped: 0, Time elapsed: 0.345000 sec
[junitlauncher]
[junitlauncher] Running org.apache.poi.ooxml.TestPOIXMLDocument
[junitlauncher] Tests run: 11, Failures: 0, Aborted: 0, Skipped: 0, Time elapsed: 1.825000 sec
[junitlauncher]
[junitlauncher] Running org.apache.poi.ooxml.TestPOIXMLProperties
[junitlauncher] Tests run: 10, Failures: 0, Aborted: 0, Skipped: 1, Time elapsed: 0.354000 sec
[junitlauncher]
[junitlauncher] Running org.apache.poi.ooxml.TestTriggerCoverage
[junitlauncher]    Aborted: [13] <https://ci-builds.apache.org/job/POI/job/POI-DSL-Github-PullRequests/ws/test-data/integration/stress025.docx>
[junitlauncher] Tests run: 25, Failures: 0, Aborted: 1, Skipped: 0, Time elapsed: 15.292000 sec
[junitlauncher]
[junitlauncher] Running org.apache.poi.ooxml.TestXMLPropertiesTextExtractor
[junitlauncher] Tests run: 5, Failures: 0, Aborted: 0, Skipped: 0, Time elapsed: 0.077000 sec
[junitlauncher]
[junitlauncher] Running org.apache.poi.openxml4j.opc.TestContentType
[junitlauncher] Tests run: 39, Failures: 0, Aborted: 0, Skipped: 0, Time elapsed: 0.046000 sec
[junitlauncher]
[junitlauncher] Running org.apache.poi.openxml4j.opc.TestFileHelper
[junitlauncher] Tests run: 1, Failures: 0, Aborted: 0, Skipped: 0, Time elapsed: 0.001000 sec
[junitlauncher]
[junitlauncher] Running org.apache.poi.openxml4j.opc.TestListParts
[junitlauncher] Tests run: 1, Failures: 0, Aborted: 0, Skipped: 0, Time elapsed: 0.008000 sec
[junitlauncher]
[junitlauncher] Running org.apache.poi.openxml4j.opc.TestPackage
[junitlauncher] Tests run: 42, Failures: 0, Aborted: 0, Skipped: 1, Time elapsed: 1.247000 sec
[junitlauncher]
[junitlauncher] Running org.apache.poi.openxml4j.opc.TestPackageCoreProperties
[junitlauncher] Tests run: 7, Failures: 0, Aborted: 0, Skipped: 0, Time elapsed: 0.074000 sec
[junitlauncher]
[junitlauncher] Running org.apache.poi.openxml4j.opc.TestPackagePartName
[junitlauncher] Tests run: 1, Failures: 0, Aborted: 0, Skipped: 0, Time elapsed: 0.001000 sec
[junitlauncher]
[junitlauncher] Running org.apache.poi.openxml4j.opc.TestPackageThumbnail
[junitlauncher] Tests run: 1, Failures: 0, Aborted: 0, Skipped: 0, Time elapsed: 0.020000 sec
[junitlauncher]
[junitlauncher] Running org.apache.poi.openxml4j.opc.TestPackagingURIHelper
[junitlauncher] Tests run: 5, Failures: 0, Aborted: 0, Skipped: 0, Time elapsed: 0.006000 sec
[junitlauncher]
[junitlauncher] Running org.apache.poi.openxml4j.opc.TestRelationships
[junitlauncher] Tests run: 9, Failures: 0, Aborted: 0, Skipped: 0, Time elapsed: 0.072000 sec
[junitlauncher]
[junitlauncher] Running org.apache.poi.openxml4j.opc.compliance.TestOPCComplianceCoreProperties
[junitlauncher] Tests run: 11, Failures: 0, Aborted: 0, Skipped: 0, Time elapsed: 0.083000 sec
[junitlauncher]
[junitlauncher] Running org.apache.poi.openxml4j.opc.compliance.TestOPCCompliancePackageModel
[junitlauncher] Tests run: 6, Failures: 0, Aborted: 0, Skipped: 0, Time elapsed: 0.028000 sec
[junitlauncher]
[junitlauncher] Running org.apache.poi.openxml4j.opc.compliance.TestOPCCompliancePartName
[junitlauncher] Tests run: 10, Failures: 0, Aborted: 0, Skipped: 0, Time elapsed: 0.007000 sec
[junitlauncher]
[junitlauncher] Running org.apache.poi.openxml4j.opc.internal.TestContentTypeManager
[junitlauncher] Tests run: 4, Failures: 0, Aborted: 0, Skipped: 0, Time elapsed: 0.178000 sec
[junitlauncher]
[junitlauncher] Running org.apache.poi.openxml4j.opc.internal.marshallers.TestZipPackagePropertiesMarshaller
[junitlauncher] Tests run: 3, Failures: 0, Aborted: 0, Skipped: 0, Time elapsed: 0.005000 sec
[junitlauncher]
[junitlauncher] Running org.apache.poi.openxml4j.util.TestZipSecureFile
[junitlauncher] Tests run: 1, Failures: 0, Aborted: 0, Skipped: 0, Time elapsed: 0.002000 sec
[junitlauncher]
[junitlauncher] Running org.apache.poi.poifs.crypt.dsig.TestSignatureConfig
[junitlauncher] Tests run: 2, Failures: 0, Aborted: 0, Skipped: 1, Time elapsed: 0.009000 sec
[junitlauncher]
[junitlauncher] Running org.apache.poi.poifs.crypt.dsig.TestSignatureInfo
[junitlauncher]    Failed: testRetrieveCertificate()
[junitlauncher]    Failed: testSignatureImage()
[junitlauncher]    Failed: bug58630()
[junitlauncher]    Failed: getSignerUnsigned()
[junitlauncher]    Failed: office2007prettyPrintedRels()
[junitlauncher]    Failed: testCertChain()
[junitlauncher]    Failed: testMultiSign()
[junitlauncher]    Failed: testManipulation()
[junitlauncher]    Failed: testSignSpreadsheet()
[junitlauncher]    Failed: getSigner()
[junitlauncher]    Failed: testSignSpreadsheetWithSignatureInfo()
[junitlauncher]    Failed: testSignEnvelopingDocument()
[junitlauncher]    Failed: testNonSha1()
[junitlauncher]    Failed: getMultiSigners()
[junitlauncher] Tests run: 15, Failures: 14, Aborted: 0, Skipped: 1, Time elapsed: 3.576000 sec

BUILD FAILED
<https://ci-builds.apache.org/job/POI/job/POI-DSL-Github-PullRequests/ws/build.xml>:1660: The following error occurred while executing this line:
<https://ci-builds.apache.org/job/POI/job/POI-DSL-Github-PullRequests/ws/build.xml>:1632: The following error occurred while executing this line:
<https://ci-builds.apache.org/job/POI/job/POI-DSL-Github-PullRequests/ws/build.xml>:1250: Some test(s) have failure(s)

Total time: 8 minutes 14 seconds
Build step 'Invoke Ant' marked build as failure
[SpotBugs] Skipping execution of recorder since overall result is 'FAILURE'
Archiving artifacts
[Fast Archiver] Compressed 3.09 MB of artifacts by 99.2% relative to #1
Skipping publisher since build result is FAILURE
Recording test results

---------------------------------------------------------------------
To unsubscribe, e-mail: [hidden email]
For additional commands, e-mail: [hidden email]

Reply | Threaded
Open this post in threaded view
|

Build failed in Jenkins: POI » POI-DSL-Github-PullRequests #5

Apache Jenkins Server
See <https://ci-builds.apache.org/job/POI/job/POI-DSL-Github-PullRequests/5/display/redirect?page=changes>

Changes:

[Marius Volkhart] Use Log4j 2 for logging

[Marius Volkhart] fixup! Use Log4j 2 for logging

[Marius Volkhart] fixup! Use Log4j 2 for logging

[Marius Volkhart] fixup! Use Log4j 2 for logging


------------------------------------------
[...truncated 145.91 KB...]
[junitlauncher] Running org.apache.poi.hwpf.converter.TestNumberFormatter
[junitlauncher] Tests run: 2, Failures: 0, Aborted: 0, Skipped: 0, Time elapsed: 0.094000 sec
[junitlauncher]
[junitlauncher] Running org.apache.poi.hwpf.converter.TestWordToConverterSuite
[junitlauncher] Tests run: 402, Failures: 0, Aborted: 0, Skipped: 0, Time elapsed: 4.595000 sec
[junitlauncher]
[junitlauncher] Running org.apache.poi.hwpf.converter.TestWordToFoConverter
[junitlauncher] Tests run: 8, Failures: 0, Aborted: 0, Skipped: 0, Time elapsed: 0.017000 sec
[junitlauncher]
[junitlauncher] Running org.apache.poi.hwpf.converter.TestWordToHtmlConverter
[junitlauncher] Tests run: 21, Failures: 0, Aborted: 0, Skipped: 0, Time elapsed: 0.129000 sec
[junitlauncher]
[junitlauncher] Running org.apache.poi.hwpf.converter.TestWordToTextConverter
[junitlauncher] Tests run: 3, Failures: 0, Aborted: 0, Skipped: 0, Time elapsed: 0.044000 sec
[junitlauncher]
[junitlauncher] Running org.apache.poi.hwpf.dev.TestHWPFLister
[junitlauncher] Tests run: 2, Failures: 0, Aborted: 0, Skipped: 0, Time elapsed: 0.022000 sec
[junitlauncher]
[junitlauncher] Running org.apache.poi.hwpf.extractor.TestDifferentRoutes
[junitlauncher] Tests run: 2, Failures: 0, Aborted: 0, Skipped: 0, Time elapsed: 0.003000 sec
[junitlauncher]
[junitlauncher] Running org.apache.poi.hwpf.extractor.TestWordExtractor
[junitlauncher] Tests run: 18, Failures: 0, Aborted: 0, Skipped: 0, Time elapsed: 0.050000 sec
[junitlauncher]
[junitlauncher] Running org.apache.poi.hwpf.extractor.TestWordExtractorBugs
[junitlauncher] Tests run: 3, Failures: 0, Aborted: 0, Skipped: 0, Time elapsed: 0.168000 sec
[junitlauncher]
[junitlauncher] Running org.apache.poi.hwpf.model.TestBookmarksTables
[junitlauncher] Tests run: 5, Failures: 0, Aborted: 0, Skipped: 0, Time elapsed: 0.007000 sec
[junitlauncher]
[junitlauncher] Running org.apache.poi.hwpf.model.TestCHPBinTable
[junitlauncher] Tests run: 1, Failures: 0, Aborted: 0, Skipped: 0, Time elapsed: 0.002000 sec
[junitlauncher]
[junitlauncher] Running org.apache.poi.hwpf.model.TestDocumentProperties
[junitlauncher] Tests run: 1, Failures: 0, Aborted: 0, Skipped: 0, Time elapsed: 0.174000 sec
[junitlauncher]
[junitlauncher] Running org.apache.poi.hwpf.model.TestFileInformationBlock
[junitlauncher] Tests run: 1, Failures: 0, Aborted: 0, Skipped: 0, Time elapsed: 0.006000 sec
[junitlauncher]
[junitlauncher] Running org.apache.poi.hwpf.model.TestFontTable
[junitlauncher] Tests run: 1, Failures: 0, Aborted: 0, Skipped: 0, Time elapsed: 0.002000 sec
[junitlauncher]
[junitlauncher] Running org.apache.poi.hwpf.model.TestListTables
[junitlauncher] Tests run: 1, Failures: 0, Aborted: 0, Skipped: 0, Time elapsed: 0.001000 sec
[junitlauncher]
[junitlauncher] Running org.apache.poi.hwpf.model.TestNotesTables
[junitlauncher] Tests run: 1, Failures: 0, Aborted: 0, Skipped: 0, Time elapsed: 0.002000 sec
[junitlauncher]
[junitlauncher] Running org.apache.poi.hwpf.model.TestPAPBinTable
[junitlauncher] Tests run: 2, Failures: 0, Aborted: 0, Skipped: 0, Time elapsed: 0.025000 sec
[junitlauncher]
[junitlauncher] Running org.apache.poi.hwpf.model.TestPlexOfCps
[junitlauncher] Tests run: 1, Failures: 0, Aborted: 0, Skipped: 0, Time elapsed: 0.002000 sec
[junitlauncher]
[junitlauncher] Running org.apache.poi.hwpf.model.TestPlfLfo
[junitlauncher] Tests run: 2, Failures: 0, Aborted: 0, Skipped: 0, Time elapsed: 0.001000 sec
[junitlauncher]
[junitlauncher] Running org.apache.poi.hwpf.model.TestRevisionMarkAuthorTable
[junitlauncher] Tests run: 3, Failures: 0, Aborted: 0, Skipped: 0, Time elapsed: 0.008000 sec
[junitlauncher]
[junitlauncher] Running org.apache.poi.hwpf.model.TestSavedByTable
[junitlauncher] Tests run: 1, Failures: 0, Aborted: 0, Skipped: 0, Time elapsed: 0.020000 sec
[junitlauncher]
[junitlauncher] Running org.apache.poi.hwpf.model.TestSectionTable
[junitlauncher] Tests run: 1, Failures: 0, Aborted: 0, Skipped: 0, Time elapsed: 0.001000 sec
[junitlauncher]
[junitlauncher] Running org.apache.poi.hwpf.model.TestStyleSheet
[junitlauncher] Tests run: 2, Failures: 0, Aborted: 0, Skipped: 0, Time elapsed: 0.004000 sec
[junitlauncher]
[junitlauncher] Running org.apache.poi.hwpf.model.TestTextPieceTable
[junitlauncher] Tests run: 4, Failures: 0, Aborted: 0, Skipped: 0, Time elapsed: 0.017000 sec
[junitlauncher]
[junitlauncher] Running org.apache.poi.hwpf.model.types.TestLFOLVLBaseAbstractType
[junitlauncher] Tests run: 1, Failures: 0, Aborted: 0, Skipped: 0, Time elapsed: 0.001000 sec
[junitlauncher]
[junitlauncher] Running org.apache.poi.hwpf.model.types.TestLVLFAbstractType
[junitlauncher] Tests run: 1, Failures: 0, Aborted: 0, Skipped: 0, Time elapsed: 0.001000 sec
[junitlauncher]
[junitlauncher] Running org.apache.poi.hwpf.sprm.TestSprms
[junitlauncher] Tests run: 2, Failures: 0, Aborted: 0, Skipped: 0, Time elapsed: 0.008000 sec
[junitlauncher]
[junitlauncher] Running org.apache.poi.hwpf.usermodel.TestBorderCode
[junitlauncher] Tests run: 1, Failures: 0, Aborted: 0, Skipped: 0, Time elapsed: 0.002000 sec
[junitlauncher]
[junitlauncher] Running org.apache.poi.hwpf.usermodel.TestBug46610
[junitlauncher] Tests run: 3, Failures: 0, Aborted: 0, Skipped: 0, Time elapsed: 0.009000 sec
[junitlauncher]
[junitlauncher] Running org.apache.poi.hwpf.usermodel.TestBug47563
[junitlauncher] Tests run: 8, Failures: 0, Aborted: 0, Skipped: 0, Time elapsed: 0.036000 sec
[junitlauncher]
[junitlauncher] Running org.apache.poi.hwpf.usermodel.TestBug49820
[junitlauncher] Tests run: 1, Failures: 0, Aborted: 0, Skipped: 0, Time elapsed: 0.002000 sec
[junitlauncher]
[junitlauncher] Running org.apache.poi.hwpf.usermodel.TestBug50075
[junitlauncher] Tests run: 1, Failures: 0, Aborted: 0, Skipped: 0, Time elapsed: 0.004000 sec
[junitlauncher]
[junitlauncher] Running org.apache.poi.hwpf.usermodel.TestBugs
[junitlauncher] Tests run: 43, Failures: 0, Aborted: 0, Skipped: 0, Time elapsed: 0.732000 sec
[junitlauncher]
[junitlauncher] Running org.apache.poi.hwpf.usermodel.TestHWPFOldDocument
[junitlauncher] Tests run: 14, Failures: 0, Aborted: 0, Skipped: 0, Time elapsed: 0.067000 sec
[junitlauncher]
[junitlauncher] Running org.apache.poi.hwpf.usermodel.TestHWPFWrite
[junitlauncher] Tests run: 5, Failures: 0, Aborted: 0, Skipped: 0, Time elapsed: 0.020000 sec
[junitlauncher]
[junitlauncher] Running org.apache.poi.hwpf.usermodel.TestHeaderStories
[junitlauncher] Tests run: 8, Failures: 0, Aborted: 0, Skipped: 0, Time elapsed: 0.032000 sec
[junitlauncher]
[junitlauncher] Running org.apache.poi.hwpf.usermodel.TestLists
[junitlauncher] Tests run: 7, Failures: 0, Aborted: 0, Skipped: 0, Time elapsed: 0.008000 sec
[junitlauncher]
[junitlauncher] Running org.apache.poi.hwpf.usermodel.TestOfficeDrawings
[junitlauncher] Tests run: 1, Failures: 0, Aborted: 0, Skipped: 0, Time elapsed: 0.002000 sec
[junitlauncher]
[junitlauncher] Running org.apache.poi.hwpf.usermodel.TestPictures
[junitlauncher] Tests run: 16, Failures: 0, Aborted: 0, Skipped: 2, Time elapsed: 0.037000 sec
[junitlauncher]
[junitlauncher] Running org.apache.poi.hwpf.usermodel.TestProblems
[junitlauncher] Tests run: 10, Failures: 0, Aborted: 0, Skipped: 0, Time elapsed: 0.021000 sec
[junitlauncher]
[junitlauncher] Running org.apache.poi.hwpf.usermodel.TestRange
[junitlauncher] Tests run: 2, Failures: 0, Aborted: 0, Skipped: 0, Time elapsed: 0.002000 sec
[junitlauncher]
[junitlauncher] Running org.apache.poi.hwpf.usermodel.TestRangeDelete
[junitlauncher] Tests run: 4, Failures: 0, Aborted: 0, Skipped: 0, Time elapsed: 0.007000 sec
[junitlauncher]
[junitlauncher] Running org.apache.poi.hwpf.usermodel.TestRangeInsertion
[junitlauncher] Tests run: 3, Failures: 0, Aborted: 0, Skipped: 0, Time elapsed: 0.004000 sec
[junitlauncher]
[junitlauncher] Running org.apache.poi.hwpf.usermodel.TestRangeProperties
[junitlauncher] Tests run: 5, Failures: 0, Aborted: 0, Skipped: 0, Time elapsed: 0.015000 sec
[junitlauncher]
[junitlauncher] Running org.apache.poi.hwpf.usermodel.TestRangeReplacement
[junitlauncher] Tests run: 3, Failures: 0, Aborted: 0, Skipped: 0, Time elapsed: 0.006000 sec
[junitlauncher]
[junitlauncher] Running org.apache.poi.hwpf.usermodel.TestRangeSymbols
[junitlauncher] Tests run: 2, Failures: 0, Aborted: 0, Skipped: 0, Time elapsed: 0.003000 sec
[junitlauncher]
[junitlauncher] Running org.apache.poi.hwpf.usermodel.TestTableRow
[junitlauncher] Tests run: 2, Failures: 0, Aborted: 0, Skipped: 0, Time elapsed: 0.005000 sec
[junitlauncher]
[junitlauncher] Running org.apache.poi.hwpf.util.TestLittleEndianCP950Reader
[junitlauncher] Tests run: 1, Failures: 0, Aborted: 0, Skipped: 0, Time elapsed: 0.001000 sec

-test-scratchpad-write-testfile:

-test-ooxml-check:

test-ooxml:
[junitlauncher]
[junitlauncher] Running org.apache.poi.extractor.ooxml.TestExtractorFactory
[junitlauncher] Tests run: 117, Failures: 0, Aborted: 0, Skipped: 0, Time elapsed: 6.503000 sec
[junitlauncher]
[junitlauncher] Running org.apache.poi.ooxml.TestDetectAsOOXML
[junitlauncher] Tests run: 5, Failures: 0, Aborted: 0, Skipped: 0, Time elapsed: 0.058000 sec
[junitlauncher]
[junitlauncher] Running org.apache.poi.ooxml.TestEmbedded
[junitlauncher] Tests run: 3, Failures: 0, Aborted: 0, Skipped: 0, Time elapsed: 0.387000 sec
[junitlauncher]
[junitlauncher] Running org.apache.poi.ooxml.TestPOIXMLDocument
[junitlauncher] Tests run: 11, Failures: 0, Aborted: 0, Skipped: 0, Time elapsed: 1.963000 sec
[junitlauncher]
[junitlauncher] Running org.apache.poi.ooxml.TestPOIXMLProperties
[junitlauncher] Tests run: 10, Failures: 0, Aborted: 0, Skipped: 1, Time elapsed: 0.358000 sec
[junitlauncher]
[junitlauncher] Running org.apache.poi.ooxml.TestTriggerCoverage
[junitlauncher]    Aborted: [3] <https://ci-builds.apache.org/job/POI/job/POI-DSL-Github-PullRequests/ws/test-data/integration/stress025.docx>
[junitlauncher] Tests run: 25, Failures: 0, Aborted: 1, Skipped: 0, Time elapsed: 16.286000 sec
[junitlauncher]
[junitlauncher] Running org.apache.poi.ooxml.TestXMLPropertiesTextExtractor
[junitlauncher] Tests run: 5, Failures: 0, Aborted: 0, Skipped: 0, Time elapsed: 0.092000 sec
[junitlauncher]
[junitlauncher] Running org.apache.poi.openxml4j.opc.TestContentType
[junitlauncher] Tests run: 39, Failures: 0, Aborted: 0, Skipped: 0, Time elapsed: 0.073000 sec
[junitlauncher]
[junitlauncher] Running org.apache.poi.openxml4j.opc.TestFileHelper
[junitlauncher] Tests run: 1, Failures: 0, Aborted: 0, Skipped: 0, Time elapsed: 0.002000 sec
[junitlauncher]
[junitlauncher] Running org.apache.poi.openxml4j.opc.TestListParts
[junitlauncher] Tests run: 1, Failures: 0, Aborted: 0, Skipped: 0, Time elapsed: 0.005000 sec
[junitlauncher]
[junitlauncher] Running org.apache.poi.openxml4j.opc.TestPackage
[junitlauncher] Tests run: 42, Failures: 0, Aborted: 0, Skipped: 1, Time elapsed: 1.540000 sec
[junitlauncher]
[junitlauncher] Running org.apache.poi.openxml4j.opc.TestPackageCoreProperties
[junitlauncher] Tests run: 7, Failures: 0, Aborted: 0, Skipped: 0, Time elapsed: 0.067000 sec
[junitlauncher]
[junitlauncher] Running org.apache.poi.openxml4j.opc.TestPackagePartName
[junitlauncher] Tests run: 1, Failures: 0, Aborted: 0, Skipped: 0, Time elapsed: 0.001000 sec
[junitlauncher]
[junitlauncher] Running org.apache.poi.openxml4j.opc.TestPackageThumbnail
[junitlauncher] Tests run: 1, Failures: 0, Aborted: 0, Skipped: 0, Time elapsed: 0.018000 sec
[junitlauncher]
[junitlauncher] Running org.apache.poi.openxml4j.opc.TestPackagingURIHelper
[junitlauncher] Tests run: 5, Failures: 0, Aborted: 0, Skipped: 0, Time elapsed: 0.004000 sec
[junitlauncher]
[junitlauncher] Running org.apache.poi.openxml4j.opc.TestRelationships
[junitlauncher] Tests run: 9, Failures: 0, Aborted: 0, Skipped: 0, Time elapsed: 0.080000 sec
[junitlauncher]
[junitlauncher] Running org.apache.poi.openxml4j.opc.compliance.TestOPCComplianceCoreProperties
[junitlauncher] Tests run: 11, Failures: 0, Aborted: 0, Skipped: 0, Time elapsed: 0.075000 sec
[junitlauncher]
[junitlauncher] Running org.apache.poi.openxml4j.opc.compliance.TestOPCCompliancePackageModel
[junitlauncher] Tests run: 6, Failures: 0, Aborted: 0, Skipped: 0, Time elapsed: 0.026000 sec
[junitlauncher]
[junitlauncher] Running org.apache.poi.openxml4j.opc.compliance.TestOPCCompliancePartName
[junitlauncher] Tests run: 10, Failures: 0, Aborted: 0, Skipped: 0, Time elapsed: 0.008000 sec
[junitlauncher]
[junitlauncher] Running org.apache.poi.openxml4j.opc.internal.TestContentTypeManager
[junitlauncher] Tests run: 4, Failures: 0, Aborted: 0, Skipped: 0, Time elapsed: 0.149000 sec
[junitlauncher]
[junitlauncher] Running org.apache.poi.openxml4j.opc.internal.marshallers.TestZipPackagePropertiesMarshaller
[junitlauncher] Tests run: 3, Failures: 0, Aborted: 0, Skipped: 0, Time elapsed: 0.006000 sec
[junitlauncher]
[junitlauncher] Running org.apache.poi.openxml4j.util.TestZipSecureFile
[junitlauncher] Tests run: 1, Failures: 0, Aborted: 0, Skipped: 0, Time elapsed: 0.004000 sec
[junitlauncher]
[junitlauncher] Running org.apache.poi.poifs.crypt.dsig.TestSignatureConfig
[junitlauncher] Tests run: 2, Failures: 0, Aborted: 0, Skipped: 1, Time elapsed: 0.009000 sec
[junitlauncher]
[junitlauncher] Running org.apache.poi.poifs.crypt.dsig.TestSignatureInfo
[junitlauncher]    Failed: testRetrieveCertificate()
[junitlauncher]    Failed: testSignatureImage()
[junitlauncher]    Failed: bug58630()
[junitlauncher]    Failed: getSignerUnsigned()
[junitlauncher]    Failed: office2007prettyPrintedRels()
[junitlauncher]    Failed: testCertChain()
[junitlauncher]    Failed: testMultiSign()
[junitlauncher]    Failed: testManipulation()
[junitlauncher]    Failed: testSignSpreadsheet()
[junitlauncher]    Failed: getSigner()
[junitlauncher]    Failed: testSignSpreadsheetWithSignatureInfo()
[junitlauncher]    Failed: testSignEnvelopingDocument()
[junitlauncher]    Failed: testNonSha1()
[junitlauncher]    Failed: getMultiSigners()
[junitlauncher] Tests run: 15, Failures: 14, Aborted: 0, Skipped: 1, Time elapsed: 4.212000 sec

BUILD FAILED
<https://ci-builds.apache.org/job/POI/job/POI-DSL-Github-PullRequests/ws/build.xml>:1660: The following error occurred while executing this line:
<https://ci-builds.apache.org/job/POI/job/POI-DSL-Github-PullRequests/ws/build.xml>:1632: The following error occurred while executing this line:
<https://ci-builds.apache.org/job/POI/job/POI-DSL-Github-PullRequests/ws/build.xml>:1250: Some test(s) have failure(s)

Total time: 8 minutes 42 seconds
Build step 'Invoke Ant' marked build as failure
[SpotBugs] Skipping execution of recorder since overall result is 'FAILURE'
Archiving artifacts
[Fast Archiver] Compressed 3.09 MB of artifacts by 99.2% relative to #1
Skipping publisher since build result is FAILURE
Recording test results

---------------------------------------------------------------------
To unsubscribe, e-mail: [hidden email]
For additional commands, e-mail: [hidden email]

Reply | Threaded
Open this post in threaded view
|

Build failed in Jenkins: POI » POI-DSL-Github-PullRequests #6

Apache Jenkins Server
See <https://ci-builds.apache.org/job/POI/job/POI-DSL-Github-PullRequests/6/display/redirect?page=changes>

Changes:

[Marius Volkhart] Use Log4j 2 for logging

[Marius Volkhart] fixup! Use Log4j 2 for logging

[Marius Volkhart] fixup! Use Log4j 2 for logging

[Marius Volkhart] fixup! Use Log4j 2 for logging

[Marius Volkhart] fixup! Use Log4j 2 for logging


------------------------------------------
[...truncated 136.16 KB...]
[junitlauncher] Running org.apache.poi.hwpf.converter.TestNumberFormatter
[junitlauncher] Tests run: 2, Failures: 0, Aborted: 0, Skipped: 0, Time elapsed: 0.084000 sec
[junitlauncher]
[junitlauncher] Running org.apache.poi.hwpf.converter.TestWordToConverterSuite
[junitlauncher] Tests run: 402, Failures: 0, Aborted: 0, Skipped: 0, Time elapsed: 5.390000 sec
[junitlauncher]
[junitlauncher] Running org.apache.poi.hwpf.converter.TestWordToFoConverter
[junitlauncher] Tests run: 8, Failures: 0, Aborted: 0, Skipped: 0, Time elapsed: 0.020000 sec
[junitlauncher]
[junitlauncher] Running org.apache.poi.hwpf.converter.TestWordToHtmlConverter
[junitlauncher] Tests run: 21, Failures: 0, Aborted: 0, Skipped: 0, Time elapsed: 0.187000 sec
[junitlauncher]
[junitlauncher] Running org.apache.poi.hwpf.converter.TestWordToTextConverter
[junitlauncher] Tests run: 3, Failures: 0, Aborted: 0, Skipped: 0, Time elapsed: 0.077000 sec
[junitlauncher]
[junitlauncher] Running org.apache.poi.hwpf.dev.TestHWPFLister
[junitlauncher] Tests run: 2, Failures: 0, Aborted: 0, Skipped: 0, Time elapsed: 0.021000 sec
[junitlauncher]
[junitlauncher] Running org.apache.poi.hwpf.extractor.TestDifferentRoutes
[junitlauncher] Tests run: 2, Failures: 0, Aborted: 0, Skipped: 0, Time elapsed: 0.003000 sec
[junitlauncher]
[junitlauncher] Running org.apache.poi.hwpf.extractor.TestWordExtractor
[junitlauncher] Tests run: 18, Failures: 0, Aborted: 0, Skipped: 0, Time elapsed: 0.061000 sec
[junitlauncher]
[junitlauncher] Running org.apache.poi.hwpf.extractor.TestWordExtractorBugs
[junitlauncher] Tests run: 3, Failures: 0, Aborted: 0, Skipped: 0, Time elapsed: 0.168000 sec
[junitlauncher]
[junitlauncher] Running org.apache.poi.hwpf.model.TestBookmarksTables
[junitlauncher] Tests run: 5, Failures: 0, Aborted: 0, Skipped: 0, Time elapsed: 0.004000 sec
[junitlauncher]
[junitlauncher] Running org.apache.poi.hwpf.model.TestCHPBinTable
[junitlauncher] Tests run: 1, Failures: 0, Aborted: 0, Skipped: 0, Time elapsed: 0.002000 sec
[junitlauncher]
[junitlauncher] Running org.apache.poi.hwpf.model.TestDocumentProperties
[junitlauncher] Tests run: 1, Failures: 0, Aborted: 0, Skipped: 0, Time elapsed: 0.154000 sec
[junitlauncher]
[junitlauncher] Running org.apache.poi.hwpf.model.TestFileInformationBlock
[junitlauncher] Tests run: 1, Failures: 0, Aborted: 0, Skipped: 0, Time elapsed: 0.004000 sec
[junitlauncher]
[junitlauncher] Running org.apache.poi.hwpf.model.TestFontTable
[junitlauncher] Tests run: 1, Failures: 0, Aborted: 0, Skipped: 0, Time elapsed: 0.002000 sec
[junitlauncher]
[junitlauncher] Running org.apache.poi.hwpf.model.TestListTables
[junitlauncher] Tests run: 1, Failures: 0, Aborted: 0, Skipped: 0, Time elapsed: 0.002000 sec
[junitlauncher]
[junitlauncher] Running org.apache.poi.hwpf.model.TestNotesTables
[junitlauncher] Tests run: 1, Failures: 0, Aborted: 0, Skipped: 0, Time elapsed: 0.002000 sec
[junitlauncher]
[junitlauncher] Running org.apache.poi.hwpf.model.TestPAPBinTable
[junitlauncher] Tests run: 2, Failures: 0, Aborted: 0, Skipped: 0, Time elapsed: 0.025000 sec
[junitlauncher]
[junitlauncher] Running org.apache.poi.hwpf.model.TestPlexOfCps
[junitlauncher] Tests run: 1, Failures: 0, Aborted: 0, Skipped: 0, Time elapsed: 0.002000 sec
[junitlauncher]
[junitlauncher] Running org.apache.poi.hwpf.model.TestPlfLfo
[junitlauncher] Tests run: 2, Failures: 0, Aborted: 0, Skipped: 0, Time elapsed: 0.001000 sec
[junitlauncher]
[junitlauncher] Running org.apache.poi.hwpf.model.TestRevisionMarkAuthorTable
[junitlauncher] Tests run: 3, Failures: 0, Aborted: 0, Skipped: 0, Time elapsed: 0.004000 sec
[junitlauncher]
[junitlauncher] Running org.apache.poi.hwpf.model.TestSavedByTable
[junitlauncher] Tests run: 1, Failures: 0, Aborted: 0, Skipped: 0, Time elapsed: 0.015000 sec
[junitlauncher]
[junitlauncher] Running org.apache.poi.hwpf.model.TestSectionTable
[junitlauncher] Tests run: 1, Failures: 0, Aborted: 0, Skipped: 0, Time elapsed: 0.003000 sec
[junitlauncher]
[junitlauncher] Running org.apache.poi.hwpf.model.TestStyleSheet
[junitlauncher] Tests run: 2, Failures: 0, Aborted: 0, Skipped: 0, Time elapsed: 0.003000 sec
[junitlauncher]
[junitlauncher] Running org.apache.poi.hwpf.model.TestTextPieceTable
[junitlauncher] Tests run: 4, Failures: 0, Aborted: 0, Skipped: 0, Time elapsed: 0.010000 sec
[junitlauncher]
[junitlauncher] Running org.apache.poi.hwpf.model.types.TestLFOLVLBaseAbstractType
[junitlauncher] Tests run: 1, Failures: 0, Aborted: 0, Skipped: 0, Time elapsed: 0.001000 sec
[junitlauncher]
[junitlauncher] Running org.apache.poi.hwpf.model.types.TestLVLFAbstractType
[junitlauncher] Tests run: 1, Failures: 0, Aborted: 0, Skipped: 0, Time elapsed: 0.001000 sec
[junitlauncher]
[junitlauncher] Running org.apache.poi.hwpf.sprm.TestSprms
[junitlauncher] Tests run: 2, Failures: 0, Aborted: 0, Skipped: 0, Time elapsed: 0.010000 sec
[junitlauncher]
[junitlauncher] Running org.apache.poi.hwpf.usermodel.TestBorderCode
[junitlauncher] Tests run: 1, Failures: 0, Aborted: 0, Skipped: 0, Time elapsed: 0.001000 sec
[junitlauncher]
[junitlauncher] Running org.apache.poi.hwpf.usermodel.TestBug46610
[junitlauncher] Tests run: 3, Failures: 0, Aborted: 0, Skipped: 0, Time elapsed: 0.007000 sec
[junitlauncher]
[junitlauncher] Running org.apache.poi.hwpf.usermodel.TestBug47563
[junitlauncher] Tests run: 8, Failures: 0, Aborted: 0, Skipped: 0, Time elapsed: 0.034000 sec
[junitlauncher]
[junitlauncher] Running org.apache.poi.hwpf.usermodel.TestBug49820
[junitlauncher] Tests run: 1, Failures: 0, Aborted: 0, Skipped: 0, Time elapsed: 0.002000 sec
[junitlauncher]
[junitlauncher] Running org.apache.poi.hwpf.usermodel.TestBug50075
[junitlauncher] Tests run: 1, Failures: 0, Aborted: 0, Skipped: 0, Time elapsed: 0.002000 sec
[junitlauncher]
[junitlauncher] Running org.apache.poi.hwpf.usermodel.TestBugs
[junitlauncher] Tests run: 43, Failures: 0, Aborted: 0, Skipped: 0, Time elapsed: 0.697000 sec
[junitlauncher]
[junitlauncher] Running org.apache.poi.hwpf.usermodel.TestHWPFOldDocument
[junitlauncher] Tests run: 14, Failures: 0, Aborted: 0, Skipped: 0, Time elapsed: 0.065000 sec
[junitlauncher]
[junitlauncher] Running org.apache.poi.hwpf.usermodel.TestHWPFWrite
[junitlauncher] Tests run: 5, Failures: 0, Aborted: 0, Skipped: 0, Time elapsed: 0.018000 sec
[junitlauncher]
[junitlauncher] Running org.apache.poi.hwpf.usermodel.TestHeaderStories
[junitlauncher] Tests run: 8, Failures: 0, Aborted: 0, Skipped: 0, Time elapsed: 0.037000 sec
[junitlauncher]
[junitlauncher] Running org.apache.poi.hwpf.usermodel.TestLists
[junitlauncher] Tests run: 7, Failures: 0, Aborted: 0, Skipped: 0, Time elapsed: 0.009000 sec
[junitlauncher]
[junitlauncher] Running org.apache.poi.hwpf.usermodel.TestOfficeDrawings
[junitlauncher] Tests run: 1, Failures: 0, Aborted: 0, Skipped: 0, Time elapsed: 0.002000 sec
[junitlauncher]
[junitlauncher] Running org.apache.poi.hwpf.usermodel.TestPictures
[junitlauncher] Tests run: 16, Failures: 0, Aborted: 0, Skipped: 2, Time elapsed: 0.036000 sec
[junitlauncher]
[junitlauncher] Running org.apache.poi.hwpf.usermodel.TestProblems
[junitlauncher] Tests run: 10, Failures: 0, Aborted: 0, Skipped: 0, Time elapsed: 0.018000 sec
[junitlauncher]
[junitlauncher] Running org.apache.poi.hwpf.usermodel.TestRange
[junitlauncher] Tests run: 2, Failures: 0, Aborted: 0, Skipped: 0, Time elapsed: 0.002000 sec
[junitlauncher]
[junitlauncher] Running org.apache.poi.hwpf.usermodel.TestRangeDelete
[junitlauncher] Tests run: 4, Failures: 0, Aborted: 0, Skipped: 0, Time elapsed: 0.005000 sec
[junitlauncher]
[junitlauncher] Running org.apache.poi.hwpf.usermodel.TestRangeInsertion
[junitlauncher] Tests run: 3, Failures: 0, Aborted: 0, Skipped: 0, Time elapsed: 0.010000 sec
[junitlauncher]
[junitlauncher] Running org.apache.poi.hwpf.usermodel.TestRangeProperties
[junitlauncher] Tests run: 5, Failures: 0, Aborted: 0, Skipped: 0, Time elapsed: 0.008000 sec
[junitlauncher]
[junitlauncher] Running org.apache.poi.hwpf.usermodel.TestRangeReplacement
[junitlauncher] Tests run: 3, Failures: 0, Aborted: 0, Skipped: 0, Time elapsed: 0.003000 sec
[junitlauncher]
[junitlauncher] Running org.apache.poi.hwpf.usermodel.TestRangeSymbols
[junitlauncher] Tests run: 2, Failures: 0, Aborted: 0, Skipped: 0, Time elapsed: 0.003000 sec
[junitlauncher]
[junitlauncher] Running org.apache.poi.hwpf.usermodel.TestTableRow
[junitlauncher] Tests run: 2, Failures: 0, Aborted: 0, Skipped: 0, Time elapsed: 0.002000 sec
[junitlauncher]
[junitlauncher] Running org.apache.poi.hwpf.util.TestLittleEndianCP950Reader
[junitlauncher] Tests run: 1, Failures: 0, Aborted: 0, Skipped: 0, Time elapsed: 0.001000 sec

-test-scratchpad-write-testfile:

-test-ooxml-check:

test-ooxml:
[junitlauncher]
[junitlauncher] Running org.apache.poi.extractor.ooxml.TestExtractorFactory
[junitlauncher] Tests run: 117, Failures: 0, Aborted: 0, Skipped: 0, Time elapsed: 6.930000 sec
[junitlauncher]
[junitlauncher] Running org.apache.poi.ooxml.TestDetectAsOOXML
[junitlauncher] Tests run: 5, Failures: 0, Aborted: 0, Skipped: 0, Time elapsed: 0.059000 sec
[junitlauncher]
[junitlauncher] Running org.apache.poi.ooxml.TestEmbedded
[junitlauncher] Tests run: 3, Failures: 0, Aborted: 0, Skipped: 0, Time elapsed: 0.380000 sec
[junitlauncher]
[junitlauncher] Running org.apache.poi.ooxml.TestPOIXMLDocument
[junitlauncher] Tests run: 11, Failures: 0, Aborted: 0, Skipped: 0, Time elapsed: 2.037000 sec
[junitlauncher]
[junitlauncher] Running org.apache.poi.ooxml.TestPOIXMLProperties
[junitlauncher] Tests run: 10, Failures: 0, Aborted: 0, Skipped: 1, Time elapsed: 0.356000 sec
[junitlauncher]
[junitlauncher] Running org.apache.poi.ooxml.TestTriggerCoverage
[junitlauncher]    Aborted: [13] <https://ci-builds.apache.org/job/POI/job/POI-DSL-Github-PullRequests/ws/test-data/integration/stress025.docx>
[junitlauncher] Tests run: 25, Failures: 0, Aborted: 1, Skipped: 0, Time elapsed: 16.392000 sec
[junitlauncher]
[junitlauncher] Running org.apache.poi.ooxml.TestXMLPropertiesTextExtractor
[junitlauncher] Tests run: 5, Failures: 0, Aborted: 0, Skipped: 0, Time elapsed: 0.085000 sec
[junitlauncher]
[junitlauncher] Running org.apache.poi.openxml4j.opc.TestContentType
[junitlauncher] Tests run: 39, Failures: 0, Aborted: 0, Skipped: 0, Time elapsed: 0.080000 sec
[junitlauncher]
[junitlauncher] Running org.apache.poi.openxml4j.opc.TestFileHelper
[junitlauncher] Tests run: 1, Failures: 0, Aborted: 0, Skipped: 0, Time elapsed: 0.001000 sec
[junitlauncher]
[junitlauncher] Running org.apache.poi.openxml4j.opc.TestListParts
[junitlauncher] Tests run: 1, Failures: 0, Aborted: 0, Skipped: 0, Time elapsed: 0.005000 sec
[junitlauncher]
[junitlauncher] Running org.apache.poi.openxml4j.opc.TestPackage
[junitlauncher] Tests run: 42, Failures: 0, Aborted: 0, Skipped: 1, Time elapsed: 1.343000 sec
[junitlauncher]
[junitlauncher] Running org.apache.poi.openxml4j.opc.TestPackageCoreProperties
[junitlauncher] Tests run: 7, Failures: 0, Aborted: 0, Skipped: 0, Time elapsed: 0.066000 sec
[junitlauncher]
[junitlauncher] Running org.apache.poi.openxml4j.opc.TestPackagePartName
[junitlauncher] Tests run: 1, Failures: 0, Aborted: 0, Skipped: 0, Time elapsed: 0.001000 sec
[junitlauncher]
[junitlauncher] Running org.apache.poi.openxml4j.opc.TestPackageThumbnail
[junitlauncher] Tests run: 1, Failures: 0, Aborted: 0, Skipped: 0, Time elapsed: 0.014000 sec
[junitlauncher]
[junitlauncher] Running org.apache.poi.openxml4j.opc.TestPackagingURIHelper
[junitlauncher] Tests run: 5, Failures: 0, Aborted: 0, Skipped: 0, Time elapsed: 0.003000 sec
[junitlauncher]
[junitlauncher] Running org.apache.poi.openxml4j.opc.TestRelationships
[junitlauncher] Tests run: 9, Failures: 0, Aborted: 0, Skipped: 0, Time elapsed: 0.066000 sec
[junitlauncher]
[junitlauncher] Running org.apache.poi.openxml4j.opc.compliance.TestOPCComplianceCoreProperties
[junitlauncher] Tests run: 11, Failures: 0, Aborted: 0, Skipped: 0, Time elapsed: 0.073000 sec
[junitlauncher]
[junitlauncher] Running org.apache.poi.openxml4j.opc.compliance.TestOPCCompliancePackageModel
[junitlauncher] Tests run: 6, Failures: 0, Aborted: 0, Skipped: 0, Time elapsed: 0.021000 sec
[junitlauncher]
[junitlauncher] Running org.apache.poi.openxml4j.opc.compliance.TestOPCCompliancePartName
[junitlauncher] Tests run: 10, Failures: 0, Aborted: 0, Skipped: 0, Time elapsed: 0.007000 sec
[junitlauncher]
[junitlauncher] Running org.apache.poi.openxml4j.opc.internal.TestContentTypeManager
[junitlauncher] Tests run: 4, Failures: 0, Aborted: 0, Skipped: 0, Time elapsed: 0.128000 sec
[junitlauncher]
[junitlauncher] Running org.apache.poi.openxml4j.opc.internal.marshallers.TestZipPackagePropertiesMarshaller
[junitlauncher] Tests run: 3, Failures: 0, Aborted: 0, Skipped: 0, Time elapsed: 0.004000 sec
[junitlauncher]
[junitlauncher] Running org.apache.poi.openxml4j.util.TestZipSecureFile
[junitlauncher] Tests run: 1, Failures: 0, Aborted: 0, Skipped: 0, Time elapsed: 0.003000 sec
[junitlauncher]
[junitlauncher] Running org.apache.poi.poifs.crypt.dsig.TestSignatureConfig
[junitlauncher] Tests run: 2, Failures: 0, Aborted: 0, Skipped: 1, Time elapsed: 0.007000 sec
[junitlauncher]
[junitlauncher] Running org.apache.poi.poifs.crypt.dsig.TestSignatureInfo
[junitlauncher]    Failed: testRetrieveCertificate()
[junitlauncher]    Failed: testSignatureImage()
[junitlauncher]    Failed: bug58630()
[junitlauncher]    Failed: getSignerUnsigned()
[junitlauncher]    Failed: office2007prettyPrintedRels()
[junitlauncher]    Failed: testCertChain()
[junitlauncher]    Failed: testMultiSign()
[junitlauncher]    Failed: testManipulation()
[junitlauncher]    Failed: testSignSpreadsheet()
[junitlauncher]    Failed: getSigner()
[junitlauncher]    Failed: testSignSpreadsheetWithSignatureInfo()
[junitlauncher]    Failed: testSignEnvelopingDocument()
[junitlauncher]    Failed: testNonSha1()
[junitlauncher]    Failed: getMultiSigners()
[junitlauncher] Tests run: 15, Failures: 14, Aborted: 0, Skipped: 1, Time elapsed: 3.668000 sec

BUILD FAILED
<https://ci-builds.apache.org/job/POI/job/POI-DSL-Github-PullRequests/ws/build.xml>:1663: The following error occurred while executing this line:
<https://ci-builds.apache.org/job/POI/job/POI-DSL-Github-PullRequests/ws/build.xml>:1635: The following error occurred while executing this line:
<https://ci-builds.apache.org/job/POI/job/POI-DSL-Github-PullRequests/ws/build.xml>:1253: Some test(s) have failure(s)

Total time: 8 minutes 46 seconds
Build step 'Invoke Ant' marked build as failure
[SpotBugs] Skipping execution of recorder since overall result is 'FAILURE'
Archiving artifacts
[Fast Archiver] Compressed 3.09 MB of artifacts by 99.2% relative to #1
Skipping publisher since build result is FAILURE
Recording test results

---------------------------------------------------------------------
To unsubscribe, e-mail: [hidden email]
For additional commands, e-mail: [hidden email]