Build failed in Jenkins: POI » POI-DSL-Github-PullRequests #11

classic Classic list List threaded Threaded
4 messages Options
Reply | Threaded
Open this post in threaded view
|

Build failed in Jenkins: POI » POI-DSL-Github-PullRequests #11

Apache Jenkins Server
See <https://ci-builds.apache.org/job/POI/job/POI-DSL-Github-PullRequests/11/display/redirect?page=changes>

Changes:

[Marius Volkhart] Cache Maven repo during GitHub Actions

[Marius Volkhart] Add the ability to edit HSLFPictureData contents

[Marius Volkhart] fixup! Add the ability to edit HSLFPictureData contents


------------------------------------------
[...truncated 107.38 KB...]
[junitlauncher] Running org.apache.poi.ss.formula.ptg.TestPercentPtg
[junitlauncher] Tests run: 1, Failures: 0, Aborted: 0, Skipped: 0, Time elapsed: 0.001000 sec
[junitlauncher]
[junitlauncher] Running org.apache.poi.ss.formula.ptg.TestRangePtg
[junitlauncher] Tests run: 1, Failures: 0, Aborted: 0, Skipped: 0, Time elapsed: 0.001000 sec
[junitlauncher]
[junitlauncher] Running org.apache.poi.ss.formula.ptg.TestRef3DPtg
[junitlauncher] Tests run: 1, Failures: 0, Aborted: 0, Skipped: 0, Time elapsed: 0.001000 sec
[junitlauncher]
[junitlauncher] Running org.apache.poi.ss.formula.ptg.TestReferencePtg
[junitlauncher] Tests run: 4, Failures: 0, Aborted: 0, Skipped: 0, Time elapsed: 0.013000 sec
[junitlauncher]
[junitlauncher] Running org.apache.poi.ss.formula.ptg.TestUnionPtg
[junitlauncher] Tests run: 1, Failures: 0, Aborted: 0, Skipped: 0, Time elapsed: 0.001000 sec
[junitlauncher]
[junitlauncher] Running org.apache.poi.ss.formula.udf.TestUDFFinder
[junitlauncher] Tests run: 3, Failures: 0, Aborted: 0, Skipped: 0, Time elapsed: 0.003000 sec
[junitlauncher]
[junitlauncher] Running org.apache.poi.ss.usermodel.TestDataFormatter
[junitlauncher] Tests run: 37, Failures: 0, Aborted: 0, Skipped: 1, Time elapsed: 0.438000 sec
[junitlauncher]
[junitlauncher] Running org.apache.poi.ss.usermodel.TestDateUtil
[junitlauncher] Tests run: 26, Failures: 0, Aborted: 0, Skipped: 0, Time elapsed: 0.022000 sec
[junitlauncher]
[junitlauncher] Running org.apache.poi.ss.usermodel.TestExcelStyleDateFormatter
[junitlauncher] Tests run: 123, Failures: 0, Aborted: 0, Skipped: 0, Time elapsed: 0.076000 sec
[junitlauncher]
[junitlauncher] Running org.apache.poi.ss.usermodel.TestFractionFormat
[junitlauncher] Tests run: 5, Failures: 0, Aborted: 0, Skipped: 1, Time elapsed: 0.332000 sec
[junitlauncher]
[junitlauncher] Running org.apache.poi.ss.usermodel.TestHSSFBorderStyle
[junitlauncher] Tests run: 1, Failures: 0, Aborted: 0, Skipped: 0, Time elapsed: 0.002000 sec
[junitlauncher]
[junitlauncher] Running org.apache.poi.ss.usermodel.TestIndexedColors
[junitlauncher] Tests run: 3, Failures: 0, Aborted: 0, Skipped: 0, Time elapsed: 0.002000 sec
[junitlauncher]
[junitlauncher] Running org.apache.poi.ss.util.TestAreaReference
[junitlauncher] Tests run: 3, Failures: 0, Aborted: 0, Skipped: 0, Time elapsed: 0.001000 sec
[junitlauncher]
[junitlauncher] Running org.apache.poi.ss.util.TestCellAddress
[junitlauncher] Tests run: 6, Failures: 0, Aborted: 0, Skipped: 0, Time elapsed: 0.001000 sec
[junitlauncher]
[junitlauncher] Running org.apache.poi.ss.util.TestCellRangeAddress
[junitlauncher] Tests run: 14, Failures: 0, Aborted: 0, Skipped: 0, Time elapsed: 0.008000 sec
[junitlauncher]
[junitlauncher] Running org.apache.poi.ss.util.TestCellRangeUtil
[junitlauncher] Tests run: 1, Failures: 0, Aborted: 0, Skipped: 0, Time elapsed: 0.001000 sec
[junitlauncher]
[junitlauncher] Running org.apache.poi.ss.util.TestCellReference
[junitlauncher] Tests run: 27, Failures: 0, Aborted: 0, Skipped: 0, Time elapsed: 0.380000 sec
[junitlauncher]
[junitlauncher] Running org.apache.poi.ss.util.TestDateFormatConverter
[junitlauncher] Tests run: 18, Failures: 0, Aborted: 0, Skipped: 0, Time elapsed: 2.490000 sec
[junitlauncher]
[junitlauncher] Running org.apache.poi.ss.util.TestDateParser
[junitlauncher] Tests run: 5, Failures: 0, Aborted: 0, Skipped: 0, Time elapsed: 0.004000 sec
[junitlauncher]
[junitlauncher] Running org.apache.poi.ss.util.TestExpandedDouble
[junitlauncher] Tests run: 18, Failures: 0, Aborted: 0, Skipped: 0, Time elapsed: 0.013000 sec
[junitlauncher]
[junitlauncher] Running org.apache.poi.ss.util.TestHSSFCellUtil
[junitlauncher] Tests run: 14, Failures: 0, Aborted: 0, Skipped: 0, Time elapsed: 0.024000 sec
[junitlauncher]
[junitlauncher] Running org.apache.poi.ss.util.TestNumberComparer
[junitlauncher] Tests run: 115, Failures: 0, Aborted: 0, Skipped: 0, Time elapsed: 0.074000 sec
[junitlauncher]
[junitlauncher] Running org.apache.poi.ss.util.TestNumberToTextConverter
[junitlauncher] Tests run: 2, Failures: 0, Aborted: 0, Skipped: 0, Time elapsed: 0.012000 sec
[junitlauncher]
[junitlauncher] Running org.apache.poi.ss.util.TestPropertyTemplate
[junitlauncher] Tests run: 8, Failures: 0, Aborted: 0, Skipped: 0, Time elapsed: 0.023000 sec
[junitlauncher]
[junitlauncher] Running org.apache.poi.ss.util.TestRegionUtil
[junitlauncher] Tests run: 10, Failures: 0, Aborted: 0, Skipped: 0, Time elapsed: 0.016000 sec
[junitlauncher]
[junitlauncher] Running org.apache.poi.ss.util.TestSheetBuilder
[junitlauncher] Tests run: 3, Failures: 0, Aborted: 0, Skipped: 0, Time elapsed: 0.003000 sec
[junitlauncher]
[junitlauncher] Running org.apache.poi.ss.util.TestSheetUtil
[junitlauncher] Tests run: 7, Failures: 0, Aborted: 0, Skipped: 0, Time elapsed: 0.006000 sec
[junitlauncher]
[junitlauncher] Running org.apache.poi.ss.util.TestWorkbookUtil
[junitlauncher] Tests run: 1, Failures: 0, Aborted: 0, Skipped: 0, Time elapsed: 0.000000 sec
[junitlauncher]
[junitlauncher] Running org.apache.poi.ss.util.cellwalk.TestCellWalk
[junitlauncher] Tests run: 1, Failures: 0, Aborted: 0, Skipped: 0, Time elapsed: 0.004000 sec
[junitlauncher]
[junitlauncher] Running org.apache.poi.util.TestArrayUtil
[junitlauncher] Tests run: 1, Failures: 0, Aborted: 0, Skipped: 0, Time elapsed: 0.002000 sec
[junitlauncher]
[junitlauncher] Running org.apache.poi.util.TestBitField
[junitlauncher] Tests run: 16, Failures: 0, Aborted: 0, Skipped: 0, Time elapsed: 0.003000 sec
[junitlauncher]
[junitlauncher] Running org.apache.poi.util.TestByteField
[junitlauncher] Tests run: 5, Failures: 0, Aborted: 0, Skipped: 0, Time elapsed: 0.001000 sec
[junitlauncher]
[junitlauncher] Running org.apache.poi.util.TestHexDump
[junitlauncher] Tests run: 8, Failures: 0, Aborted: 0, Skipped: 0, Time elapsed: 0.015000 sec
[junitlauncher]
[junitlauncher] Running org.apache.poi.util.TestIOUtils
[junitlauncher] Tests run: 36, Failures: 0, Aborted: 0, Skipped: 0, Time elapsed: 0.031000 sec
[junitlauncher]
[junitlauncher] Running org.apache.poi.util.TestIntList
[junitlauncher] Tests run: 19, Failures: 0, Aborted: 0, Skipped: 0, Time elapsed: 0.081000 sec
[junitlauncher]
[junitlauncher] Running org.apache.poi.util.TestIntegerField
[junitlauncher] Tests run: 5, Failures: 0, Aborted: 0, Skipped: 0, Time elapsed: 0.004000 sec
[junitlauncher]
[junitlauncher] Running org.apache.poi.util.TestLittleEndian
[junitlauncher] Tests run: 15, Failures: 0, Aborted: 0, Skipped: 0, Time elapsed: 0.005000 sec
[junitlauncher]
[junitlauncher] Running org.apache.poi.util.TestLittleEndianStreams
[junitlauncher] Tests run: 5, Failures: 0, Aborted: 0, Skipped: 0, Time elapsed: 0.002000 sec
[junitlauncher]
[junitlauncher] Running org.apache.poi.util.TestLocaleUtil
[junitlauncher] Tests run: 3, Failures: 0, Aborted: 0, Skipped: 0, Time elapsed: 0.001000 sec
[junitlauncher]
[junitlauncher] Running org.apache.poi.util.TestLongField
[junitlauncher] Tests run: 5, Failures: 0, Aborted: 0, Skipped: 0, Time elapsed: 0.004000 sec
[junitlauncher]
[junitlauncher] Running org.apache.poi.util.TestPOILogger
[junitlauncher] Tests run: 1, Failures: 0, Aborted: 0, Skipped: 0, Time elapsed: 0.001000 sec
[junitlauncher]
[junitlauncher] Running org.apache.poi.util.TestRLEDecompressingInputStream
[junitlauncher] Tests run: 4, Failures: 0, Aborted: 0, Skipped: 0, Time elapsed: 0.003000 sec
[junitlauncher]
[junitlauncher] Running org.apache.poi.util.TestShortField
[junitlauncher] Tests run: 5, Failures: 0, Aborted: 0, Skipped: 0, Time elapsed: 0.003000 sec
[junitlauncher]
[junitlauncher] Running org.apache.poi.util.TestStringCodepointsIterable
[junitlauncher] Tests run: 1, Failures: 0, Aborted: 0, Skipped: 0, Time elapsed: 0.002000 sec
[junitlauncher]
[junitlauncher] Running org.apache.poi.util.TestStringUtil
[junitlauncher] Tests run: 7, Failures: 0, Aborted: 0, Skipped: 0, Time elapsed: 0.004000 sec
[junitlauncher]
[junitlauncher] Running org.apache.poi.util.TestTempFile
[junitlauncher] Tests run: 4, Failures: 0, Aborted: 0, Skipped: 0, Time elapsed: 0.014000 sec
[junitlauncher]
[junitlauncher] Running org.apache.poi.util.TestXMLHelper
[junitlauncher] Tests run: 8, Failures: 0, Aborted: 0, Skipped: 0, Time elapsed: 0.478000 sec
    [javac] Compiling 3 source files to <https://ci-builds.apache.org/job/POI/job/POI-DSL-Github-PullRequests/ws/build/poi-ant-contrib>

-test-main-write-testfile:

-test-scratchpad-check:

test-scratchpad-download-resources:

test-scratchpad:
[junitlauncher]
[junitlauncher] Running org.apache.poi.hdgf.TestHDGFCore
[junitlauncher] Tests run: 7, Failures: 0, Aborted: 0, Skipped: 0, Time elapsed: 0.848000 sec
[junitlauncher]
[junitlauncher] Running org.apache.poi.hdgf.TestHDGFLZW
[junitlauncher] Tests run: 5, Failures: 0, Aborted: 0, Skipped: 0, Time elapsed: 0.051000 sec
[junitlauncher]
[junitlauncher] Running org.apache.poi.hdgf.chunks.TestChunks
[junitlauncher] Tests run: 5, Failures: 0, Aborted: 0, Skipped: 0, Time elapsed: 0.022000 sec
[junitlauncher]
[junitlauncher] Running org.apache.poi.hdgf.dev.TestVSDDumper
[junitlauncher] Tests run: 1, Failures: 0, Aborted: 0, Skipped: 0, Time elapsed: 0.050000 sec
[junitlauncher]
[junitlauncher] Running org.apache.poi.hdgf.extractor.TestVisioExtractor
[junitlauncher] Tests run: 9, Failures: 0, Aborted: 0, Skipped: 0, Time elapsed: 0.250000 sec
[junitlauncher]
[junitlauncher] Running org.apache.poi.hdgf.pointers.TestPointerFactory
[junitlauncher] Tests run: 4, Failures: 0, Aborted: 0, Skipped: 0, Time elapsed: 0.006000 sec
[junitlauncher]
[junitlauncher] Running org.apache.poi.hdgf.streams.TestStreamBasics
[junitlauncher] Tests run: 2, Failures: 0, Aborted: 0, Skipped: 0, Time elapsed: 0.005000 sec
[junitlauncher]
[junitlauncher] Running org.apache.poi.hdgf.streams.TestStreamBugs
[junitlauncher] Tests run: 3, Failures: 0, Aborted: 0, Skipped: 0, Time elapsed: 0.029000 sec
[junitlauncher]
[junitlauncher] Running org.apache.poi.hdgf.streams.TestStreamComplex
[junitlauncher] Tests run: 6, Failures: 0, Aborted: 0, Skipped: 0, Time elapsed: 0.042000 sec
[junitlauncher]
[junitlauncher] Running org.apache.poi.hemf.hemfplus.extractor.TestHemfPlusExtractor
[junitlauncher] Tests run: 1, Failures: 0, Aborted: 0, Skipped: 0, Time elapsed: 0.442000 sec
[junitlauncher]
[junitlauncher] Running org.apache.poi.hemf.usermodel.TestHemfPicture
[junitlauncher] Tests run: 8, Failures: 0, Aborted: 0, Skipped: 0, Time elapsed: 0.311000 sec
[junitlauncher]
[junitlauncher] Running org.apache.poi.hmef.TestAttachments
[junitlauncher] Tests run: 4, Failures: 0, Aborted: 0, Skipped: 0, Time elapsed: 0.142000 sec
[junitlauncher]
[junitlauncher] Running org.apache.poi.hmef.TestBugs
[junitlauncher] Tests run: 3, Failures: 0, Aborted: 0, Skipped: 0, Time elapsed: 0.036000 sec
[junitlauncher]
[junitlauncher] Running org.apache.poi.hmef.TestCompressedRTF
[junitlauncher] Tests run: 4, Failures: 0, Aborted: 0, Skipped: 0, Time elapsed: 0.051000 sec
[junitlauncher]
[junitlauncher] Running org.apache.poi.hmef.TestHMEFMessage
[junitlauncher] Tests run: 9, Failures: 0, Aborted: 0, Skipped: 0, Time elapsed: 0.027000 sec
[junitlauncher]
[junitlauncher] Running org.apache.poi.hmef.attribute.TestMAPIAttributes
[junitlauncher] Tests run: 4, Failures: 0, Aborted: 0, Skipped: 0, Time elapsed: 0.016000 sec
[junitlauncher]
[junitlauncher] Running org.apache.poi.hmef.attribute.TestTNEFAttributes
[junitlauncher] Tests run: 6, Failures: 0, Aborted: 0, Skipped: 0, Time elapsed: 0.024000 sec
[junitlauncher]
[junitlauncher] Running org.apache.poi.hmef.dev.TestHMEFDumper
[junitlauncher] Tests run: 3, Failures: 0, Aborted: 0, Skipped: 0, Time elapsed: 0.051000 sec
[junitlauncher]
[junitlauncher] Running org.apache.poi.hmef.extractor.TestHMEFContentsExtractor
[junitlauncher] Tests run: 3, Failures: 0, Aborted: 0, Skipped: 0, Time elapsed: 0.027000 sec
[junitlauncher]
[junitlauncher] Running org.apache.poi.hpbf.TestHPBFDocument
[junitlauncher] Tests run: 2, Failures: 0, Aborted: 0, Skipped: 0, Time elapsed: 0.108000 sec
[junitlauncher]
[junitlauncher] Running org.apache.poi.hpbf.extractor.TestPublisherTextExtractor
[junitlauncher] Tests run: 4, Failures: 0, Aborted: 0, Skipped: 0, Time elapsed: 0.062000 sec
[junitlauncher]
[junitlauncher] Running org.apache.poi.hpbf.model.TestEscherParts
[junitlauncher] Tests run: 2, Failures: 0, Aborted: 0, Skipped: 0, Time elapsed: 0.047000 sec
[junitlauncher]
[junitlauncher] Running org.apache.poi.hpbf.model.TestQuillContents
[junitlauncher] Tests run: 8, Failures: 0, Aborted: 0, Skipped: 0, Time elapsed: 0.044000 sec
[junitlauncher]
[junitlauncher] Running org.apache.poi.hslf.TestEncryptedFile
[junitlauncher] Tests run: 4, Failures: 0, Aborted: 0, Skipped: 0, Time elapsed: 0.547000 sec
[junitlauncher]
[junitlauncher] Running org.apache.poi.hslf.TestPOIDocumentScratchpad
[junitlauncher] Tests run: 4, Failures: 0, Aborted: 0, Skipped: 0, Time elapsed: 0.295000 sec
[junitlauncher]
[junitlauncher] Running org.apache.poi.hslf.TestReWrite
[junitlauncher] Tests run: 5, Failures: 0, Aborted: 0, Skipped: 0, Time elapsed: 0.568000 sec
[junitlauncher]
[junitlauncher] Running org.apache.poi.hslf.TestReWriteSanity
[junitlauncher] Tests run: 1, Failures: 0, Aborted: 0, Skipped: 0, Time elapsed: 0.014000 sec
[junitlauncher]
[junitlauncher] Running org.apache.poi.hslf.TestRecordCounts
[junitlauncher] Tests run: 3, Failures: 0, Aborted: 0, Skipped: 0, Time elapsed: 0.012000 sec
[junitlauncher]
[junitlauncher] Running org.apache.poi.hslf.dev.TestPPDrawingTextListing
[junitlauncher]    Failed: [67] <https://ci-builds.apache.org/job/POI/job/POI-DSL-Github-PullRequests/ws/test-data/slideshow/ppt_with_png_encrypted.ppt>
[junitlauncher] Tests run: 116, Failures: 1, Aborted: 0, Skipped: 0, Time elapsed: 1.428000 sec

BUILD FAILED
<https://ci-builds.apache.org/job/POI/job/POI-DSL-Github-PullRequests/ws/build.xml>:1610: The following error occurred while executing this line:
<https://ci-builds.apache.org/job/POI/job/POI-DSL-Github-PullRequests/ws/build.xml>:1254: Some test(s) have failure(s)

Total time: 6 minutes 54 seconds
Build step 'Invoke Ant' marked build as failure
[SpotBugs] Skipping execution of recorder since overall result is 'FAILURE'
Archiving artifacts
[Fast Archiver] Compressed 3.09 MB of artifacts by 99.2% relative to #10
Skipping publisher since build result is FAILURE
Recording test results

---------------------------------------------------------------------
To unsubscribe, e-mail: [hidden email]
For additional commands, e-mail: [hidden email]

Reply | Threaded
Open this post in threaded view
|

Build failed in Jenkins: POI » POI-DSL-Github-PullRequests #12

Apache Jenkins Server
See <https://ci-builds.apache.org/job/POI/job/POI-DSL-Github-PullRequests/12/display/redirect?page=changes>

Changes:

[Marius Volkhart] Use Log4j 2 for logging

[Marius Volkhart] fixup! Use Log4j 2 for logging

[Marius Volkhart] fixup! Use Log4j 2 for logging

[Marius Volkhart] fixup! Use Log4j 2 for logging

[Marius Volkhart] fixup! Use Log4j 2 for logging

[Marius Volkhart] fixup! Use Log4j 2 for logging

[Marius Volkhart] fixup! Use Log4j 2 for logging

[Marius Volkhart] fixup! Use Log4j 2 for logging

[Marius Volkhart] fixup! Use Log4j 2 for logging

[Marius Volkhart] fixup! Use Log4j 2 for logging

[Marius Volkhart] Move the test logging configs to classpath


------------------------------------------
[...truncated 3.44 KB...]
+ ls -al /home/jenkins/tools/java/latest1.8/bin
total 836
drwxr-xr-x 2 root root   4096 Jan 29 21:08 .
drwxr-xr-x 8 root root   4096 Jan 29 21:08 ..
-rwxr-xr-x 1 root root   8840 Dec  9 12:47 appletviewer
lrwxrwxrwx 1 root root      8 Dec  9 12:47 ControlPanel -> jcontrol
-rwxr-xr-x 1 root root   8832 Dec  9 12:47 extcheck
-rwxr-xr-x 1 root root   8832 Dec  9 12:47 idlj
-rwxr-xr-x 1 root root   8832 Dec  9 12:47 jar
-rwxr-xr-x 1 root root   8832 Dec  9 12:47 jarsigner
-rwxr-xr-x 1 root root   8712 Dec  9 12:47 java
-rwxr-xr-x 1 root root   8832 Dec  9 12:47 javac
-rwxr-xr-x 1 root root   8832 Dec  9 12:47 javadoc
-rwxr-xr-x 1 root root   2293 Dec  9 10:15 javafxpackager
-rwxr-xr-x 1 root root   8832 Dec  9 12:47 javah
-rwxr-xr-x 1 root root   8832 Dec  9 12:47 javap
-rwxr-xr-x 1 root root   2293 Dec  9 10:15 javapackager
-rwxr-xr-x 1 root root   1809 Dec  9 12:47 java-rmi.cgi
-rwxr-xr-x 1 root root 148896 Dec  9 12:47 javaws
-rwxr-xr-x 1 root root   8832 Dec  9 12:47 jcmd
-rwxr-xr-x 1 root root   8856 Dec  9 12:47 jconsole
-rwxr-xr-x 1 root root   6264 Dec  9 12:47 jcontrol
-rwxr-xr-x 1 root root   8848 Dec  9 12:47 jdb
-rwxr-xr-x 1 root root   8832 Dec  9 12:47 jdeps
-rwxr-xr-x 1 root root   8832 Dec  9 12:47 jhat
-rwxr-xr-x 1 root root   8896 Dec  9 12:47 jinfo
-rwxr-xr-x 1 root root   8832 Dec  9 12:47 jjs
-rwxr-xr-x 1 root root   8896 Dec  9 12:47 jmap
-rwxr-xr-x 1 root root   8832 Dec  9 12:47 jps
-rwxr-xr-x 1 root root   8840 Dec  9 12:47 jrunscript
-rwxr-xr-x 1 root root   8848 Dec  9 12:47 jsadebugd
-rwxr-xr-x 1 root root   8896 Dec  9 12:47 jstack
-rwxr-xr-x 1 root root   8832 Dec  9 12:47 jstat
-rwxr-xr-x 1 root root   8832 Dec  9 12:47 jstatd
-rwxr-xr-x 1 root root   5110 Jan 14  2017 jvisualvm
-rwxr-xr-x 1 root root   8832 Dec  9 12:47 keytool
-rwxr-xr-x 1 root root   8840 Dec  9 12:47 native2ascii
-rwxr-xr-x 1 root root   8904 Dec  9 12:47 orbd
-rwxr-xr-x 1 root root   8832 Dec  9 12:47 pack200
-rwxr-xr-x 1 root root   8840 Dec  9 12:47 policytool
-rwxr-xr-x 1 root root   8832 Dec  9 12:47 rmic
-rwxr-xr-x 1 root root   8832 Dec  9 12:47 rmid
-rwxr-xr-x 1 root root   8840 Dec  9 12:47 rmiregistry
-rwxr-xr-x 1 root root   8832 Dec  9 12:47 schemagen
-rwxr-xr-x 1 root root   8832 Dec  9 12:47 serialver
-rwxr-xr-x 1 root root   8840 Dec  9 12:47 servertool
-rwxr-xr-x 1 root root   8904 Dec  9 12:47 tnameserv
-rwxr-xr-x 1 root root 186960 Dec  9 12:47 unpack200
-rwxr-xr-x 1 root root   8832 Dec  9 12:47 wsgen
-rwxr-xr-x 1 root root   8832 Dec  9 12:47 wsimport
-rwxr-xr-x 1 root root   8832 Dec  9 12:47 xjc
+ /home/jenkins/tools/java/latest1.8/bin/java -version
java version "1.8.0_281"
Java(TM) SE Runtime Environment (build 1.8.0_281-b09)
Java HotSpot(TM) 64-Bit Server VM (build 25.281-b09, mixed mode)
+ echo which java
which java
+ which java
/home/jenkins/tools/java/latest1.8/bin/java
+ java -version
java version "1.8.0_281"
Java(TM) SE Runtime Environment (build 1.8.0_281-b09)
Java HotSpot(TM) 64-Bit Server VM (build 25.281-b09, mixed mode)
+ echo which javac
which javac
+ which javac
/home/jenkins/tools/java/latest1.8/bin/javac
+ javac -version
javac 1.8.0_281
+ echo Ant-Home:
Ant-Home:
+ ls -al
total 464
drwxr-xr-x 15 jenkins jenkins   4096 Feb 12 15:50 .
drwxr-xr-x  6 jenkins jenkins   4096 Feb  7 13:59 ..
drwxr-xr-x 30 jenkins jenkins   4096 Feb  9 20:29 build
-rw-r--r--  1 jenkins jenkins  15388 Feb 12 15:50 build.gradle
-rw-r--r--  1 jenkins jenkins    172 Feb  9 19:46 build.javacheck.xml
-rw-r--r--  1 jenkins jenkins 157782 Feb 12 15:50 build.xml
-rw-r--r--  1 jenkins jenkins   3264 Feb 12 15:50 .classpath
-rw-r--r--  1 jenkins jenkins   6325 Feb  1 15:26 doap_POI.rdf
-rw-r--r--  1 jenkins jenkins   2934 Feb  1 15:26 file-leak-detector.exclude
drwxr-xr-x  8 jenkins jenkins   4096 Feb 12 15:50 .git
-rw-r--r--  1 jenkins jenkins     53 Feb  1 15:26 .gitattributes
drwxr-xr-x  3 jenkins jenkins   4096 Feb  1 15:26 .github
-rw-r--r--  1 jenkins jenkins    482 Feb  1 15:26 .gitignore
drwxr-xr-x  3 jenkins jenkins   4096 Feb  1 15:26 gradle
-rwxr-xr-x  1 jenkins jenkins   5770 Feb  1 15:26 gradlew
-rw-r--r--  1 jenkins jenkins   3058 Feb  1 15:26 gradlew.bat
drwxr-xr-x  2 jenkins jenkins   4096 Feb  1 15:26 jenkins
-rw-r--r--  1 jenkins jenkins 167284 Feb  1 15:26 KEYS
drwxr-xr-x  2 jenkins jenkins   4096 Feb 12 15:50 legal
drwxr-xr-x  9 jenkins jenkins   4096 Feb  1 15:26 lib
drwxr-xr-x  2 jenkins jenkins   4096 Feb 12 15:50 maven
drwxr-xr-x  3 jenkins jenkins   4096 Feb 12 15:50 osgi
-rw-r--r--  1 jenkins jenkins   4813 Feb  1 15:26 patch.xml
-rw-r--r--  1 jenkins jenkins    426 Feb  1 15:26 .project
-rw-r--r--  1 jenkins jenkins   4278 Feb  1 15:26 README.rst
drwxr-xr-x  2 jenkins jenkins   4096 Feb  1 15:26 .settings
-rw-r--r--  1 jenkins jenkins    556 Feb  1 15:26 settings.gradle
drwxr-xr-x  9 jenkins jenkins   4096 Feb 12 15:50 sonar
drwxr-xr-x 16 jenkins jenkins   4096 Feb  1 15:26 src
drwxr-xr-x 15 jenkins jenkins   4096 Feb  1 15:26 test-data
-rw-r--r--  1 jenkins jenkins    419 Feb  1 15:26 .travis.yml
+ echo which ant
which ant
+ which ant
/usr/bin/ant
+ ant -version
Apache Ant(TM) version 1.10.5 compiled on March 28 2019
+ echo <project default="test"><target name="test"><echo>Java ${ant.java.version}/${java.version}</echo><exec executable="javac"><arg value="-version"/></exec></target></project>
+ ant -f build.javacheck.xml -v
Apache Ant(TM) version 1.10.5 compiled on March 28 2019
Buildfile: <https://ci-builds.apache.org/job/POI/job/POI-DSL-Github-PullRequests/ws/build.javacheck.xml>
Detected Java version: 1.8 in: /usr/local/asfpackages/java/oraclejdk-1.8.0-281/jre
Detected OS: Linux
parsing buildfile <https://ci-builds.apache.org/job/POI/job/POI-DSL-Github-PullRequests/ws/build.javacheck.xml> with URI = <https://ci-builds.apache.org/job/POI/job/POI-DSL-Github-PullRequests/ws/build.javacheck.xml>
Project base dir set to: <https://ci-builds.apache.org/job/POI/job/POI-DSL-Github-PullRequests/ws/>
Build sequence for target(s) `test' is [test]
Complete build sequence is [test, ]

test:
parsing buildfile jar:file:/usr/share/ant/lib/ant.jar!/org/apache/tools/ant/antlib.xml with URI = jar:file:/usr/share/ant/lib/ant.jar!/org/apache/tools/ant/antlib.xml from a zip file
     [echo] Java 1.8/1.8.0_281
     [exec] Current OS is Linux
     [exec] Executing 'javac' with arguments:
     [exec] '-version'
     [exec]
     [exec] The ' characters around the executable and arguments are
     [exec] not part of the command.
     [exec] javac 1.8.0_281

BUILD SUCCESSFUL
Total time: 0 seconds
+ exit 0
[POI-DSL-Github-PullRequests] $ /bin/sh -xe /tmp/jenkins250335833091898403.sh
+ mkdir -p src/documentation
+ touch src/documentation/RELEASE-NOTES.txt
[POI-DSL-Github-PullRequests] $ /home/jenkins/tools/ant/latest1.10/bin/ant -Dsha1=origin/pr/9/head -Dcoverage.enabled=true clean jenkins
Buildfile: <https://ci-builds.apache.org/job/POI/job/POI-DSL-Github-PullRequests/ws/build.xml>

clean:
   [delete] Deleting directory <https://ci-builds.apache.org/job/POI/job/POI-DSL-Github-PullRequests/ws/build>

replaceVersion:

check-jars:

fetch-jars:

check-ooxml-jars:

fetch-ooxml-jars:
      [get] Destination already exists (skipping): <https://ci-builds.apache.org/job/POI/job/POI-DSL-Github-PullRequests/12/artifact/lib/ooxml/curvesapi-1.06.jar>
      [get] Getting: https://repo1.maven.org/maven2/org/apache/xmlbeans/xmlbeans/4.0.0/xmlbeans-4.0.0.jar
      [get] To: <https://ci-builds.apache.org/job/POI/job/POI-DSL-Github-PullRequests/12/artifact/lib/ooxml/xmlbeans-4.0.0.jar>
      [get] Destination already exists (skipping): <https://ci-builds.apache.org/job/POI/job/POI-DSL-Github-PullRequests/12/artifact/lib/ooxml/commons-compress-1.20.jar>
      [get] Destination already exists (skipping): <https://ci-builds.apache.org/job/POI/job/POI-DSL-Github-PullRequests/ws/lib/ooxml-tests/reflections-0.9.12.jar>
      [get] Destination already exists (skipping): <https://ci-builds.apache.org/job/POI/job/POI-DSL-Github-PullRequests/ws/lib/ooxml-tests/guava-30.1-jre.jar>
      [get] Destination already exists (skipping): <https://ci-builds.apache.org/job/POI/job/POI-DSL-Github-PullRequests/ws/lib/ooxml-tests/javassist-3.27.0-GA.jar>
      [get] Destination already exists (skipping): <https://ci-builds.apache.org/job/POI/job/POI-DSL-Github-PullRequests/ws/lib/ooxml-provided/batik-all-1.13.jar>
      [get] Destination already exists (skipping): <https://ci-builds.apache.org/job/POI/job/POI-DSL-Github-PullRequests/ws/lib/ooxml-provided/xml-apis-ext-1.3.04.jar>
      [get] Destination already exists (skipping): <https://ci-builds.apache.org/job/POI/job/POI-DSL-Github-PullRequests/ws/lib/ooxml-provided/xmlgraphics-commons-2.4.jar>
      [get] Destination already exists (skipping): <https://ci-builds.apache.org/job/POI/job/POI-DSL-Github-PullRequests/ws/lib/ooxml-provided/pdfbox-2.0.22.jar>
      [get] Destination already exists (skipping): <https://ci-builds.apache.org/job/POI/job/POI-DSL-Github-PullRequests/ws/lib/ooxml-provided/fontbox-2.0.22.jar>
      [get] Destination already exists (skipping): <https://ci-builds.apache.org/job/POI/job/POI-DSL-Github-PullRequests/ws/lib/ooxml-provided/graphics2d-0.30.jar>

init:
    [mkdir] Created dir: <https://ci-builds.apache.org/job/POI/job/POI-DSL-Github-PullRequests/ws/build>
    [mkdir] Created dir: <https://ci-builds.apache.org/job/POI/job/POI-DSL-Github-PullRequests/ws/build/classes>
    [mkdir] Created dir: <https://ci-builds.apache.org/job/POI/job/POI-DSL-Github-PullRequests/ws/build/test-classes>
    [mkdir] Created dir: <https://ci-builds.apache.org/job/POI/job/POI-DSL-Github-PullRequests/ws/build/test-results>
    [mkdir] Created dir: <https://ci-builds.apache.org/job/POI/job/POI-DSL-Github-PullRequests/ws/build/scratchpad-classes>
    [mkdir] Created dir: <https://ci-builds.apache.org/job/POI/job/POI-DSL-Github-PullRequests/ws/build/scratchpad-test-classes>
    [mkdir] Created dir: <https://ci-builds.apache.org/job/POI/job/POI-DSL-Github-PullRequests/ws/build/scratchpad-test-results>
    [mkdir] Created dir: <https://ci-builds.apache.org/job/POI/job/POI-DSL-Github-PullRequests/ws/build/geometry-java>
    [mkdir] Created dir: <https://ci-builds.apache.org/job/POI/job/POI-DSL-Github-PullRequests/ws/build/ooxml-classes>
    [mkdir] Created dir: <https://ci-builds.apache.org/job/POI/job/POI-DSL-Github-PullRequests/ws/build/ooxml-test-classes>
    [mkdir] Created dir: <https://ci-builds.apache.org/job/POI/job/POI-DSL-Github-PullRequests/ws/build/ooxml-test-results>
    [mkdir] Created dir: <https://ci-builds.apache.org/job/POI/job/POI-DSL-Github-PullRequests/ws/build/excelant-classes>
    [mkdir] Created dir: <https://ci-builds.apache.org/job/POI/job/POI-DSL-Github-PullRequests/ws/build/excelant-test-classes>
    [mkdir] Created dir: <https://ci-builds.apache.org/job/POI/job/POI-DSL-Github-PullRequests/ws/build/excelant-test-results>
    [mkdir] Created dir: <https://ci-builds.apache.org/job/POI/job/POI-DSL-Github-PullRequests/ws/build/examples-classes>
    [mkdir] Created dir: <https://ci-builds.apache.org/job/POI/job/POI-DSL-Github-PullRequests/ws/build/integration-test-classes>
    [mkdir] Created dir: <https://ci-builds.apache.org/job/POI/job/POI-DSL-Github-PullRequests/12/artifact/build/integration-test-results>
    [mkdir] Created dir: <https://ci-builds.apache.org/job/POI/job/POI-DSL-Github-PullRequests/ws/build/dist>
    [mkdir] Created dir: <https://ci-builds.apache.org/job/POI/job/POI-DSL-Github-PullRequests/ws/build/site>
     [echo] Using Ant: Apache Ant(TM) version 1.10.9 compiled on September 27 2020 from /home/jenkins/tools/ant/latest1.10, Ant detected Java 1.8 (may be different than actual Java sometimes...)
     [echo] Using Java: 1.8.0_281/1.8.0_281-b09/25.281-b09/Java HotSpot(TM) 64-Bit Server VM from Oracle Corporation on Linux: 4.15.0-74-generic
     [echo] Building Apache POI version 5.0.1-SNAPSHOT and RC: RC1

-version-java-check:

compile-version:
     [copy] Copying 1 file to <https://ci-builds.apache.org/job/POI/job/POI-DSL-Github-PullRequests/ws/build/classes/org/apache/poi>
    [javac] Compiling 1 source file to <https://ci-builds.apache.org/job/POI/job/POI-DSL-Github-PullRequests/ws/build/classes>
   [delete] Deleting: <https://ci-builds.apache.org/job/POI/job/POI-DSL-Github-PullRequests/ws/build/classes/org/apache/poi/Version.java>

compile-main:
    [javac] Compiling 1171 source files to <https://ci-builds.apache.org/job/POI/job/POI-DSL-Github-PullRequests/ws/build/classes>
    [javac] Support for javac --release has been added in Java9 ignoring it
    [javac] Note: Some input files use or override a deprecated API.
    [javac] Note: Recompile with -Xlint:deprecation for details.
    [javac] Note: Some input files use unchecked or unsafe operations.
    [javac] Note: Recompile with -Xlint:unchecked for details.
    [javac] Creating empty <https://ci-builds.apache.org/job/POI/job/POI-DSL-Github-PullRequests/ws/build/classes/org/apache/poi/ddf/package-info.class>
    [javac] Creating empty <https://ci-builds.apache.org/job/POI/job/POI-DSL-Github-PullRequests/ws/build/classes/org/apache/poi/hssf/package-info.class>
    [javac] Creating empty <https://ci-builds.apache.org/job/POI/job/POI-DSL-Github-PullRequests/ws/build/classes/org/apache/poi/poifs/dev/package-info.class>
    [javac] Creating empty <https://ci-builds.apache.org/job/POI/job/POI-DSL-Github-PullRequests/ws/build/classes/org/apache/poi/util/package-info.class>
    [javac] Creating empty <https://ci-builds.apache.org/job/POI/job/POI-DSL-Github-PullRequests/ws/build/classes/org/apache/poi/poifs/common/package-info.class>
    [javac] Creating empty <https://ci-builds.apache.org/job/POI/job/POI-DSL-Github-PullRequests/ws/build/classes/org/apache/poi/hssf/record/package-info.class>
    [javac] Creating empty <https://ci-builds.apache.org/job/POI/job/POI-DSL-Github-PullRequests/ws/build/classes/org/apache/poi/poifs/package-info.class>
    [javac] Creating empty <https://ci-builds.apache.org/job/POI/job/POI-DSL-Github-PullRequests/ws/build/classes/org/apache/poi/poifs/crypt/package-info.class>
    [javac] Creating empty <https://ci-builds.apache.org/job/POI/job/POI-DSL-Github-PullRequests/ws/build/classes/org/apache/poi/hpsf/wellknown/package-info.class>
    [javac] Creating empty <https://ci-builds.apache.org/job/POI/job/POI-DSL-Github-PullRequests/ws/build/classes/org/apache/poi/hssf/dev/package-info.class>
    [javac] Creating empty <https://ci-builds.apache.org/job/POI/job/POI-DSL-Github-PullRequests/ws/build/classes/org/apache/poi/ss/formula/package-info.class>
    [javac] Creating empty <https://ci-builds.apache.org/job/POI/job/POI-DSL-Github-PullRequests/ws/build/classes/org/apache/poi/hpsf/package-info.class>
    [javac] Creating empty <https://ci-builds.apache.org/job/POI/job/POI-DSL-Github-PullRequests/ws/build/classes/org/apache/poi/poifs/property/package-info.class>
    [javac] Creating empty <https://ci-builds.apache.org/job/POI/job/POI-DSL-Github-PullRequests/ws/build/classes/org/apache/poi/poifs/filesystem/package-info.class>
    [javac] Creating empty <https://ci-builds.apache.org/job/POI/job/POI-DSL-Github-PullRequests/ws/build/classes/org/apache/poi/ss/formula/ptg/package-info.class>
    [javac] Creating empty <https://ci-builds.apache.org/job/POI/job/POI-DSL-Github-PullRequests/ws/build/classes/org/apache/poi/poifs/storage/package-info.class>
    [javac] Creating empty <https://ci-builds.apache.org/job/POI/job/POI-DSL-Github-PullRequests/ws/build/classes/org/apache/poi/hssf/eventusermodel/package-info.class>
    [javac] Creating empty <https://ci-builds.apache.org/job/POI/job/POI-DSL-Github-PullRequests/ws/build/classes/org/apache/poi/hssf/record/aggregates/package-info.class>
    [javac] Creating empty <https://ci-builds.apache.org/job/POI/job/POI-DSL-Github-PullRequests/ws/build/classes/org/apache/poi/ss/format/package-info.class>
    [javac] Creating empty <https://ci-builds.apache.org/job/POI/job/POI-DSL-Github-PullRequests/ws/build/classes/org/apache/poi/hssf/model/package-info.class>
    [javac] Creating empty <https://ci-builds.apache.org/job/POI/job/POI-DSL-Github-PullRequests/ws/build/classes/org/apache/poi/hssf/usermodel/package-info.class>
    [javac] Creating empty <https://ci-builds.apache.org/job/POI/job/POI-DSL-Github-PullRequests/ws/build/classes/org/apache/poi/hssf/util/package-info.class>
    [javac] Creating empty <https://ci-builds.apache.org/job/POI/job/POI-DSL-Github-PullRequests/ws/build/classes/org/apache/poi/poifs/eventfilesystem/package-info.class>
    [mkdir] Created dir: <https://ci-builds.apache.org/job/POI/job/POI-DSL-Github-PullRequests/ws/build/dist/maven/poi>
      [jar] Building jar: <https://ci-builds.apache.org/job/POI/job/POI-DSL-Github-PullRequests/ws/build/dist/maven/poi/poi-5.0.1-SNAPSHOT.jar>
    [javac] Compiling 517 source files to <https://ci-builds.apache.org/job/POI/job/POI-DSL-Github-PullRequests/ws/build/test-classes>
    [javac] Support for javac --release has been added in Java9 ignoring it
    [javac] Note: Some input files use or override a deprecated API.
    [javac] Note: Recompile with -Xlint:deprecation for details.
    [javac] Note: <https://ci-builds.apache.org/job/POI/job/POI-DSL-Github-PullRequests/ws/src/testcases/org/apache/poi/sl/usermodel/BaseTestSlideShow.java> uses unchecked or unsafe operations.
    [javac] Note: Recompile with -Xlint:unchecked for details.

BUILD FAILED
<https://ci-builds.apache.org/job/POI/job/POI-DSL-Github-PullRequests/ws/build.xml>:1100: The following error occurred while executing this line:
<https://ci-builds.apache.org/job/POI/job/POI-DSL-Github-PullRequests/ws/build.xml>:1054: <https://ci-builds.apache.org/job/POI/job/POI-DSL-Github-PullRequests/ws/src/resources/test> does not exist.

Total time: 29 seconds
Build step 'Invoke Ant' marked build as failure
[SpotBugs] Skipping execution of recorder since overall result is 'FAILURE'
Archiving artifacts
[Fast Archiver] Compressed 3.09 MB of artifacts by 99.2% relative to #10
Skipping publisher since build result is FAILURE
Recording test results
ERROR: Step ?Publish JUnit test result report? failed: No test report files were found. Configuration error?

---------------------------------------------------------------------
To unsubscribe, e-mail: [hidden email]
For additional commands, e-mail: [hidden email]

Reply | Threaded
Open this post in threaded view
|

Build failed in Jenkins: POI » POI-DSL-Github-PullRequests #13

Apache Jenkins Server
See <https://ci-builds.apache.org/job/POI/job/POI-DSL-Github-PullRequests/13/display/redirect?page=changes>

Changes:

[PJ Fanning] [bug-65120] PartAlreadyExistsException when creating cell comments

[PJ Fanning] remove accidental commit

[Marius Volkhart] Cache Maven repo during GitHub Actions

[Marius Volkhart] Add the ability to edit HSLFPictureData contents

[Marius Volkhart] fixup! Add the ability to edit HSLFPictureData contents

[Marius Volkhart] fixup! Add the ability to edit HSLFPictureData contents


------------------------------------------
[...truncated 102.47 KB...]
[junitlauncher] Tests run: 1, Failures: 0, Aborted: 0, Skipped: 0, Time elapsed: 0.001000 sec
[junitlauncher]
[junitlauncher] Running org.apache.poi.ss.formula.ptg.TestRangePtg
[junitlauncher] Tests run: 1, Failures: 0, Aborted: 0, Skipped: 0, Time elapsed: 0.001000 sec
[junitlauncher]
[junitlauncher] Running org.apache.poi.ss.formula.ptg.TestRef3DPtg
[junitlauncher] Tests run: 1, Failures: 0, Aborted: 0, Skipped: 0, Time elapsed: 0.001000 sec
[junitlauncher]
[junitlauncher] Running org.apache.poi.ss.formula.ptg.TestReferencePtg
[junitlauncher] Tests run: 4, Failures: 0, Aborted: 0, Skipped: 0, Time elapsed: 0.013000 sec
[junitlauncher]
[junitlauncher] Running org.apache.poi.ss.formula.ptg.TestUnionPtg
[junitlauncher] Tests run: 1, Failures: 0, Aborted: 0, Skipped: 0, Time elapsed: 0.002000 sec
[junitlauncher]
[junitlauncher] Running org.apache.poi.ss.formula.udf.TestUDFFinder
[junitlauncher] Tests run: 3, Failures: 0, Aborted: 0, Skipped: 0, Time elapsed: 0.003000 sec
[junitlauncher]
[junitlauncher] Running org.apache.poi.ss.usermodel.TestDataFormatter
[junitlauncher] Tests run: 37, Failures: 0, Aborted: 0, Skipped: 1, Time elapsed: 0.299000 sec
[junitlauncher]
[junitlauncher] Running org.apache.poi.ss.usermodel.TestDateUtil
[junitlauncher] Tests run: 26, Failures: 0, Aborted: 0, Skipped: 0, Time elapsed: 0.019000 sec
[junitlauncher]
[junitlauncher] Running org.apache.poi.ss.usermodel.TestExcelStyleDateFormatter
[junitlauncher] Tests run: 123, Failures: 0, Aborted: 0, Skipped: 0, Time elapsed: 0.072000 sec
[junitlauncher]
[junitlauncher] Running org.apache.poi.ss.usermodel.TestFractionFormat
[junitlauncher] Tests run: 5, Failures: 0, Aborted: 0, Skipped: 1, Time elapsed: 0.248000 sec
[junitlauncher]
[junitlauncher] Running org.apache.poi.ss.usermodel.TestHSSFBorderStyle
[junitlauncher] Tests run: 1, Failures: 0, Aborted: 0, Skipped: 0, Time elapsed: 0.002000 sec
[junitlauncher]
[junitlauncher] Running org.apache.poi.ss.usermodel.TestIndexedColors
[junitlauncher] Tests run: 3, Failures: 0, Aborted: 0, Skipped: 0, Time elapsed: 0.003000 sec
[junitlauncher]
[junitlauncher] Running org.apache.poi.ss.util.TestAreaReference
[junitlauncher] Tests run: 3, Failures: 0, Aborted: 0, Skipped: 0, Time elapsed: 0.002000 sec
[junitlauncher]
[junitlauncher] Running org.apache.poi.ss.util.TestCellAddress
[junitlauncher] Tests run: 6, Failures: 0, Aborted: 0, Skipped: 0, Time elapsed: 0.002000 sec
[junitlauncher]
[junitlauncher] Running org.apache.poi.ss.util.TestCellRangeAddress
[junitlauncher] Tests run: 14, Failures: 0, Aborted: 0, Skipped: 0, Time elapsed: 0.008000 sec
[junitlauncher]
[junitlauncher] Running org.apache.poi.ss.util.TestCellRangeUtil
[junitlauncher] Tests run: 1, Failures: 0, Aborted: 0, Skipped: 0, Time elapsed: 0.001000 sec
[junitlauncher]
[junitlauncher] Running org.apache.poi.ss.util.TestCellReference
[junitlauncher] Tests run: 27, Failures: 0, Aborted: 0, Skipped: 0, Time elapsed: 0.299000 sec
[junitlauncher]
[junitlauncher] Running org.apache.poi.ss.util.TestDateFormatConverter
[junitlauncher] Tests run: 18, Failures: 0, Aborted: 0, Skipped: 0, Time elapsed: 1.606000 sec
[junitlauncher]
[junitlauncher] Running org.apache.poi.ss.util.TestDateParser
[junitlauncher] Tests run: 5, Failures: 0, Aborted: 0, Skipped: 0, Time elapsed: 0.006000 sec
[junitlauncher]
[junitlauncher] Running org.apache.poi.ss.util.TestExpandedDouble
[junitlauncher] Tests run: 18, Failures: 0, Aborted: 0, Skipped: 0, Time elapsed: 0.013000 sec
[junitlauncher]
[junitlauncher] Running org.apache.poi.ss.util.TestHSSFCellUtil
[junitlauncher] Tests run: 14, Failures: 0, Aborted: 0, Skipped: 0, Time elapsed: 0.022000 sec
[junitlauncher]
[junitlauncher] Running org.apache.poi.ss.util.TestNumberComparer
[junitlauncher] Tests run: 115, Failures: 0, Aborted: 0, Skipped: 0, Time elapsed: 0.062000 sec
[junitlauncher]
[junitlauncher] Running org.apache.poi.ss.util.TestNumberToTextConverter
[junitlauncher] Tests run: 2, Failures: 0, Aborted: 0, Skipped: 0, Time elapsed: 0.010000 sec
[junitlauncher]
[junitlauncher] Running org.apache.poi.ss.util.TestPropertyTemplate
[junitlauncher] Tests run: 8, Failures: 0, Aborted: 0, Skipped: 0, Time elapsed: 0.026000 sec
[junitlauncher]
[junitlauncher] Running org.apache.poi.ss.util.TestRegionUtil
[junitlauncher] Tests run: 10, Failures: 0, Aborted: 0, Skipped: 0, Time elapsed: 0.022000 sec
[junitlauncher]
[junitlauncher] Running org.apache.poi.ss.util.TestSheetBuilder
[junitlauncher] Tests run: 3, Failures: 0, Aborted: 0, Skipped: 0, Time elapsed: 0.004000 sec
[junitlauncher]
[junitlauncher] Running org.apache.poi.ss.util.TestSheetUtil
[junitlauncher] Tests run: 7, Failures: 0, Aborted: 0, Skipped: 0, Time elapsed: 0.006000 sec
[junitlauncher]
[junitlauncher] Running org.apache.poi.ss.util.TestWorkbookUtil
[junitlauncher] Tests run: 1, Failures: 0, Aborted: 0, Skipped: 0, Time elapsed: 0.000000 sec
[junitlauncher]
[junitlauncher] Running org.apache.poi.ss.util.cellwalk.TestCellWalk
[junitlauncher] Tests run: 1, Failures: 0, Aborted: 0, Skipped: 0, Time elapsed: 0.005000 sec
[junitlauncher]
[junitlauncher] Running org.apache.poi.util.TestArrayUtil
[junitlauncher] Tests run: 1, Failures: 0, Aborted: 0, Skipped: 0, Time elapsed: 0.002000 sec
[junitlauncher]
[junitlauncher] Running org.apache.poi.util.TestBitField
[junitlauncher] Tests run: 16, Failures: 0, Aborted: 0, Skipped: 0, Time elapsed: 0.004000 sec
[junitlauncher]
[junitlauncher] Running org.apache.poi.util.TestByteField
[junitlauncher] Tests run: 5, Failures: 0, Aborted: 0, Skipped: 0, Time elapsed: 0.001000 sec
[junitlauncher]
[junitlauncher] Running org.apache.poi.util.TestHexDump
[junitlauncher] Tests run: 8, Failures: 0, Aborted: 0, Skipped: 0, Time elapsed: 0.016000 sec
[junitlauncher]
[junitlauncher] Running org.apache.poi.util.TestIOUtils
[junitlauncher] Tests run: 36, Failures: 0, Aborted: 0, Skipped: 0, Time elapsed: 0.025000 sec
[junitlauncher]
[junitlauncher] Running org.apache.poi.util.TestIntList
[junitlauncher] Tests run: 19, Failures: 0, Aborted: 0, Skipped: 0, Time elapsed: 0.053000 sec
[junitlauncher]
[junitlauncher] Running org.apache.poi.util.TestIntegerField
[junitlauncher] Tests run: 5, Failures: 0, Aborted: 0, Skipped: 0, Time elapsed: 0.006000 sec
[junitlauncher]
[junitlauncher] Running org.apache.poi.util.TestLittleEndian
[junitlauncher] Tests run: 15, Failures: 0, Aborted: 0, Skipped: 0, Time elapsed: 0.004000 sec
[junitlauncher]
[junitlauncher] Running org.apache.poi.util.TestLittleEndianStreams
[junitlauncher] Tests run: 5, Failures: 0, Aborted: 0, Skipped: 0, Time elapsed: 0.003000 sec
[junitlauncher]
[junitlauncher] Running org.apache.poi.util.TestLocaleUtil
[junitlauncher] Tests run: 3, Failures: 0, Aborted: 0, Skipped: 0, Time elapsed: 0.001000 sec
[junitlauncher]
[junitlauncher] Running org.apache.poi.util.TestLongField
[junitlauncher] Tests run: 5, Failures: 0, Aborted: 0, Skipped: 0, Time elapsed: 0.005000 sec
[junitlauncher]
[junitlauncher] Running org.apache.poi.util.TestPOILogger
[junitlauncher] Tests run: 1, Failures: 0, Aborted: 0, Skipped: 0, Time elapsed: 0.001000 sec
[junitlauncher]
[junitlauncher] Running org.apache.poi.util.TestRLEDecompressingInputStream
[junitlauncher] Tests run: 4, Failures: 0, Aborted: 0, Skipped: 0, Time elapsed: 0.002000 sec
[junitlauncher]
[junitlauncher] Running org.apache.poi.util.TestShortField
[junitlauncher] Tests run: 5, Failures: 0, Aborted: 0, Skipped: 0, Time elapsed: 0.004000 sec
[junitlauncher]
[junitlauncher] Running org.apache.poi.util.TestStringCodepointsIterable
[junitlauncher] Tests run: 1, Failures: 0, Aborted: 0, Skipped: 0, Time elapsed: 0.002000 sec
[junitlauncher]
[junitlauncher] Running org.apache.poi.util.TestStringUtil
[junitlauncher] Tests run: 7, Failures: 0, Aborted: 0, Skipped: 0, Time elapsed: 0.005000 sec
[junitlauncher]
[junitlauncher] Running org.apache.poi.util.TestTempFile
[junitlauncher] Tests run: 4, Failures: 0, Aborted: 0, Skipped: 0, Time elapsed: 0.005000 sec
[junitlauncher]
[junitlauncher] Running org.apache.poi.util.TestXMLHelper
[junitlauncher] Tests run: 8, Failures: 0, Aborted: 0, Skipped: 0, Time elapsed: 0.283000 sec
    [javac] Compiling 3 source files to <https://ci-builds.apache.org/job/POI/job/POI-DSL-Github-PullRequests/ws/build/poi-ant-contrib>

-test-main-write-testfile:

-test-scratchpad-check:

test-scratchpad-download-resources:

test-scratchpad:
[junitlauncher]
[junitlauncher] Running org.apache.poi.hdgf.TestHDGFCore
[junitlauncher] Tests run: 7, Failures: 0, Aborted: 0, Skipped: 0, Time elapsed: 0.538000 sec
[junitlauncher]
[junitlauncher] Running org.apache.poi.hdgf.TestHDGFLZW
[junitlauncher] Tests run: 5, Failures: 0, Aborted: 0, Skipped: 0, Time elapsed: 0.039000 sec
[junitlauncher]
[junitlauncher] Running org.apache.poi.hdgf.chunks.TestChunks
[junitlauncher] Tests run: 5, Failures: 0, Aborted: 0, Skipped: 0, Time elapsed: 0.024000 sec
[junitlauncher]
[junitlauncher] Running org.apache.poi.hdgf.dev.TestVSDDumper
[junitlauncher] Tests run: 1, Failures: 0, Aborted: 0, Skipped: 0, Time elapsed: 0.051000 sec
[junitlauncher]
[junitlauncher] Running org.apache.poi.hdgf.extractor.TestVisioExtractor
[junitlauncher] Tests run: 9, Failures: 0, Aborted: 0, Skipped: 0, Time elapsed: 0.272000 sec
[junitlauncher]
[junitlauncher] Running org.apache.poi.hdgf.pointers.TestPointerFactory
[junitlauncher] Tests run: 4, Failures: 0, Aborted: 0, Skipped: 0, Time elapsed: 0.011000 sec
[junitlauncher]
[junitlauncher] Running org.apache.poi.hdgf.streams.TestStreamBasics
[junitlauncher] Tests run: 2, Failures: 0, Aborted: 0, Skipped: 0, Time elapsed: 0.005000 sec
[junitlauncher]
[junitlauncher] Running org.apache.poi.hdgf.streams.TestStreamBugs
[junitlauncher] Tests run: 3, Failures: 0, Aborted: 0, Skipped: 0, Time elapsed: 0.037000 sec
[junitlauncher]
[junitlauncher] Running org.apache.poi.hdgf.streams.TestStreamComplex
[junitlauncher] Tests run: 6, Failures: 0, Aborted: 0, Skipped: 0, Time elapsed: 0.030000 sec
[junitlauncher]
[junitlauncher] Running org.apache.poi.hemf.hemfplus.extractor.TestHemfPlusExtractor
[junitlauncher] Tests run: 1, Failures: 0, Aborted: 0, Skipped: 0, Time elapsed: 0.388000 sec
[junitlauncher]
[junitlauncher] Running org.apache.poi.hemf.usermodel.TestHemfPicture
[junitlauncher] Tests run: 8, Failures: 0, Aborted: 0, Skipped: 0, Time elapsed: 0.324000 sec
[junitlauncher]
[junitlauncher] Running org.apache.poi.hmef.TestAttachments
[junitlauncher] Tests run: 4, Failures: 0, Aborted: 0, Skipped: 0, Time elapsed: 0.160000 sec
[junitlauncher]
[junitlauncher] Running org.apache.poi.hmef.TestBugs
[junitlauncher] Tests run: 3, Failures: 0, Aborted: 0, Skipped: 0, Time elapsed: 0.045000 sec
[junitlauncher]
[junitlauncher] Running org.apache.poi.hmef.TestCompressedRTF
[junitlauncher] Tests run: 4, Failures: 0, Aborted: 0, Skipped: 0, Time elapsed: 0.049000 sec
[junitlauncher]
[junitlauncher] Running org.apache.poi.hmef.TestHMEFMessage
[junitlauncher] Tests run: 9, Failures: 0, Aborted: 0, Skipped: 0, Time elapsed: 0.032000 sec
[junitlauncher]
[junitlauncher] Running org.apache.poi.hmef.attribute.TestMAPIAttributes
[junitlauncher] Tests run: 4, Failures: 0, Aborted: 0, Skipped: 0, Time elapsed: 0.017000 sec
[junitlauncher]
[junitlauncher] Running org.apache.poi.hmef.attribute.TestTNEFAttributes
[junitlauncher] Tests run: 6, Failures: 0, Aborted: 0, Skipped: 0, Time elapsed: 0.018000 sec
[junitlauncher]
[junitlauncher] Running org.apache.poi.hmef.dev.TestHMEFDumper
[junitlauncher] Tests run: 3, Failures: 0, Aborted: 0, Skipped: 0, Time elapsed: 0.049000 sec
[junitlauncher]
[junitlauncher] Running org.apache.poi.hmef.extractor.TestHMEFContentsExtractor
[junitlauncher] Tests run: 3, Failures: 0, Aborted: 0, Skipped: 0, Time elapsed: 0.030000 sec
[junitlauncher]
[junitlauncher] Running org.apache.poi.hpbf.TestHPBFDocument
[junitlauncher] Tests run: 2, Failures: 0, Aborted: 0, Skipped: 0, Time elapsed: 0.109000 sec
[junitlauncher]
[junitlauncher] Running org.apache.poi.hpbf.extractor.TestPublisherTextExtractor
[junitlauncher] Tests run: 4, Failures: 0, Aborted: 0, Skipped: 0, Time elapsed: 0.042000 sec
[junitlauncher]
[junitlauncher] Running org.apache.poi.hpbf.model.TestEscherParts
[junitlauncher] Tests run: 2, Failures: 0, Aborted: 0, Skipped: 0, Time elapsed: 0.031000 sec
[junitlauncher]
[junitlauncher] Running org.apache.poi.hpbf.model.TestQuillContents
[junitlauncher] Tests run: 8, Failures: 0, Aborted: 0, Skipped: 0, Time elapsed: 0.057000 sec
[junitlauncher]
[junitlauncher] Running org.apache.poi.hslf.TestEncryptedFile
[junitlauncher] Tests run: 4, Failures: 0, Aborted: 0, Skipped: 0, Time elapsed: 0.616000 sec
[junitlauncher]
[junitlauncher] Running org.apache.poi.hslf.TestPOIDocumentScratchpad
[junitlauncher] Tests run: 4, Failures: 0, Aborted: 0, Skipped: 0, Time elapsed: 0.256000 sec
[junitlauncher]
[junitlauncher] Running org.apache.poi.hslf.TestReWrite
[junitlauncher] Tests run: 5, Failures: 0, Aborted: 0, Skipped: 0, Time elapsed: 0.504000 sec
[junitlauncher]
[junitlauncher] Running org.apache.poi.hslf.TestReWriteSanity
[junitlauncher] Tests run: 1, Failures: 0, Aborted: 0, Skipped: 0, Time elapsed: 0.012000 sec
[junitlauncher]
[junitlauncher] Running org.apache.poi.hslf.TestRecordCounts
[junitlauncher] Tests run: 3, Failures: 0, Aborted: 0, Skipped: 0, Time elapsed: 0.009000 sec
[junitlauncher]
[junitlauncher] Running org.apache.poi.hslf.dev.TestPPDrawingTextListing
[junitlauncher] Tests run: 116, Failures: 0, Aborted: 0, Skipped: 0, Time elapsed: 1.619000 sec
[junitlauncher]
[junitlauncher] Running org.apache.poi.hslf.dev.TestPPTXMLDump

BUILD FAILED
<https://ci-builds.apache.org/job/POI/job/POI-DSL-Github-PullRequests/ws/build.xml>:1610: The following error occurred while executing this line:
<https://ci-builds.apache.org/job/POI/job/POI-DSL-Github-PullRequests/ws/build.xml>:1254: Some test(s) have failure(s)

Total time: 6 minutes 43 seconds
Build step 'Invoke Ant' marked build as failure
[SpotBugs] Skipping execution of recorder since overall result is 'FAILURE'
Archiving artifacts
[Fast Archiver] Compressed 3.09 MB of artifacts by 99.2% relative to #10
Skipping publisher since build result is FAILURE
Recording test results

---------------------------------------------------------------------
To unsubscribe, e-mail: [hidden email]
For additional commands, e-mail: [hidden email]

Reply | Threaded
Open this post in threaded view
|

Jenkins build is back to normal : POI » POI-DSL-Github-PullRequests #14

Apache Jenkins Server
See <https://ci-builds.apache.org/job/POI/job/POI-DSL-Github-PullRequests/14/display/redirect?page=changes>


---------------------------------------------------------------------
To unsubscribe, e-mail: [hidden email]
For additional commands, e-mail: [hidden email]