Build failed in Jenkins: POI » POI-DSL-API-Check #91

classic Classic list List threaded Threaded
26 messages Options
12
Reply | Threaded
Open this post in threaded view
|

Build failed in Jenkins: POI » POI-DSL-API-Check #91

Apache Jenkins Server
See <https://ci-builds.apache.org/job/POI/job/POI-DSL-API-Check/91/display/redirect?page=changes>

Changes:

[Andreas Beeker] Integration tests - try to fix Oracle/OpenJDK vs IBM-JDK error message differences on XXE files

[Andreas Beeker] Update docs to 5.0.0

[Andreas Beeker] Bump versions to 5.0.1-SNAPSHOT

[Andreas Beeker] Sonar fixes
constant name to match the regular expression '^[A-Z][A-Z0-9]*(_[A-Z0-9]+)*$'
reorder "final static" -> "static final"

[Andreas Beeker] integration tests: ignore hsmf/lots-of-recipients.msg because of concurrent test errors - also takes too long to process

[Andreas Beeker] Integration test - fix filenames with windows path separator


------------------------------------------
[...truncated 24.99 KB...]
U         src/documentation/content/xdocs/index.xml
At revision 1885632

At revision 1885632

No changes for https://svn.apache.org/repos/asf/poi/site/forrest.properties since the previous build
[POI-DSL-API-Check] $ /bin/sh -xe /tmp/jenkins3572675478075057247.sh
+ svn status
?       build.javacheck.xml
    X   forrest.properties
X       src/documentation

Performing status on external item at 'src/documentation':
+ echo Java-Home: /home/jenkins/tools/java/latest1.8
Java-Home: /home/jenkins/tools/java/latest1.8
+ ls -al /home/jenkins/tools/java/latest1.8/
total 51232
drwxrwxr-x  9 root root     4096 Jul  2  2020 .
drwxr-xr-x 39 root root     4096 Jan  2 19:14 ..
-r--r--r--  1 root root     1522 Apr  6  2020 ASSEMBLY_EXCEPTION
drwxrwxr-x  2 root root     4096 Jul  2  2020 bin
drwxrwxr-x 10 root root     4096 Jul  2  2020 demo
drwxrwxr-x  3 root root     4096 Jul  2  2020 include
drwxrwxr-x  4 root root     4096 Jul  2  2020 jre
drwxrwxr-x  3 root root     4096 Jul  2  2020 lib
-r--r--r--  1 root root    19274 Apr  6  2020 LICENSE
drwxrwxr-x  4 root root     4096 Jul  2  2020 man
-rw-rw-r--  1 root root      238 Apr  6  2020 release
drwxrwxr-x 10 root root     4096 Jul  2  2020 sample
-rw-rw-r--  1 root root 52236869 Apr  6  2020 src.zip
-r--r--r--  1 root root   153250 Apr  6  2020 THIRD_PARTY_README
+ ls -al /home/jenkins/tools/java/latest1.8/bin
total 748
drwxrwxr-x 2 root root   4096 Jul  2  2020 .
drwxrwxr-x 9 root root   4096 Jul  2  2020 ..
-rwxr-xr-x 1 root root   9065 Apr  6  2020 appletviewer
-rwxr-xr-x 1 root root   9073 Apr  6  2020 clhsdb
-rwxr-xr-x 1 root root   9065 Apr  6  2020 extcheck
-rwxr-xr-x 1 root root   9065 Apr  6  2020 hsdb
-rwxr-xr-x 1 root root   9057 Apr  6  2020 idlj
-rwxr-xr-x 1 root root   9057 Apr  6  2020 jar
-rwxr-xr-x 1 root root   9065 Apr  6  2020 jarsigner
-rwxr-xr-x 1 root root   8930 Apr  6  2020 java
-rwxr-xr-x 1 root root   9057 Apr  6  2020 javac
-rwxr-xr-x 1 root root   9065 Apr  6  2020 javadoc
-rwxr-xr-x 1 root root   9057 Apr  6  2020 javah
-rwxr-xr-x 1 root root   9057 Apr  6  2020 javap
-rwxrwxr-x 1 root root   2806 Apr  6  2020 java-rmi.cgi
-rwxr-xr-x 1 root root   9057 Apr  6  2020 jcmd
-rwxr-xr-x 1 root root   9089 Apr  6  2020 jconsole
-rwxr-xr-x 1 root root   9065 Apr  6  2020 jdb
-rwxr-xr-x 1 root root   9057 Apr  6  2020 jdeps
-rwxr-xr-x 1 root root   9057 Apr  6  2020 jhat
-rwxr-xr-x 1 root root   9097 Apr  6  2020 jinfo
-rwxr-xr-x 1 root root   9057 Apr  6  2020 jjs
-rwxr-xr-x 1 root root   9097 Apr  6  2020 jmap
-rwxr-xr-x 1 root root   9057 Apr  6  2020 jps
-rwxr-xr-x 1 root root   9065 Apr  6  2020 jrunscript
-rwxr-xr-x 1 root root   9073 Apr  6  2020 jsadebugd
-rwxr-xr-x 1 root root   9105 Apr  6  2020 jstack
-rwxr-xr-x 1 root root   9057 Apr  6  2020 jstat
-rwxr-xr-x 1 root root   9065 Apr  6  2020 jstatd
-rwxr-xr-x 1 root root   9065 Apr  6  2020 keytool
-rwxr-xr-x 1 root root   9065 Apr  6  2020 native2ascii
-rwxr-xr-x 1 root root   9105 Apr  6  2020 orbd
-rwxr-xr-x 1 root root   9065 Apr  6  2020 pack200
-rwxr-xr-x 1 root root   9065 Apr  6  2020 policytool
-rwxr-xr-x 1 root root   9057 Apr  6  2020 rmic
-rwxr-xr-x 1 root root   9057 Apr  6  2020 rmid
-rwxr-xr-x 1 root root   9065 Apr  6  2020 rmiregistry
-rwxr-xr-x 1 root root   9065 Apr  6  2020 schemagen
-rwxr-xr-x 1 root root   9065 Apr  6  2020 serialver
-rwxr-xr-x 1 root root   9065 Apr  6  2020 servertool
-rwxr-xr-x 1 root root   9113 Apr  6  2020 tnameserv
-rwxr-xr-x 1 root root 245802 Apr  6  2020 unpack200
-rwxr-xr-x 1 root root   9057 Apr  6  2020 wsgen
-rwxr-xr-x 1 root root   9065 Apr  6  2020 wsimport
-rwxr-xr-x 1 root root   9057 Apr  6  2020 xjc
+ /home/jenkins/tools/java/latest1.8/bin/java -version
openjdk version "1.8.0_252"
OpenJDK Runtime Environment (build 1.8.0_252-b09)
OpenJDK 64-Bit Server VM (build 25.252-b09, mixed mode)
+ echo which java
which java
+ which java
/home/jenkins/tools/java/latest1.8/bin/java
+ java -version
openjdk version "1.8.0_252"
OpenJDK Runtime Environment (build 1.8.0_252-b09)
OpenJDK 64-Bit Server VM (build 25.252-b09, mixed mode)
+ echo which javac
which javac
+ which javac
/home/jenkins/tools/java/latest1.8/bin/javac
+ javac -version
javac 1.8.0_252
+ echo Ant-Home:
Ant-Home:
+ ls -al
total 476
drwxr-xr-x 16 jenkins jenkins   4096 Jan  9 01:12 .
drwxr-xr-x  7 jenkins jenkins   4096 Jan 16 14:24 ..
drwxr-xr-x 30 jenkins jenkins   4096 Nov 12 01:14 build
-rw-r--r--  1 jenkins jenkins  14850 Jan 18 01:12 build.gradle
-rw-r--r--  1 jenkins jenkins    172 Jan 14 01:12 build.javacheck.xml
-rw-r--r--  1 jenkins jenkins 157668 Jan 18 01:12 build.xml
-rw-r--r--  1 jenkins jenkins   3345 Dec 18 01:12 .classpath
-rw-r--r--  1 jenkins jenkins   6325 Jan 18 01:12 doap_POI.rdf
-rw-r--r--  1 jenkins jenkins   2934 Jan  9 01:12 file-leak-detector.exclude
-rw-r--r--  1 jenkins jenkins   6229 Nov 12 01:13 forrest.properties
-rw-r--r--  1 jenkins jenkins     53 Nov 12 01:13 .gitattributes
drwxr-xr-x  3 jenkins jenkins   4096 Dec 21 01:12 .github
-rw-r--r--  1 jenkins jenkins    482 Dec 13 19:13 .gitignore
drwxr-xr-x  3 jenkins jenkins   4096 Nov 12 01:13 gradle
drwxr-xr-x  6 jenkins jenkins   4096 Nov 12 01:14 .gradle
-rwxr-xr-x  1 jenkins jenkins   5917 Nov 12 01:13 gradlew
-rw-r--r--  1 jenkins jenkins   2842 Nov 12 01:13 gradlew.bat
drwxr-xr-x  2 jenkins jenkins   4096 Jan  6 01:15 jenkins
-rw-r--r--  1 jenkins jenkins 167284 Nov 12 01:13 KEYS
drwxr-xr-x  2 jenkins jenkins   4096 Nov 12 01:13 legal
drwxr-xr-x  9 jenkins jenkins   4096 Nov 12 01:14 lib
drwxr-xr-x  2 jenkins jenkins   4096 Jan 14 01:12 maven
drwxr-xr-x  3 jenkins jenkins   4096 Jan 18 01:12 osgi
-rw-r--r--  1 jenkins jenkins   4813 Nov 12 01:13 patch.xml
-rw-r--r--  1 jenkins jenkins    426 Nov 12 01:13 .project
-rw-r--r--  1 jenkins jenkins   4278 Dec 13 19:13 README.rst
drwxr-xr-x  2 jenkins jenkins   4096 Nov 12 01:13 .settings
-rw-r--r--  1 jenkins jenkins    556 Nov 12 01:13 settings.gradle
drwxr-xr-x  9 jenkins jenkins   4096 Jan 14 01:12 sonar
drwxr-xr-x 16 jenkins jenkins   4096 Nov 12 01:14 src
drwxr-xr-x  4 jenkins jenkins   4096 Jan 18 01:12 .svn
drwxr-xr-x 15 jenkins jenkins   4096 Jan  6 01:15 test-data
-rw-r--r--  1 jenkins jenkins    419 Dec  8 01:12 .travis.yml
+ echo which ant
which ant
+ which ant
/usr/bin/ant
+ ant -version
Apache Ant(TM) version 1.10.5 compiled on March 28 2019
+ echo <project default="test"><target name="test"><echo>Java ${ant.java.version}/${java.version}</echo><exec executable="javac"><arg value="-version"/></exec></target></project>
+ ant -f build.javacheck.xml -v
Apache Ant(TM) version 1.10.5 compiled on March 28 2019
Buildfile: <https://ci-builds.apache.org/job/POI/job/POI-DSL-API-Check/ws/build.javacheck.xml>
Detected Java version: 1.8 in: /usr/local/asfpackages/java/openjdk-8u252-b09/jre
Detected OS: Linux
parsing buildfile <https://ci-builds.apache.org/job/POI/job/POI-DSL-API-Check/ws/build.javacheck.xml> with URI = <https://ci-builds.apache.org/job/POI/job/POI-DSL-API-Check/ws/build.javacheck.xml>
Project base dir set to: <https://ci-builds.apache.org/job/POI/job/POI-DSL-API-Check/ws/>
Build sequence for target(s) `test' is [test]
Complete build sequence is [test, ]

test:
parsing buildfile jar:file:/usr/share/ant/lib/ant.jar!/org/apache/tools/ant/antlib.xml with URI = jar:file:/usr/share/ant/lib/ant.jar!/org/apache/tools/ant/antlib.xml from a zip file
     [echo] Java 1.8/1.8.0_252
     [exec] Current OS is Linux
     [exec] Executing 'javac' with arguments:
     [exec] '-version'
     [exec]
     [exec] The ' characters around the executable and arguments are
     [exec] not part of the command.
     [exec] javac 1.8.0_252

BUILD SUCCESSFUL
Total time: 0 seconds
+ exit 0
[Gradle] - Launching build.
[POI-DSL-API-Check] $ <https://ci-builds.apache.org/job/POI/job/POI-DSL-API-Check/ws/gradlew> japicmp
To honour the JVM settings for this build a new JVM will be forked. Please consider using the daemon: https://docs.gradle.org/6.5/userguide/gradle_daemon.html.
Daemon will be stopped at the end of the build stopping after processing

> Configure project :
Trying to override old definition of datatype junit

> Task :main:compileJava
Note: Some input files use or override a deprecated API.
Note: Recompile with -Xlint:deprecation for details.
Note: Some input files use unchecked or unsafe operations.
Note: Recompile with -Xlint:unchecked for details.

> Task :main:processResources UP-TO-DATE
> Task :main:classes
> Task :main:jar
> Task :ooxml:ant-check-jars
> Task :ooxml:ant-fetch-jars
> Task :ooxml:ant-check-ooxml-jars
> Task :ooxml:ant-fetch-ooxml-jars

> Task :ooxml:ant-init
[ant:echo] Using Ant: Apache Ant(TM) version 1.10.7 compiled on September 1 2019 from ${ant.home}, Ant detected Java 1.8 (may be different than actual Java sometimes...)
[ant:echo] Using Java: 1.8.0_252/1.8.0_252-b09/25.252-b09/OpenJDK 64-Bit Server VM from Oracle Corporation on Linux: 4.15.0-58-generic
[ant:echo] Building Apache POI version 5.0.1-SNAPSHOT and RC: RC1

> Task :ooxml:ant-check-compiled-ooxml-xsds

> Task :ooxml:ant-compile-ooxml-xsds
SchemaCompiler  Metadata LOAD:org/apache/xmlbeans/metadata GEN:org/apache/poi/schemas/ooxml
Time to build schema type system: 2.177 seconds
Time to generate code: 5.121 seconds

> Task :scratchpad:compileJava
Note: Some input files use or override a deprecated API.
Note: Recompile with -Xlint:deprecation for details.
Note: Some input files use unchecked or unsafe operations.
Note: Recompile with -Xlint:unchecked for details.

> Task :scratchpad:processResources UP-TO-DATE
> Task :scratchpad:classes
> Task :scratchpad:jar

> Task :ooxml:compileJava
Note: Some input files use or override a deprecated API.
Note: Recompile with -Xlint:deprecation for details.
Note: <https://ci-builds.apache.org/job/POI/job/POI-DSL-API-Check/ws/src/ooxml/java/org/apache/poi/xslf/draw/SVGImageRenderer.java> uses unchecked or unsafe operations.
Note: Recompile with -Xlint:unchecked for details.

> Task :ooxml:processResources UP-TO-DATE
> Task :ooxml:classes
> Task :ooxml:jar
> Task :examples:compileJava
> Task :examples:processResources NO-SOURCE
> Task :examples:classes
> Task :examples:jar
> Task :examples:japicmp SKIPPED
> Task :excelant:compileJava
> Task :excelant:processResources UP-TO-DATE
> Task :excelant:classes
> Task :excelant:jar
> Task :excelant:japicmp FAILED

FAILURE: Build failed with an exception.

* What went wrong:
Execution failed for task ':excelant:japicmp'.
> Failed to load file from jar 'META-INF/versions/9/module-info.class' as class file: invalid constant type: 19 at 3.

* Try:
Run with --stacktrace option to get the stack trace. Run with --info or --debug option to get more log output. Run with --scan to get full insights.

* Get more help at https://help.gradle.org

Deprecated Gradle features were used in this build, making it incompatible with Gradle 7.0.
Use '--warning-mode all' to show the individual deprecation warnings.
See https://docs.gradle.org/6.5/userguide/command_line_interface.html#sec:command_line_warnings

BUILD FAILED in 1m 56s
22 actionable tasks: 18 executed, 4 up-to-date
Build step 'Invoke Gradle script' changed build result to FAILURE
Build step 'Invoke Gradle script' marked build as failure
Archiving artifacts
[Fast Archiver] Compressed 29.34 MB of artifacts by 99.1% relative to #90

---------------------------------------------------------------------
To unsubscribe, e-mail: [hidden email]
For additional commands, e-mail: [hidden email]

Reply | Threaded
Open this post in threaded view
|

Build failed in Jenkins: POI » POI-DSL-API-Check #92

Apache Jenkins Server
See <https://ci-builds.apache.org/job/POI/job/POI-DSL-API-Check/92/display/redirect?page=changes>

Changes:

[Andreas Beeker] fix small typo on main page

[PJ Fanning] add fastexcel lib to related projects

[PJ Fanning] gradle 6.8

[PJ Fanning] gradle 6.8

[PJ Fanning] [github-215] Improve Performance of OperandResolver#parseDouble. Thanks to Robert Wenzel. This closes #215


------------------------------------------
[...truncated 1.50 KB...]
Fetching 'https://svn.apache.org/repos/asf/poi/site/src/documentation' at -1 into '<https://ci-builds.apache.org/job/POI/job/POI-DSL-API-Check/ws/src/documentation'>
U         src/documentation/content/xdocs/index.xml
U         src/documentation/content/xdocs/related-projects.xml
At revision 1885681

At revision 1885681

No changes for https://svn.apache.org/repos/asf/poi/site/forrest.properties since the previous build
[POI-DSL-API-Check] $ /bin/sh -xe /tmp/jenkins8704533927228037608.sh
+ svn status
?       build.javacheck.xml
    X   forrest.properties
X       src/documentation

Performing status on external item at 'src/documentation':
+ echo Java-Home: /home/jenkins/tools/java/latest1.8
Java-Home: /home/jenkins/tools/java/latest1.8
+ ls -al /home/jenkins/tools/java/latest1.8/
total 51232
drwxrwxr-x  9 root root     4096 Jul  2  2020 .
drwxr-xr-x 39 root root     4096 Jan  2 19:14 ..
-r--r--r--  1 root root     1522 Apr  6  2020 ASSEMBLY_EXCEPTION
drwxrwxr-x  2 root root     4096 Jul  2  2020 bin
drwxrwxr-x 10 root root     4096 Jul  2  2020 demo
drwxrwxr-x  3 root root     4096 Jul  2  2020 include
drwxrwxr-x  4 root root     4096 Jul  2  2020 jre
drwxrwxr-x  3 root root     4096 Jul  2  2020 lib
-r--r--r--  1 root root    19274 Apr  6  2020 LICENSE
drwxrwxr-x  4 root root     4096 Jul  2  2020 man
-rw-rw-r--  1 root root      238 Apr  6  2020 release
drwxrwxr-x 10 root root     4096 Jul  2  2020 sample
-rw-rw-r--  1 root root 52236869 Apr  6  2020 src.zip
-r--r--r--  1 root root   153250 Apr  6  2020 THIRD_PARTY_README
+ ls -al /home/jenkins/tools/java/latest1.8/bin
total 748
drwxrwxr-x 2 root root   4096 Jul  2  2020 .
drwxrwxr-x 9 root root   4096 Jul  2  2020 ..
-rwxr-xr-x 1 root root   9065 Apr  6  2020 appletviewer
-rwxr-xr-x 1 root root   9073 Apr  6  2020 clhsdb
-rwxr-xr-x 1 root root   9065 Apr  6  2020 extcheck
-rwxr-xr-x 1 root root   9065 Apr  6  2020 hsdb
-rwxr-xr-x 1 root root   9057 Apr  6  2020 idlj
-rwxr-xr-x 1 root root   9057 Apr  6  2020 jar
-rwxr-xr-x 1 root root   9065 Apr  6  2020 jarsigner
-rwxr-xr-x 1 root root   8930 Apr  6  2020 java
-rwxr-xr-x 1 root root   9057 Apr  6  2020 javac
-rwxr-xr-x 1 root root   9065 Apr  6  2020 javadoc
-rwxr-xr-x 1 root root   9057 Apr  6  2020 javah
-rwxr-xr-x 1 root root   9057 Apr  6  2020 javap
-rwxrwxr-x 1 root root   2806 Apr  6  2020 java-rmi.cgi
-rwxr-xr-x 1 root root   9057 Apr  6  2020 jcmd
-rwxr-xr-x 1 root root   9089 Apr  6  2020 jconsole
-rwxr-xr-x 1 root root   9065 Apr  6  2020 jdb
-rwxr-xr-x 1 root root   9057 Apr  6  2020 jdeps
-rwxr-xr-x 1 root root   9057 Apr  6  2020 jhat
-rwxr-xr-x 1 root root   9097 Apr  6  2020 jinfo
-rwxr-xr-x 1 root root   9057 Apr  6  2020 jjs
-rwxr-xr-x 1 root root   9097 Apr  6  2020 jmap
-rwxr-xr-x 1 root root   9057 Apr  6  2020 jps
-rwxr-xr-x 1 root root   9065 Apr  6  2020 jrunscript
-rwxr-xr-x 1 root root   9073 Apr  6  2020 jsadebugd
-rwxr-xr-x 1 root root   9105 Apr  6  2020 jstack
-rwxr-xr-x 1 root root   9057 Apr  6  2020 jstat
-rwxr-xr-x 1 root root   9065 Apr  6  2020 jstatd
-rwxr-xr-x 1 root root   9065 Apr  6  2020 keytool
-rwxr-xr-x 1 root root   9065 Apr  6  2020 native2ascii
-rwxr-xr-x 1 root root   9105 Apr  6  2020 orbd
-rwxr-xr-x 1 root root   9065 Apr  6  2020 pack200
-rwxr-xr-x 1 root root   9065 Apr  6  2020 policytool
-rwxr-xr-x 1 root root   9057 Apr  6  2020 rmic
-rwxr-xr-x 1 root root   9057 Apr  6  2020 rmid
-rwxr-xr-x 1 root root   9065 Apr  6  2020 rmiregistry
-rwxr-xr-x 1 root root   9065 Apr  6  2020 schemagen
-rwxr-xr-x 1 root root   9065 Apr  6  2020 serialver
-rwxr-xr-x 1 root root   9065 Apr  6  2020 servertool
-rwxr-xr-x 1 root root   9113 Apr  6  2020 tnameserv
-rwxr-xr-x 1 root root 245802 Apr  6  2020 unpack200
-rwxr-xr-x 1 root root   9057 Apr  6  2020 wsgen
-rwxr-xr-x 1 root root   9065 Apr  6  2020 wsimport
-rwxr-xr-x 1 root root   9057 Apr  6  2020 xjc
+ /home/jenkins/tools/java/latest1.8/bin/java -version
openjdk version "1.8.0_252"
OpenJDK Runtime Environment (build 1.8.0_252-b09)
OpenJDK 64-Bit Server VM (build 25.252-b09, mixed mode)
+ echo which java
which java
+ which java
/home/jenkins/tools/java/latest1.8/bin/java
+ java -version
openjdk version "1.8.0_252"
OpenJDK Runtime Environment (build 1.8.0_252-b09)
OpenJDK 64-Bit Server VM (build 25.252-b09, mixed mode)
+ echo which javac
which javac
+ which javac
/home/jenkins/tools/java/latest1.8/bin/javac
+ javac -version
javac 1.8.0_252
+ echo Ant-Home:
Ant-Home:
+ ls -al
total 476
drwxr-xr-x 16 jenkins jenkins   4096 Jan 19 01:12 .
drwxr-xr-x  8 jenkins jenkins   4096 Jan 18 20:41 ..
drwxr-xr-x 30 jenkins jenkins   4096 Nov 12 01:14 build
-rw-r--r--  1 jenkins jenkins  14850 Jan 19 01:12 build.gradle
-rw-r--r--  1 jenkins jenkins    172 Jan 18 01:12 build.javacheck.xml
-rw-r--r--  1 jenkins jenkins 157668 Jan 18 01:12 build.xml
-rw-r--r--  1 jenkins jenkins   3345 Dec 18 01:12 .classpath
-rw-r--r--  1 jenkins jenkins   6325 Jan 18 01:12 doap_POI.rdf
-rw-r--r--  1 jenkins jenkins   2934 Jan  9 01:12 file-leak-detector.exclude
-rw-r--r--  1 jenkins jenkins   6229 Nov 12 01:13 forrest.properties
-rw-r--r--  1 jenkins jenkins     53 Nov 12 01:13 .gitattributes
drwxr-xr-x  3 jenkins jenkins   4096 Dec 21 01:12 .github
-rw-r--r--  1 jenkins jenkins    482 Dec 13 19:13 .gitignore
drwxr-xr-x  3 jenkins jenkins   4096 Nov 12 01:13 gradle
drwxr-xr-x  6 jenkins jenkins   4096 Nov 12 01:14 .gradle
-rwxr-xr-x  1 jenkins jenkins   5770 Jan 19 01:12 gradlew
-rw-r--r--  1 jenkins jenkins   3058 Jan 19 01:12 gradlew.bat
drwxr-xr-x  2 jenkins jenkins   4096 Jan  6 01:15 jenkins
-rw-r--r--  1 jenkins jenkins 167284 Nov 12 01:13 KEYS
drwxr-xr-x  2 jenkins jenkins   4096 Nov 12 01:13 legal
drwxr-xr-x  9 jenkins jenkins   4096 Nov 12 01:14 lib
drwxr-xr-x  2 jenkins jenkins   4096 Jan 14 01:12 maven
drwxr-xr-x  3 jenkins jenkins   4096 Jan 18 01:12 osgi
-rw-r--r--  1 jenkins jenkins   4813 Nov 12 01:13 patch.xml
-rw-r--r--  1 jenkins jenkins    426 Nov 12 01:13 .project
-rw-r--r--  1 jenkins jenkins   4278 Dec 13 19:13 README.rst
drwxr-xr-x  2 jenkins jenkins   4096 Nov 12 01:13 .settings
-rw-r--r--  1 jenkins jenkins    556 Nov 12 01:13 settings.gradle
drwxr-xr-x  9 jenkins jenkins   4096 Jan 14 01:12 sonar
drwxr-xr-x 16 jenkins jenkins   4096 Nov 12 01:14 src
drwxr-xr-x  4 jenkins jenkins   4096 Jan 19 01:12 .svn
drwxr-xr-x 15 jenkins jenkins   4096 Jan  6 01:15 test-data
-rw-r--r--  1 jenkins jenkins    419 Dec  8 01:12 .travis.yml
+ echo which ant
which ant
+ which ant
/usr/bin/ant
+ ant -version
Apache Ant(TM) version 1.10.5 compiled on March 28 2019
+ echo <project default="test"><target name="test"><echo>Java ${ant.java.version}/${java.version}</echo><exec executable="javac"><arg value="-version"/></exec></target></project>
+ ant -f build.javacheck.xml -v
Apache Ant(TM) version 1.10.5 compiled on March 28 2019
Buildfile: <https://ci-builds.apache.org/job/POI/job/POI-DSL-API-Check/ws/build.javacheck.xml>
Detected Java version: 1.8 in: /usr/local/asfpackages/java/openjdk-8u252-b09/jre
Detected OS: Linux
parsing buildfile <https://ci-builds.apache.org/job/POI/job/POI-DSL-API-Check/ws/build.javacheck.xml> with URI = <https://ci-builds.apache.org/job/POI/job/POI-DSL-API-Check/ws/build.javacheck.xml>
Project base dir set to: <https://ci-builds.apache.org/job/POI/job/POI-DSL-API-Check/ws/>
Build sequence for target(s) `test' is [test]
Complete build sequence is [test, ]

test:
parsing buildfile jar:file:/usr/share/ant/lib/ant.jar!/org/apache/tools/ant/antlib.xml with URI = jar:file:/usr/share/ant/lib/ant.jar!/org/apache/tools/ant/antlib.xml from a zip file
     [echo] Java 1.8/1.8.0_252
     [exec] Current OS is Linux
     [exec] Executing 'javac' with arguments:
     [exec] '-version'
     [exec]
     [exec] The ' characters around the executable and arguments are
     [exec] not part of the command.
     [exec] javac 1.8.0_252

BUILD SUCCESSFUL
Total time: 0 seconds
+ exit 0
[Gradle] - Launching build.
[POI-DSL-API-Check] $ <https://ci-builds.apache.org/job/POI/job/POI-DSL-API-Check/ws/gradlew> japicmp
Downloading https://services.gradle.org/distributions/gradle-6.8-bin.zip
..........10%..........20%..........30%...........40%..........50%..........60%..........70%...........80%..........90%..........100%
To honour the JVM settings for this build a single-use Daemon process will be forked. See https://docs.gradle.org/6.8/userguide/gradle_daemon.html#sec:disabling_the_daemon.
Daemon will be stopped at the end of the build

> Configure project :
Trying to override old definition of datatype junit

> Task :main:compileJava
Note: Some input files use or override a deprecated API.
Note: Recompile with -Xlint:deprecation for details.
Note: Some input files use unchecked or unsafe operations.
Note: Recompile with -Xlint:unchecked for details.

> Task :main:processResources
> Task :main:classes
> Task :main:jar
> Task :ooxml:ant-check-jars
> Task :ooxml:ant-fetch-jars
> Task :ooxml:ant-check-ooxml-jars
> Task :ooxml:ant-fetch-ooxml-jars

> Task :ooxml:ant-init
[ant:echo] Using Ant: Apache Ant(TM) version 1.10.9 compiled on September 27 2020 from ${ant.home}, Ant detected Java 1.8 (may be different than actual Java sometimes...)
[ant:echo] Using Java: 1.8.0_252/1.8.0_252-b09/25.252-b09/OpenJDK 64-Bit Server VM from Oracle Corporation on Linux: 4.15.0-58-generic
[ant:echo] Building Apache POI version 5.0.1-SNAPSHOT and RC: RC1

> Task :ooxml:ant-check-compiled-ooxml-xsds
> Task :ooxml:ant-compile-ooxml-xsds

> Task :scratchpad:compileJava
Note: Some input files use or override a deprecated API.
Note: Recompile with -Xlint:deprecation for details.
Note: Some input files use unchecked or unsafe operations.
Note: Recompile with -Xlint:unchecked for details.

> Task :scratchpad:processResources
> Task :scratchpad:classes
> Task :scratchpad:jar

> Task :ooxml:compileJava
Note: Some input files use or override a deprecated API.
Note: Recompile with -Xlint:deprecation for details.
Note: <https://ci-builds.apache.org/job/POI/job/POI-DSL-API-Check/ws/src/ooxml/java/org/apache/poi/xslf/draw/SVGImageRenderer.java> uses unchecked or unsafe operations.
Note: Recompile with -Xlint:unchecked for details.

> Task :ooxml:processResources
> Task :ooxml:classes
> Task :ooxml:jar
> Task :examples:compileJava
> Task :examples:processResources NO-SOURCE
> Task :examples:classes
> Task :examples:jar
> Task :examples:japicmp SKIPPED
> Task :excelant:compileJava
> Task :excelant:processResources
> Task :excelant:classes
> Task :excelant:jar
> Task :excelant:japicmp FAILED

FAILURE: Build failed with an exception.

* What went wrong:
Execution failed for task ':excelant:japicmp'.
> Failed to load file from jar 'META-INF/versions/9/module-info.class' as class file: invalid constant type: 19 at 3.

* Try:
Run with --stacktrace option to get the stack trace. Run with --info or --debug option to get more log output. Run with --scan to get full insights.

* Get more help at https://help.gradle.org

Deprecated Gradle features were used in this build, making it incompatible with Gradle 7.0.
Use '--warning-mode all' to show the individual deprecation warnings.
See https://docs.gradle.org/6.8/userguide/command_line_interface.html#sec:command_line_warnings

BUILD FAILED in 1m 0s
22 actionable tasks: 22 executed
Build step 'Invoke Gradle script' changed build result to FAILURE
Build step 'Invoke Gradle script' marked build as failure
Archiving artifacts
[Fast Archiver] Compressed 29.34 MB of artifacts by 99.2% relative to #90

---------------------------------------------------------------------
To unsubscribe, e-mail: [hidden email]
For additional commands, e-mail: [hidden email]

Reply | Threaded
Open this post in threaded view
|

Build failed in Jenkins: POI » POI-DSL-API-Check #93

Apache Jenkins Server
See <https://ci-builds.apache.org/job/POI/job/POI-DSL-API-Check/93/display/redirect?page=changes>

Changes:

[Andreas Beeker] typo

[Andreas Beeker] apply @announce comments

[Andreas Beeker] limit junit concurrent threads to 3 (fixed amount)

[Alain Béarez] Bug 65016 - Creating a chart throws exception

[Andreas Beeker] github-211 - Revert addRow to behaviour before 4.1.2


------------------------------------------
[...truncated 1.08 KB...]
U         src/ooxml/testcases/org/apache/poi/xddf/usermodel/chart/TestXDDFChart.java
U         src/ooxml/testcases/org/apache/poi/xslf/usermodel/TestXSLFTable.java
A         test-data/spreadsheet/65016.xlsx

<-- Got one external: forrest.properties, svn url: https://svn.apache.org/repos/asf/poi/site/forrest.properties -->
Fetching 'https://svn.apache.org/repos/asf/poi/site/forrest.properties' at -1 into '<https://ci-builds.apache.org/job/POI/job/POI-DSL-API-Check/ws/forrest.properties'>
At revision 1885709


<-- Got one external: documentation, svn url: https://svn.apache.org/repos/asf/poi/site/src/documentation -->
Fetching 'https://svn.apache.org/repos/asf/poi/site/src/documentation' at -1 into '<https://ci-builds.apache.org/job/POI/job/POI-DSL-API-Check/ws/src/documentation'>
U         src/documentation/skinconf.xml
AU        src/documentation/content/xdocs/devel/nightly.xml
U         src/documentation/content/xdocs/download.xml
U         src/documentation/content/xdocs/site.xml
U         src/documentation/content/xdocs/changes.xml
At revision 1885709

At revision 1885709

No changes for https://svn.apache.org/repos/asf/poi/site/forrest.properties since the previous build
[POI-DSL-API-Check] $ /bin/sh -xe /tmp/jenkins3834172561463423633.sh
+ svn status
?       build.javacheck.xml
    X   forrest.properties
X       src/documentation

Performing status on external item at 'src/documentation':
+ echo Java-Home: /home/jenkins/tools/java/latest1.8
Java-Home: /home/jenkins/tools/java/latest1.8
+ ls -al /home/jenkins/tools/java/latest1.8/
total 51232
drwxrwxr-x  9 root root     4096 Jul  2  2020 .
drwxr-xr-x 39 root root     4096 Jan  2 19:14 ..
-r--r--r--  1 root root     1522 Apr  6  2020 ASSEMBLY_EXCEPTION
drwxrwxr-x  2 root root     4096 Jul  2  2020 bin
drwxrwxr-x 10 root root     4096 Jul  2  2020 demo
drwxrwxr-x  3 root root     4096 Jul  2  2020 include
drwxrwxr-x  4 root root     4096 Jul  2  2020 jre
drwxrwxr-x  3 root root     4096 Jul  2  2020 lib
-r--r--r--  1 root root    19274 Apr  6  2020 LICENSE
drwxrwxr-x  4 root root     4096 Jul  2  2020 man
-rw-rw-r--  1 root root      238 Apr  6  2020 release
drwxrwxr-x 10 root root     4096 Jul  2  2020 sample
-rw-rw-r--  1 root root 52236869 Apr  6  2020 src.zip
-r--r--r--  1 root root   153250 Apr  6  2020 THIRD_PARTY_README
+ ls -al /home/jenkins/tools/java/latest1.8/bin
total 748
drwxrwxr-x 2 root root   4096 Jul  2  2020 .
drwxrwxr-x 9 root root   4096 Jul  2  2020 ..
-rwxr-xr-x 1 root root   9065 Apr  6  2020 appletviewer
-rwxr-xr-x 1 root root   9073 Apr  6  2020 clhsdb
-rwxr-xr-x 1 root root   9065 Apr  6  2020 extcheck
-rwxr-xr-x 1 root root   9065 Apr  6  2020 hsdb
-rwxr-xr-x 1 root root   9057 Apr  6  2020 idlj
-rwxr-xr-x 1 root root   9057 Apr  6  2020 jar
-rwxr-xr-x 1 root root   9065 Apr  6  2020 jarsigner
-rwxr-xr-x 1 root root   8930 Apr  6  2020 java
-rwxr-xr-x 1 root root   9057 Apr  6  2020 javac
-rwxr-xr-x 1 root root   9065 Apr  6  2020 javadoc
-rwxr-xr-x 1 root root   9057 Apr  6  2020 javah
-rwxr-xr-x 1 root root   9057 Apr  6  2020 javap
-rwxrwxr-x 1 root root   2806 Apr  6  2020 java-rmi.cgi
-rwxr-xr-x 1 root root   9057 Apr  6  2020 jcmd
-rwxr-xr-x 1 root root   9089 Apr  6  2020 jconsole
-rwxr-xr-x 1 root root   9065 Apr  6  2020 jdb
-rwxr-xr-x 1 root root   9057 Apr  6  2020 jdeps
-rwxr-xr-x 1 root root   9057 Apr  6  2020 jhat
-rwxr-xr-x 1 root root   9097 Apr  6  2020 jinfo
-rwxr-xr-x 1 root root   9057 Apr  6  2020 jjs
-rwxr-xr-x 1 root root   9097 Apr  6  2020 jmap
-rwxr-xr-x 1 root root   9057 Apr  6  2020 jps
-rwxr-xr-x 1 root root   9065 Apr  6  2020 jrunscript
-rwxr-xr-x 1 root root   9073 Apr  6  2020 jsadebugd
-rwxr-xr-x 1 root root   9105 Apr  6  2020 jstack
-rwxr-xr-x 1 root root   9057 Apr  6  2020 jstat
-rwxr-xr-x 1 root root   9065 Apr  6  2020 jstatd
-rwxr-xr-x 1 root root   9065 Apr  6  2020 keytool
-rwxr-xr-x 1 root root   9065 Apr  6  2020 native2ascii
-rwxr-xr-x 1 root root   9105 Apr  6  2020 orbd
-rwxr-xr-x 1 root root   9065 Apr  6  2020 pack200
-rwxr-xr-x 1 root root   9065 Apr  6  2020 policytool
-rwxr-xr-x 1 root root   9057 Apr  6  2020 rmic
-rwxr-xr-x 1 root root   9057 Apr  6  2020 rmid
-rwxr-xr-x 1 root root   9065 Apr  6  2020 rmiregistry
-rwxr-xr-x 1 root root   9065 Apr  6  2020 schemagen
-rwxr-xr-x 1 root root   9065 Apr  6  2020 serialver
-rwxr-xr-x 1 root root   9065 Apr  6  2020 servertool
-rwxr-xr-x 1 root root   9113 Apr  6  2020 tnameserv
-rwxr-xr-x 1 root root 245802 Apr  6  2020 unpack200
-rwxr-xr-x 1 root root   9057 Apr  6  2020 wsgen
-rwxr-xr-x 1 root root   9065 Apr  6  2020 wsimport
-rwxr-xr-x 1 root root   9057 Apr  6  2020 xjc
+ /home/jenkins/tools/java/latest1.8/bin/java -version
openjdk version "1.8.0_252"
OpenJDK Runtime Environment (build 1.8.0_252-b09)
OpenJDK 64-Bit Server VM (build 25.252-b09, mixed mode)
+ echo which java
which java
+ which java
/home/jenkins/tools/java/latest1.8/bin/java
+ java -version
openjdk version "1.8.0_252"
OpenJDK Runtime Environment (build 1.8.0_252-b09)
OpenJDK 64-Bit Server VM (build 25.252-b09, mixed mode)
+ echo which javac
which javac
+ which javac
/home/jenkins/tools/java/latest1.8/bin/javac
+ javac -version
javac 1.8.0_252
+ echo Ant-Home:
Ant-Home:
+ ls -al
total 476
drwxr-xr-x 16 jenkins jenkins   4096 Jan 19 01:12 .
drwxr-xr-x  8 jenkins jenkins   4096 Jan 18 20:41 ..
drwxr-xr-x 30 jenkins jenkins   4096 Nov 12 01:14 build
-rw-r--r--  1 jenkins jenkins  14850 Jan 19 01:12 build.gradle
-rw-r--r--  1 jenkins jenkins    172 Jan 19 01:12 build.javacheck.xml
-rw-r--r--  1 jenkins jenkins 157873 Jan 20 01:12 build.xml
-rw-r--r--  1 jenkins jenkins   3345 Dec 18 01:12 .classpath
-rw-r--r--  1 jenkins jenkins   6325 Jan 18 01:12 doap_POI.rdf
-rw-r--r--  1 jenkins jenkins   2934 Jan  9 01:12 file-leak-detector.exclude
-rw-r--r--  1 jenkins jenkins   6229 Nov 12 01:13 forrest.properties
-rw-r--r--  1 jenkins jenkins     53 Nov 12 01:13 .gitattributes
drwxr-xr-x  3 jenkins jenkins   4096 Dec 21 01:12 .github
-rw-r--r--  1 jenkins jenkins    482 Dec 13 19:13 .gitignore
drwxr-xr-x  3 jenkins jenkins   4096 Nov 12 01:13 gradle
drwxr-xr-x  8 jenkins jenkins   4096 Jan 19 01:13 .gradle
-rwxr-xr-x  1 jenkins jenkins   5770 Jan 19 01:12 gradlew
-rw-r--r--  1 jenkins jenkins   3058 Jan 19 01:12 gradlew.bat
drwxr-xr-x  2 jenkins jenkins   4096 Jan  6 01:15 jenkins
-rw-r--r--  1 jenkins jenkins 167284 Nov 12 01:13 KEYS
drwxr-xr-x  2 jenkins jenkins   4096 Nov 12 01:13 legal
drwxr-xr-x  9 jenkins jenkins   4096 Nov 12 01:14 lib
drwxr-xr-x  2 jenkins jenkins   4096 Jan 14 01:12 maven
drwxr-xr-x  3 jenkins jenkins   4096 Jan 18 01:12 osgi
-rw-r--r--  1 jenkins jenkins   4813 Nov 12 01:13 patch.xml
-rw-r--r--  1 jenkins jenkins    426 Nov 12 01:13 .project
-rw-r--r--  1 jenkins jenkins   4278 Dec 13 19:13 README.rst
drwxr-xr-x  2 jenkins jenkins   4096 Nov 12 01:13 .settings
-rw-r--r--  1 jenkins jenkins    556 Nov 12 01:13 settings.gradle
drwxr-xr-x  9 jenkins jenkins   4096 Jan 14 01:12 sonar
drwxr-xr-x 16 jenkins jenkins   4096 Nov 12 01:14 src
drwxr-xr-x  4 jenkins jenkins   4096 Jan 20 01:12 .svn
drwxr-xr-x 15 jenkins jenkins   4096 Jan  6 01:15 test-data
-rw-r--r--  1 jenkins jenkins    419 Dec  8 01:12 .travis.yml
+ echo which ant
which ant
+ which ant
/usr/bin/ant
+ ant -version
Apache Ant(TM) version 1.10.5 compiled on March 28 2019
+ echo <project default="test"><target name="test"><echo>Java ${ant.java.version}/${java.version}</echo><exec executable="javac"><arg value="-version"/></exec></target></project>
+ ant -f build.javacheck.xml -v
Apache Ant(TM) version 1.10.5 compiled on March 28 2019
Buildfile: <https://ci-builds.apache.org/job/POI/job/POI-DSL-API-Check/ws/build.javacheck.xml>
Detected Java version: 1.8 in: /usr/local/asfpackages/java/openjdk-8u252-b09/jre
Detected OS: Linux
parsing buildfile <https://ci-builds.apache.org/job/POI/job/POI-DSL-API-Check/ws/build.javacheck.xml> with URI = <https://ci-builds.apache.org/job/POI/job/POI-DSL-API-Check/ws/build.javacheck.xml>
Project base dir set to: <https://ci-builds.apache.org/job/POI/job/POI-DSL-API-Check/ws/>
Build sequence for target(s) `test' is [test]
Complete build sequence is [test, ]

test:
parsing buildfile jar:file:/usr/share/ant/lib/ant.jar!/org/apache/tools/ant/antlib.xml with URI = jar:file:/usr/share/ant/lib/ant.jar!/org/apache/tools/ant/antlib.xml from a zip file
     [echo] Java 1.8/1.8.0_252
     [exec] Current OS is Linux
     [exec] Executing 'javac' with arguments:
     [exec] '-version'
     [exec]
     [exec] The ' characters around the executable and arguments are
     [exec] not part of the command.
     [exec] javac 1.8.0_252

BUILD SUCCESSFUL
Total time: 0 seconds
+ exit 0
[Gradle] - Launching build.
[POI-DSL-API-Check] $ <https://ci-builds.apache.org/job/POI/job/POI-DSL-API-Check/ws/gradlew> japicmp
To honour the JVM settings for this build a single-use Daemon process will be forked. See https://docs.gradle.org/6.8/userguide/gradle_daemon.html#sec:disabling_the_daemon.
Daemon will be stopped at the end of the build

> Configure project :
Trying to override old definition of datatype junit

> Task :main:compileJava UP-TO-DATE
> Task :main:processResources UP-TO-DATE
> Task :main:classes UP-TO-DATE
> Task :main:jar UP-TO-DATE
> Task :ooxml:ant-check-jars
> Task :ooxml:ant-fetch-jars
> Task :ooxml:ant-check-ooxml-jars
> Task :ooxml:ant-fetch-ooxml-jars

> Task :ooxml:ant-init
[ant:echo] Using Ant: Apache Ant(TM) version 1.10.9 compiled on September 27 2020 from ${ant.home}, Ant detected Java 1.8 (may be different than actual Java sometimes...)
[ant:echo] Using Java: 1.8.0_252/1.8.0_252-b09/25.252-b09/OpenJDK 64-Bit Server VM from Oracle Corporation on Linux: 4.15.0-58-generic
[ant:echo] Building Apache POI version 5.0.1-SNAPSHOT and RC: RC1

> Task :ooxml:ant-check-compiled-ooxml-xsds
> Task :ooxml:ant-compile-ooxml-xsds
> Task :scratchpad:compileJava UP-TO-DATE
> Task :scratchpad:processResources UP-TO-DATE
> Task :scratchpad:classes UP-TO-DATE
> Task :scratchpad:jar UP-TO-DATE

> Task :ooxml:compileJava
Note: Some input files use or override a deprecated API.
Note: Recompile with -Xlint:deprecation for details.
Note: <https://ci-builds.apache.org/job/POI/job/POI-DSL-API-Check/ws/src/ooxml/java/org/apache/poi/xslf/draw/SVGImageRenderer.java> uses unchecked or unsafe operations.
Note: Recompile with -Xlint:unchecked for details.

> Task :ooxml:processResources UP-TO-DATE
> Task :ooxml:classes
> Task :ooxml:jar
> Task :examples:compileJava UP-TO-DATE
> Task :examples:processResources NO-SOURCE
> Task :examples:classes UP-TO-DATE
> Task :examples:jar UP-TO-DATE
> Task :examples:japicmp SKIPPED
> Task :excelant:compileJava UP-TO-DATE
> Task :excelant:processResources UP-TO-DATE
> Task :excelant:classes UP-TO-DATE
> Task :excelant:jar UP-TO-DATE
> Task :excelant:japicmp FAILED

FAILURE: Build failed with an exception.

* What went wrong:
Execution failed for task ':excelant:japicmp'.
> Failed to load file from jar 'META-INF/versions/9/module-info.class' as class file: invalid constant type: 19 at 3.

* Try:
Run with --stacktrace option to get the stack trace. Run with --info or --debug option to get more log output. Run with --scan to get full insights.

* Get more help at https://help.gradle.org

Deprecated Gradle features were used in this build, making it incompatible with Gradle 7.0.
Use '--warning-mode all' to show the individual deprecation warnings.
See https://docs.gradle.org/6.8/userguide/command_line_interface.html#sec:command_line_warnings

BUILD FAILED in 23s
22 actionable tasks: 10 executed, 12 up-to-date
Build step 'Invoke Gradle script' changed build result to FAILURE
Build step 'Invoke Gradle script' marked build as failure
Archiving artifacts
[Fast Archiver] Compressed 29.34 MB of artifacts by 99.2% relative to #90

---------------------------------------------------------------------
To unsubscribe, e-mail: [hidden email]
For additional commands, e-mail: [hidden email]

Reply | Threaded
Open this post in threaded view
|

Build failed in Jenkins: POI » POI-DSL-API-Check #94

Apache Jenkins Server
See <https://ci-builds.apache.org/job/POI/job/POI-DSL-API-Check/94/display/redirect?page=changes>

Changes:

[PJ Fanning] missing license

[Alain Béarez] Bug 64950: handle doughnut hole size

[PJ Fanning] [bug-65096] XLSX Streaming XML not correctly reading multiple inline Strings


------------------------------------------
[...truncated 23.80 KB...]
At revision 1885772

No changes for https://svn.apache.org/repos/asf/poi/site/forrest.properties since the previous build
No changes for https://svn.apache.org/repos/asf/poi/site/src/documentation since the previous build
[POI-DSL-API-Check] $ /bin/sh -xe /tmp/jenkins8883076474607988252.sh
+ svn status
?       build.javacheck.xml
    X   forrest.properties
X       src/documentation

Performing status on external item at 'src/documentation':
+ echo Java-Home: /home/jenkins/tools/java/latest1.8
Java-Home: /home/jenkins/tools/java/latest1.8
+ ls -al /home/jenkins/tools/java/latest1.8/
total 51232
drwxrwxr-x  9 root root     4096 Jul  2  2020 .
drwxr-xr-x 39 root root     4096 Jan  2 19:03 ..
-r--r--r--  1 root root     1522 Apr  6  2020 ASSEMBLY_EXCEPTION
drwxrwxr-x  2 root root     4096 Jul  2  2020 bin
drwxrwxr-x 10 root root     4096 Jul  2  2020 demo
drwxrwxr-x  3 root root     4096 Jul  2  2020 include
drwxrwxr-x  4 root root     4096 Jul  2  2020 jre
drwxrwxr-x  3 root root     4096 Jul  2  2020 lib
-r--r--r--  1 root root    19274 Apr  6  2020 LICENSE
drwxrwxr-x  4 root root     4096 Jul  2  2020 man
-rw-rw-r--  1 root root      238 Apr  6  2020 release
drwxrwxr-x 10 root root     4096 Jul  2  2020 sample
-rw-rw-r--  1 root root 52236869 Apr  6  2020 src.zip
-r--r--r--  1 root root   153250 Apr  6  2020 THIRD_PARTY_README
+ ls -al /home/jenkins/tools/java/latest1.8/bin
total 748
drwxrwxr-x 2 root root   4096 Jul  2  2020 .
drwxrwxr-x 9 root root   4096 Jul  2  2020 ..
-rwxr-xr-x 1 root root   9065 Apr  6  2020 appletviewer
-rwxr-xr-x 1 root root   9073 Apr  6  2020 clhsdb
-rwxr-xr-x 1 root root   9065 Apr  6  2020 extcheck
-rwxr-xr-x 1 root root   9065 Apr  6  2020 hsdb
-rwxr-xr-x 1 root root   9057 Apr  6  2020 idlj
-rwxr-xr-x 1 root root   9057 Apr  6  2020 jar
-rwxr-xr-x 1 root root   9065 Apr  6  2020 jarsigner
-rwxr-xr-x 1 root root   8930 Apr  6  2020 java
-rwxr-xr-x 1 root root   9057 Apr  6  2020 javac
-rwxr-xr-x 1 root root   9065 Apr  6  2020 javadoc
-rwxr-xr-x 1 root root   9057 Apr  6  2020 javah
-rwxr-xr-x 1 root root   9057 Apr  6  2020 javap
-rwxrwxr-x 1 root root   2806 Apr  6  2020 java-rmi.cgi
-rwxr-xr-x 1 root root   9057 Apr  6  2020 jcmd
-rwxr-xr-x 1 root root   9089 Apr  6  2020 jconsole
-rwxr-xr-x 1 root root   9065 Apr  6  2020 jdb
-rwxr-xr-x 1 root root   9057 Apr  6  2020 jdeps
-rwxr-xr-x 1 root root   9057 Apr  6  2020 jhat
-rwxr-xr-x 1 root root   9097 Apr  6  2020 jinfo
-rwxr-xr-x 1 root root   9057 Apr  6  2020 jjs
-rwxr-xr-x 1 root root   9097 Apr  6  2020 jmap
-rwxr-xr-x 1 root root   9057 Apr  6  2020 jps
-rwxr-xr-x 1 root root   9065 Apr  6  2020 jrunscript
-rwxr-xr-x 1 root root   9073 Apr  6  2020 jsadebugd
-rwxr-xr-x 1 root root   9105 Apr  6  2020 jstack
-rwxr-xr-x 1 root root   9057 Apr  6  2020 jstat
-rwxr-xr-x 1 root root   9065 Apr  6  2020 jstatd
-rwxr-xr-x 1 root root   9065 Apr  6  2020 keytool
-rwxr-xr-x 1 root root   9065 Apr  6  2020 native2ascii
-rwxr-xr-x 1 root root   9105 Apr  6  2020 orbd
-rwxr-xr-x 1 root root   9065 Apr  6  2020 pack200
-rwxr-xr-x 1 root root   9065 Apr  6  2020 policytool
-rwxr-xr-x 1 root root   9057 Apr  6  2020 rmic
-rwxr-xr-x 1 root root   9057 Apr  6  2020 rmid
-rwxr-xr-x 1 root root   9065 Apr  6  2020 rmiregistry
-rwxr-xr-x 1 root root   9065 Apr  6  2020 schemagen
-rwxr-xr-x 1 root root   9065 Apr  6  2020 serialver
-rwxr-xr-x 1 root root   9065 Apr  6  2020 servertool
-rwxr-xr-x 1 root root   9113 Apr  6  2020 tnameserv
-rwxr-xr-x 1 root root 245802 Apr  6  2020 unpack200
-rwxr-xr-x 1 root root   9057 Apr  6  2020 wsgen
-rwxr-xr-x 1 root root   9065 Apr  6  2020 wsimport
-rwxr-xr-x 1 root root   9057 Apr  6  2020 xjc
+ /home/jenkins/tools/java/latest1.8/bin/java -version
openjdk version "1.8.0_252"
OpenJDK Runtime Environment (build 1.8.0_252-b09)
OpenJDK 64-Bit Server VM (build 25.252-b09, mixed mode)
+ echo which java
which java
+ which java
/home/jenkins/tools/java/latest1.8/bin/java
+ java -version
openjdk version "1.8.0_252"
OpenJDK Runtime Environment (build 1.8.0_252-b09)
OpenJDK 64-Bit Server VM (build 25.252-b09, mixed mode)
+ echo which javac
which javac
+ which javac
/home/jenkins/tools/java/latest1.8/bin/javac
+ javac -version
javac 1.8.0_252
+ echo Ant-Home:
Ant-Home:
+ ls -al
total 476
drwxr-xr-x 16 jenkins jenkins   4096 Jan 22 01:12 .
drwxr-xr-x  5 jenkins jenkins   4096 Jan 19 20:32 ..
drwxr-xr-x 30 jenkins jenkins   4096 Dec 12 01:14 build
-rw-r--r--  1 jenkins jenkins  14850 Jan 22 01:12 build.gradle
-rw-r--r--  1 jenkins jenkins    172 Jan 17 01:13 build.javacheck.xml
-rw-r--r--  1 jenkins jenkins 157873 Jan 22 01:12 build.xml
-rw-r--r--  1 jenkins jenkins   3345 Jan  5 01:13 .classpath
-rw-r--r--  1 jenkins jenkins   6325 Jan 22 01:12 doap_POI.rdf
-rw-r--r--  1 jenkins jenkins   2934 Jan 17 01:12 file-leak-detector.exclude
-rw-r--r--  1 jenkins jenkins   6229 Dec 12 01:13 forrest.properties
-rw-r--r--  1 jenkins jenkins     53 Dec 12 01:13 .gitattributes
drwxr-xr-x  3 jenkins jenkins   4096 Jan  5 01:13 .github
-rw-r--r--  1 jenkins jenkins    482 Dec 16 01:12 .gitignore
drwxr-xr-x  3 jenkins jenkins   4096 Dec 12 01:13 gradle
drwxr-xr-x  6 jenkins jenkins   4096 Dec 12 01:13 .gradle
-rwxr-xr-x  1 jenkins jenkins   5770 Jan 22 01:12 gradlew
-rw-r--r--  1 jenkins jenkins   3058 Jan 22 01:12 gradlew.bat
drwxr-xr-x  2 jenkins jenkins   4096 Jan  5 01:13 jenkins
-rw-r--r--  1 jenkins jenkins 167284 Dec 12 01:13 KEYS
drwxr-xr-x  2 jenkins jenkins   4096 Dec 12 01:13 legal
drwxr-xr-x  9 jenkins jenkins   4096 Dec 12 01:14 lib
drwxr-xr-x  2 jenkins jenkins   4096 Jan 17 01:12 maven
drwxr-xr-x  3 jenkins jenkins   4096 Jan 22 01:12 osgi
-rw-r--r--  1 jenkins jenkins   4813 Dec 12 01:13 patch.xml
-rw-r--r--  1 jenkins jenkins    426 Dec 12 01:13 .project
-rw-r--r--  1 jenkins jenkins   4278 Dec 16 01:12 README.rst
drwxr-xr-x  2 jenkins jenkins   4096 Dec 12 01:13 .settings
-rw-r--r--  1 jenkins jenkins    556 Dec 12 01:13 settings.gradle
drwxr-xr-x  9 jenkins jenkins   4096 Jan 17 01:12 sonar
drwxr-xr-x 16 jenkins jenkins   4096 Dec 12 01:13 src
drwxr-xr-x  4 jenkins jenkins   4096 Jan 22 01:12 .svn
drwxr-xr-x 15 jenkins jenkins   4096 Jan  5 01:12 test-data
-rw-r--r--  1 jenkins jenkins    419 Dec 12 01:12 .travis.yml
+ echo which ant
which ant
+ which ant
/usr/bin/ant
+ ant -version
Apache Ant(TM) version 1.10.5 compiled on March 28 2019
+ echo <project default="test"><target name="test"><echo>Java ${ant.java.version}/${java.version}</echo><exec executable="javac"><arg value="-version"/></exec></target></project>
+ ant -f build.javacheck.xml -v
Apache Ant(TM) version 1.10.5 compiled on March 28 2019
Buildfile: <https://ci-builds.apache.org/job/POI/job/POI-DSL-API-Check/ws/build.javacheck.xml>
Detected Java version: 1.8 in: /usr/local/asfpackages/java/openjdk-8u252-b09/jre
Detected OS: Linux
parsing buildfile <https://ci-builds.apache.org/job/POI/job/POI-DSL-API-Check/ws/build.javacheck.xml> with URI = <https://ci-builds.apache.org/job/POI/job/POI-DSL-API-Check/ws/build.javacheck.xml>
Project base dir set to: <https://ci-builds.apache.org/job/POI/job/POI-DSL-API-Check/ws/>
Build sequence for target(s) `test' is [test]
Complete build sequence is [test, ]

test:
parsing buildfile jar:file:/usr/share/ant/lib/ant.jar!/org/apache/tools/ant/antlib.xml with URI = jar:file:/usr/share/ant/lib/ant.jar!/org/apache/tools/ant/antlib.xml from a zip file
     [echo] Java 1.8/1.8.0_252
     [exec] Current OS is Linux
     [exec] Executing 'javac' with arguments:
     [exec] '-version'
     [exec]
     [exec] The ' characters around the executable and arguments are
     [exec] not part of the command.
     [exec] javac 1.8.0_252

BUILD SUCCESSFUL
Total time: 0 seconds
+ exit 0
[Gradle] - Launching build.
[POI-DSL-API-Check] $ <https://ci-builds.apache.org/job/POI/job/POI-DSL-API-Check/ws/gradlew> japicmp
Downloading https://services.gradle.org/distributions/gradle-6.8-bin.zip
..........10%..........20%..........30%...........40%..........50%..........60%..........70%...........80%..........90%..........100%
To honour the JVM settings for this build a single-use Daemon process will be forked. See https://docs.gradle.org/6.8/userguide/gradle_daemon.html#sec:disabling_the_daemon.
Daemon will be stopped at the end of the build

> Configure project :
Trying to override old definition of datatype junit

> Task :main:compileJava
Note: Some input files use or override a deprecated API.
Note: Recompile with -Xlint:deprecation for details.
Note: Some input files use unchecked or unsafe operations.
Note: Recompile with -Xlint:unchecked for details.

> Task :main:processResources
> Task :main:classes
> Task :main:jar
> Task :ooxml:ant-check-jars
> Task :ooxml:ant-fetch-jars
> Task :ooxml:ant-check-ooxml-jars
> Task :ooxml:ant-fetch-ooxml-jars

> Task :ooxml:ant-init
[ant:echo] Using Ant: Apache Ant(TM) version 1.10.9 compiled on September 27 2020 from ${ant.home}, Ant detected Java 1.8 (may be different than actual Java sometimes...)
[ant:echo] Using Java: 1.8.0_252/1.8.0_252-b09/25.252-b09/OpenJDK 64-Bit Server VM from Oracle Corporation on Linux: 4.15.0-66-generic
[ant:echo] Building Apache POI version 5.0.1-SNAPSHOT and RC: RC1

> Task :ooxml:ant-check-compiled-ooxml-xsds

> Task :ooxml:ant-compile-ooxml-xsds
SchemaCompiler  Metadata LOAD:org/apache/xmlbeans/metadata GEN:org/apache/poi/schemas/ooxml
Time to build schema type system: 3.312 seconds
Time to generate code: 8.216 seconds

> Task :scratchpad:compileJava
Note: Some input files use or override a deprecated API.
Note: Recompile with -Xlint:deprecation for details.
Note: Some input files use unchecked or unsafe operations.
Note: Recompile with -Xlint:unchecked for details.

> Task :scratchpad:processResources
> Task :scratchpad:classes
> Task :scratchpad:jar

> Task :ooxml:compileJava
Note: Some input files use or override a deprecated API.
Note: Recompile with -Xlint:deprecation for details.
Note: <https://ci-builds.apache.org/job/POI/job/POI-DSL-API-Check/ws/src/ooxml/java/org/apache/poi/xslf/draw/SVGImageRenderer.java> uses unchecked or unsafe operations.
Note: Recompile with -Xlint:unchecked for details.

> Task :ooxml:processResources
> Task :ooxml:classes
> Task :ooxml:jar
> Task :examples:compileJava
> Task :examples:processResources NO-SOURCE
> Task :examples:classes
> Task :examples:jar
> Task :examples:japicmp SKIPPED
> Task :excelant:compileJava
> Task :excelant:processResources
> Task :excelant:classes
> Task :excelant:jar
> Task :excelant:japicmp FAILED

FAILURE: Build failed with an exception.

* What went wrong:
Execution failed for task ':excelant:japicmp'.
> Failed to load file from jar 'META-INF/versions/9/module-info.class' as class file: invalid constant type: 19 at 3.

* Try:
Run with --stacktrace option to get the stack trace. Run with --info or --debug option to get more log output. Run with --scan to get full insights.

* Get more help at https://help.gradle.org

Deprecated Gradle features were used in this build, making it incompatible with Gradle 7.0.
Use '--warning-mode all' to show the individual deprecation warnings.
See https://docs.gradle.org/6.8/userguide/command_line_interface.html#sec:command_line_warnings

BUILD FAILED in 3m 18s
22 actionable tasks: 22 executed
Build step 'Invoke Gradle script' changed build result to FAILURE
Build step 'Invoke Gradle script' marked build as failure
Archiving artifacts
[Fast Archiver] Compressed 29.97 MB of artifacts by 99.9% relative to #90

---------------------------------------------------------------------
To unsubscribe, e-mail: [hidden email]
For additional commands, e-mail: [hidden email]

Reply | Threaded
Open this post in threaded view
|

Build failed in Jenkins: POI » POI-DSL-API-Check #96

Apache Jenkins Server
See <https://ci-builds.apache.org/job/POI/job/POI-DSL-API-Check/96/display/redirect?page=changes>

Changes:

[Andreas Beeker] Sonar fixes
add asserts to tests

[Andreas Beeker] Junit5 - fix logging to console

[Dominik Stadler] List more bugfixes that went into 5.0.0

[Andreas Beeker] try to fix font-based issues

[Dominik Stadler] List some more changes for 5.0.0

[Dominik Stadler] Documentation: Adjust examples, fix git command, adjust for JUnit 5

[Andreas Beeker] Sonar fixes
add asserts to tests


------------------------------------------
[...truncated 3.25 KB...]
A         src/examples/src/org/apache/poi/examples/xslf/DoughnutChartFromScratch.java
U         src/examples/src/org/apache/poi/examples/xslf/PieChartDemo.java
U         build.xml
AU        test-data/spreadsheet/InlineString.xlsx

<-- Got one external: forrest.properties, svn url: https://svn.apache.org/repos/asf/poi/site/forrest.properties -->
Fetching 'https://svn.apache.org/repos/asf/poi/site/forrest.properties' at -1 into '<https://ci-builds.apache.org/job/POI/job/POI-DSL-API-Check/ws/forrest.properties'>
At revision 1885860


<-- Got one external: documentation, svn url: https://svn.apache.org/repos/asf/poi/site/src/documentation -->
Fetching 'https://svn.apache.org/repos/asf/poi/site/src/documentation' at -1 into '<https://ci-builds.apache.org/job/POI/job/POI-DSL-API-Check/ws/src/documentation'>
U         src/documentation/content/xdocs/changes.xml
U         src/documentation/content/xdocs/components/spreadsheet/quick-guide.xml
U         src/documentation/content/xdocs/devel/guidelines.xml
U         src/documentation/content/xdocs/devel/subversion.xml
At revision 1885860

At revision 1885860

No changes for https://svn.apache.org/repos/asf/poi/site/forrest.properties since the previous build
[POI-DSL-API-Check] $ /bin/sh -xe /tmp/jenkins7555361185246088519.sh
+ svn status
?       build.javacheck.xml
    X   forrest.properties
X       src/documentation

Performing status on external item at 'src/documentation':
+ echo Java-Home: /home/jenkins/tools/java/latest1.8
Java-Home: /home/jenkins/tools/java/latest1.8
+ ls -al /home/jenkins/tools/java/latest1.8/
total 51232
drwxrwxr-x  9 root root     4096 Jul  2  2020 .
drwxr-xr-x 39 root root     4096 Jan  2 19:14 ..
-r--r--r--  1 root root     1522 Apr  6  2020 ASSEMBLY_EXCEPTION
drwxrwxr-x  2 root root     4096 Jul  2  2020 bin
drwxrwxr-x 10 root root     4096 Jul  2  2020 demo
drwxrwxr-x  3 root root     4096 Jul  2  2020 include
drwxrwxr-x  4 root root     4096 Jul  2  2020 jre
drwxrwxr-x  3 root root     4096 Jul  2  2020 lib
-r--r--r--  1 root root    19274 Apr  6  2020 LICENSE
drwxrwxr-x  4 root root     4096 Jul  2  2020 man
-rw-rw-r--  1 root root      238 Apr  6  2020 release
drwxrwxr-x 10 root root     4096 Jul  2  2020 sample
-rw-rw-r--  1 root root 52236869 Apr  6  2020 src.zip
-r--r--r--  1 root root   153250 Apr  6  2020 THIRD_PARTY_README
+ ls -al /home/jenkins/tools/java/latest1.8/bin
total 748
drwxrwxr-x 2 root root   4096 Jul  2  2020 .
drwxrwxr-x 9 root root   4096 Jul  2  2020 ..
-rwxr-xr-x 1 root root   9065 Apr  6  2020 appletviewer
-rwxr-xr-x 1 root root   9073 Apr  6  2020 clhsdb
-rwxr-xr-x 1 root root   9065 Apr  6  2020 extcheck
-rwxr-xr-x 1 root root   9065 Apr  6  2020 hsdb
-rwxr-xr-x 1 root root   9057 Apr  6  2020 idlj
-rwxr-xr-x 1 root root   9057 Apr  6  2020 jar
-rwxr-xr-x 1 root root   9065 Apr  6  2020 jarsigner
-rwxr-xr-x 1 root root   8930 Apr  6  2020 java
-rwxr-xr-x 1 root root   9057 Apr  6  2020 javac
-rwxr-xr-x 1 root root   9065 Apr  6  2020 javadoc
-rwxr-xr-x 1 root root   9057 Apr  6  2020 javah
-rwxr-xr-x 1 root root   9057 Apr  6  2020 javap
-rwxrwxr-x 1 root root   2806 Apr  6  2020 java-rmi.cgi
-rwxr-xr-x 1 root root   9057 Apr  6  2020 jcmd
-rwxr-xr-x 1 root root   9089 Apr  6  2020 jconsole
-rwxr-xr-x 1 root root   9065 Apr  6  2020 jdb
-rwxr-xr-x 1 root root   9057 Apr  6  2020 jdeps
-rwxr-xr-x 1 root root   9057 Apr  6  2020 jhat
-rwxr-xr-x 1 root root   9097 Apr  6  2020 jinfo
-rwxr-xr-x 1 root root   9057 Apr  6  2020 jjs
-rwxr-xr-x 1 root root   9097 Apr  6  2020 jmap
-rwxr-xr-x 1 root root   9057 Apr  6  2020 jps
-rwxr-xr-x 1 root root   9065 Apr  6  2020 jrunscript
-rwxr-xr-x 1 root root   9073 Apr  6  2020 jsadebugd
-rwxr-xr-x 1 root root   9105 Apr  6  2020 jstack
-rwxr-xr-x 1 root root   9057 Apr  6  2020 jstat
-rwxr-xr-x 1 root root   9065 Apr  6  2020 jstatd
-rwxr-xr-x 1 root root   9065 Apr  6  2020 keytool
-rwxr-xr-x 1 root root   9065 Apr  6  2020 native2ascii
-rwxr-xr-x 1 root root   9105 Apr  6  2020 orbd
-rwxr-xr-x 1 root root   9065 Apr  6  2020 pack200
-rwxr-xr-x 1 root root   9065 Apr  6  2020 policytool
-rwxr-xr-x 1 root root   9057 Apr  6  2020 rmic
-rwxr-xr-x 1 root root   9057 Apr  6  2020 rmid
-rwxr-xr-x 1 root root   9065 Apr  6  2020 rmiregistry
-rwxr-xr-x 1 root root   9065 Apr  6  2020 schemagen
-rwxr-xr-x 1 root root   9065 Apr  6  2020 serialver
-rwxr-xr-x 1 root root   9065 Apr  6  2020 servertool
-rwxr-xr-x 1 root root   9113 Apr  6  2020 tnameserv
-rwxr-xr-x 1 root root 245802 Apr  6  2020 unpack200
-rwxr-xr-x 1 root root   9057 Apr  6  2020 wsgen
-rwxr-xr-x 1 root root   9065 Apr  6  2020 wsimport
-rwxr-xr-x 1 root root   9057 Apr  6  2020 xjc
+ /home/jenkins/tools/java/latest1.8/bin/java -version
openjdk version "1.8.0_252"
OpenJDK Runtime Environment (build 1.8.0_252-b09)
OpenJDK 64-Bit Server VM (build 25.252-b09, mixed mode)
+ echo which java
which java
+ which java
/home/jenkins/tools/java/latest1.8/bin/java
+ java -version
openjdk version "1.8.0_252"
OpenJDK Runtime Environment (build 1.8.0_252-b09)
OpenJDK 64-Bit Server VM (build 25.252-b09, mixed mode)
+ echo which javac
which javac
+ which javac
/home/jenkins/tools/java/latest1.8/bin/javac
+ javac -version
javac 1.8.0_252
+ echo Ant-Home:
Ant-Home:
+ ls -al
total 476
drwxr-xr-x 16 jenkins jenkins   4096 Jan 19 01:12 .
drwxr-xr-x  8 jenkins jenkins   4096 Jan 18 20:41 ..
drwxr-xr-x 30 jenkins jenkins   4096 Nov 12 01:14 build
-rw-r--r--  1 jenkins jenkins  14850 Jan 19 01:12 build.gradle
-rw-r--r--  1 jenkins jenkins    172 Jan 20 01:12 build.javacheck.xml
-rw-r--r--  1 jenkins jenkins 157398 Jan 24 01:12 build.xml
-rw-r--r--  1 jenkins jenkins   3345 Dec 18 01:12 .classpath
-rw-r--r--  1 jenkins jenkins   6325 Jan 18 01:12 doap_POI.rdf
-rw-r--r--  1 jenkins jenkins   2934 Jan  9 01:12 file-leak-detector.exclude
-rw-r--r--  1 jenkins jenkins   6229 Nov 12 01:13 forrest.properties
-rw-r--r--  1 jenkins jenkins     53 Nov 12 01:13 .gitattributes
drwxr-xr-x  3 jenkins jenkins   4096 Dec 21 01:12 .github
-rw-r--r--  1 jenkins jenkins    482 Dec 13 19:13 .gitignore
drwxr-xr-x  3 jenkins jenkins   4096 Nov 12 01:13 gradle
drwxr-xr-x  8 jenkins jenkins   4096 Jan 19 01:13 .gradle
-rwxr-xr-x  1 jenkins jenkins   5770 Jan 19 01:12 gradlew
-rw-r--r--  1 jenkins jenkins   3058 Jan 19 01:12 gradlew.bat
drwxr-xr-x  2 jenkins jenkins   4096 Jan  6 01:15 jenkins
-rw-r--r--  1 jenkins jenkins 167284 Nov 12 01:13 KEYS
drwxr-xr-x  2 jenkins jenkins   4096 Nov 12 01:13 legal
drwxr-xr-x  9 jenkins jenkins   4096 Nov 12 01:14 lib
drwxr-xr-x  2 jenkins jenkins   4096 Jan 14 01:12 maven
drwxr-xr-x  3 jenkins jenkins   4096 Jan 18 01:12 osgi
-rw-r--r--  1 jenkins jenkins   4813 Nov 12 01:13 patch.xml
-rw-r--r--  1 jenkins jenkins    426 Nov 12 01:13 .project
-rw-r--r--  1 jenkins jenkins   4278 Dec 13 19:13 README.rst
drwxr-xr-x  2 jenkins jenkins   4096 Nov 12 01:13 .settings
-rw-r--r--  1 jenkins jenkins    556 Nov 12 01:13 settings.gradle
drwxr-xr-x  9 jenkins jenkins   4096 Jan 14 01:12 sonar
drwxr-xr-x 16 jenkins jenkins   4096 Nov 12 01:14 src
drwxr-xr-x  4 jenkins jenkins   4096 Jan 24 01:12 .svn
drwxr-xr-x 15 jenkins jenkins   4096 Jan  6 01:15 test-data
-rw-r--r--  1 jenkins jenkins    419 Dec  8 01:12 .travis.yml
+ echo which ant
which ant
+ which ant
/usr/bin/ant
+ ant -version
Apache Ant(TM) version 1.10.5 compiled on March 28 2019
+ echo <project default="test"><target name="test"><echo>Java ${ant.java.version}/${java.version}</echo><exec executable="javac"><arg value="-version"/></exec></target></project>
+ ant -f build.javacheck.xml -v
Apache Ant(TM) version 1.10.5 compiled on March 28 2019
Buildfile: <https://ci-builds.apache.org/job/POI/job/POI-DSL-API-Check/ws/build.javacheck.xml>
Detected Java version: 1.8 in: /usr/local/asfpackages/java/openjdk-8u252-b09/jre
Detected OS: Linux
parsing buildfile <https://ci-builds.apache.org/job/POI/job/POI-DSL-API-Check/ws/build.javacheck.xml> with URI = <https://ci-builds.apache.org/job/POI/job/POI-DSL-API-Check/ws/build.javacheck.xml>
Project base dir set to: <https://ci-builds.apache.org/job/POI/job/POI-DSL-API-Check/ws/>
Build sequence for target(s) `test' is [test]
Complete build sequence is [test, ]

test:
parsing buildfile jar:file:/usr/share/ant/lib/ant.jar!/org/apache/tools/ant/antlib.xml with URI = jar:file:/usr/share/ant/lib/ant.jar!/org/apache/tools/ant/antlib.xml from a zip file
     [echo] Java 1.8/1.8.0_252
     [exec] Current OS is Linux
     [exec] Executing 'javac' with arguments:
     [exec] '-version'
     [exec]
     [exec] The ' characters around the executable and arguments are
     [exec] not part of the command.
     [exec] javac 1.8.0_252

BUILD SUCCESSFUL
Total time: 0 seconds
+ exit 0
[Gradle] - Launching build.
[POI-DSL-API-Check] $ <https://ci-builds.apache.org/job/POI/job/POI-DSL-API-Check/ws/gradlew> japicmp
To honour the JVM settings for this build a single-use Daemon process will be forked. See https://docs.gradle.org/6.8/userguide/gradle_daemon.html#sec:disabling_the_daemon.
Daemon will be stopped at the end of the build

> Configure project :
Trying to override old definition of datatype junit

> Task :main:compileJava
> Task :main:processResources UP-TO-DATE
> Task :main:classes
> Task :main:jar
> Task :ooxml:ant-check-jars
> Task :ooxml:ant-fetch-jars
> Task :ooxml:ant-check-ooxml-jars
> Task :ooxml:ant-fetch-ooxml-jars

> Task :ooxml:ant-init
[ant:echo] Using Ant: Apache Ant(TM) version 1.10.9 compiled on September 27 2020 from ${ant.home}, Ant detected Java 1.8 (may be different than actual Java sometimes...)
[ant:echo] Using Java: 1.8.0_252/1.8.0_252-b09/25.252-b09/OpenJDK 64-Bit Server VM from Oracle Corporation on Linux: 4.15.0-58-generic
[ant:echo] Building Apache POI version 5.0.1-SNAPSHOT and RC: RC1

> Task :ooxml:ant-check-compiled-ooxml-xsds
> Task :ooxml:ant-compile-ooxml-xsds

> Task :scratchpad:compileJava
Note: Some input files use or override a deprecated API.
Note: Recompile with -Xlint:deprecation for details.
Note: Some input files use unchecked or unsafe operations.
Note: Recompile with -Xlint:unchecked for details.

> Task :scratchpad:processResources UP-TO-DATE
> Task :scratchpad:classes
> Task :scratchpad:jar
> Task :ooxml:compileJava
> Task :ooxml:processResources UP-TO-DATE
> Task :ooxml:classes
> Task :ooxml:jar
> Task :examples:compileJava
> Task :examples:processResources NO-SOURCE
> Task :examples:classes
> Task :examples:jar
> Task :examples:japicmp SKIPPED
> Task :excelant:compileJava
> Task :excelant:processResources UP-TO-DATE
> Task :excelant:classes
> Task :excelant:jar UP-TO-DATE
> Task :excelant:japicmp FAILED

FAILURE: Build failed with an exception.

* What went wrong:
Execution failed for task ':excelant:japicmp'.
> Failed to load file from jar 'META-INF/versions/9/module-info.class' as class file: invalid constant type: 19 at 3.

* Try:
Run with --stacktrace option to get the stack trace. Run with --info or --debug option to get more log output. Run with --scan to get full insights.

* Get more help at https://help.gradle.org

Deprecated Gradle features were used in this build, making it incompatible with Gradle 7.0.
Use '--warning-mode all' to show the individual deprecation warnings.
See https://docs.gradle.org/6.8/userguide/command_line_interface.html#sec:command_line_warnings

BUILD FAILED in 51s
22 actionable tasks: 17 executed, 5 up-to-date
Build step 'Invoke Gradle script' changed build result to FAILURE
Build step 'Invoke Gradle script' marked build as failure
Archiving artifacts
[Fast Archiver] Compressed 29.34 MB of artifacts by 99.2% relative to #90

---------------------------------------------------------------------
To unsubscribe, e-mail: [hidden email]
For additional commands, e-mail: [hidden email]

Reply | Threaded
Open this post in threaded view
|

Build failed in Jenkins: POI » POI-DSL-API-Check #97

Apache Jenkins Server
See <https://ci-builds.apache.org/job/POI/job/POI-DSL-API-Check/97/display/redirect?page=changes>

Changes:

[Andreas Beeker] try to fix windows integration tests

[Alain Béarez] Replace deprecated methods used  in tests


------------------------------------------
[...truncated 426 B...]
Building remotely on H22 (ubuntu) in workspace <https://ci-builds.apache.org/job/POI/job/POI-DSL-API-Check/ws/>
[WS-CLEANUP] Deleting project workspace...
[WS-CLEANUP] Done
Updating https://svn.apache.org/repos/asf/poi/trunk at revision '2021-01-25T01:12:14.185 +0000'
U         src/integrationtest/org/apache/poi/stress/SlideShowHandler.java
U         src/integrationtest/org/apache/poi/stress/TestAllFiles.java
U         src/examples/src/org/apache/poi/examples/xssf/usermodel/ExcelChartWithTargetLine.java
U         src/examples/src/org/apache/poi/examples/xwpf/usermodel/BarChartExample.java
U         src/examples/src/org/apache/poi/examples/xwpf/usermodel/ChartFromScratch.java
U         src/ooxml/testcases/org/apache/poi/xddf/usermodel/chart/TestXDDFChartRemoveSeries.java
U         src/ooxml/testcases/org/apache/poi/xssf/usermodel/charts/TestXSSFLineChartData.java
U         src/ooxml/testcases/org/apache/poi/xssf/usermodel/charts/TestXSSFScatterChartData.java
U         src/ooxml/testcases/org/apache/poi/xwpf/usermodel/TestXWPFChart.java

<-- Got one external: forrest.properties, svn url: https://svn.apache.org/repos/asf/poi/site/forrest.properties -->
Fetching 'https://svn.apache.org/repos/asf/poi/site/forrest.properties' at -1 into '<https://ci-builds.apache.org/job/POI/job/POI-DSL-API-Check/ws/forrest.properties'>
At revision 1885890


<-- Got one external: documentation, svn url: https://svn.apache.org/repos/asf/poi/site/src/documentation -->
Fetching 'https://svn.apache.org/repos/asf/poi/site/src/documentation' at -1 into '<https://ci-builds.apache.org/job/POI/job/POI-DSL-API-Check/ws/src/documentation'>
At revision 1885890

At revision 1885890

No changes for https://svn.apache.org/repos/asf/poi/site/forrest.properties since the previous build
No changes for https://svn.apache.org/repos/asf/poi/site/src/documentation since the previous build
[POI-DSL-API-Check] $ /bin/sh -xe /tmp/jenkins5898540109519134685.sh
+ svn status
?       build.javacheck.xml
    X   forrest.properties
X       src/documentation

Performing status on external item at 'src/documentation':
+ echo Java-Home: /home/jenkins/tools/java/latest1.8
Java-Home: /home/jenkins/tools/java/latest1.8
+ ls -al /home/jenkins/tools/java/latest1.8/
total 51232
drwxrwxr-x  9 root root     4096 Jul  2  2020 .
drwxr-xr-x 39 root root     4096 Jan  2 19:14 ..
-r--r--r--  1 root root     1522 Apr  6  2020 ASSEMBLY_EXCEPTION
drwxrwxr-x  2 root root     4096 Jul  2  2020 bin
drwxrwxr-x 10 root root     4096 Jul  2  2020 demo
drwxrwxr-x  3 root root     4096 Jul  2  2020 include
drwxrwxr-x  4 root root     4096 Jul  2  2020 jre
drwxrwxr-x  3 root root     4096 Jul  2  2020 lib
-r--r--r--  1 root root    19274 Apr  6  2020 LICENSE
drwxrwxr-x  4 root root     4096 Jul  2  2020 man
-rw-rw-r--  1 root root      238 Apr  6  2020 release
drwxrwxr-x 10 root root     4096 Jul  2  2020 sample
-rw-rw-r--  1 root root 52236869 Apr  6  2020 src.zip
-r--r--r--  1 root root   153250 Apr  6  2020 THIRD_PARTY_README
+ ls -al /home/jenkins/tools/java/latest1.8/bin
total 748
drwxrwxr-x 2 root root   4096 Jul  2  2020 .
drwxrwxr-x 9 root root   4096 Jul  2  2020 ..
-rwxr-xr-x 1 root root   9065 Apr  6  2020 appletviewer
-rwxr-xr-x 1 root root   9073 Apr  6  2020 clhsdb
-rwxr-xr-x 1 root root   9065 Apr  6  2020 extcheck
-rwxr-xr-x 1 root root   9065 Apr  6  2020 hsdb
-rwxr-xr-x 1 root root   9057 Apr  6  2020 idlj
-rwxr-xr-x 1 root root   9057 Apr  6  2020 jar
-rwxr-xr-x 1 root root   9065 Apr  6  2020 jarsigner
-rwxr-xr-x 1 root root   8930 Apr  6  2020 java
-rwxr-xr-x 1 root root   9057 Apr  6  2020 javac
-rwxr-xr-x 1 root root   9065 Apr  6  2020 javadoc
-rwxr-xr-x 1 root root   9057 Apr  6  2020 javah
-rwxr-xr-x 1 root root   9057 Apr  6  2020 javap
-rwxrwxr-x 1 root root   2806 Apr  6  2020 java-rmi.cgi
-rwxr-xr-x 1 root root   9057 Apr  6  2020 jcmd
-rwxr-xr-x 1 root root   9089 Apr  6  2020 jconsole
-rwxr-xr-x 1 root root   9065 Apr  6  2020 jdb
-rwxr-xr-x 1 root root   9057 Apr  6  2020 jdeps
-rwxr-xr-x 1 root root   9057 Apr  6  2020 jhat
-rwxr-xr-x 1 root root   9097 Apr  6  2020 jinfo
-rwxr-xr-x 1 root root   9057 Apr  6  2020 jjs
-rwxr-xr-x 1 root root   9097 Apr  6  2020 jmap
-rwxr-xr-x 1 root root   9057 Apr  6  2020 jps
-rwxr-xr-x 1 root root   9065 Apr  6  2020 jrunscript
-rwxr-xr-x 1 root root   9073 Apr  6  2020 jsadebugd
-rwxr-xr-x 1 root root   9105 Apr  6  2020 jstack
-rwxr-xr-x 1 root root   9057 Apr  6  2020 jstat
-rwxr-xr-x 1 root root   9065 Apr  6  2020 jstatd
-rwxr-xr-x 1 root root   9065 Apr  6  2020 keytool
-rwxr-xr-x 1 root root   9065 Apr  6  2020 native2ascii
-rwxr-xr-x 1 root root   9105 Apr  6  2020 orbd
-rwxr-xr-x 1 root root   9065 Apr  6  2020 pack200
-rwxr-xr-x 1 root root   9065 Apr  6  2020 policytool
-rwxr-xr-x 1 root root   9057 Apr  6  2020 rmic
-rwxr-xr-x 1 root root   9057 Apr  6  2020 rmid
-rwxr-xr-x 1 root root   9065 Apr  6  2020 rmiregistry
-rwxr-xr-x 1 root root   9065 Apr  6  2020 schemagen
-rwxr-xr-x 1 root root   9065 Apr  6  2020 serialver
-rwxr-xr-x 1 root root   9065 Apr  6  2020 servertool
-rwxr-xr-x 1 root root   9113 Apr  6  2020 tnameserv
-rwxr-xr-x 1 root root 245802 Apr  6  2020 unpack200
-rwxr-xr-x 1 root root   9057 Apr  6  2020 wsgen
-rwxr-xr-x 1 root root   9065 Apr  6  2020 wsimport
-rwxr-xr-x 1 root root   9057 Apr  6  2020 xjc
+ /home/jenkins/tools/java/latest1.8/bin/java -version
openjdk version "1.8.0_252"
OpenJDK Runtime Environment (build 1.8.0_252-b09)
OpenJDK 64-Bit Server VM (build 25.252-b09, mixed mode)
+ echo which java
which java
+ which java
/home/jenkins/tools/java/latest1.8/bin/java
+ java -version
openjdk version "1.8.0_252"
OpenJDK Runtime Environment (build 1.8.0_252-b09)
OpenJDK 64-Bit Server VM (build 25.252-b09, mixed mode)
+ echo which javac
which javac
+ which javac
/home/jenkins/tools/java/latest1.8/bin/javac
+ javac -version
javac 1.8.0_252
+ echo Ant-Home:
Ant-Home:
+ ls -al
total 476
drwxr-xr-x 16 jenkins jenkins   4096 Jan 19 01:12 .
drwxr-xr-x  8 jenkins jenkins   4096 Jan 18 20:41 ..
drwxr-xr-x 30 jenkins jenkins   4096 Nov 12 01:14 build
-rw-r--r--  1 jenkins jenkins  14850 Jan 19 01:12 build.gradle
-rw-r--r--  1 jenkins jenkins    172 Jan 24 01:12 build.javacheck.xml
-rw-r--r--  1 jenkins jenkins 157398 Jan 24 01:12 build.xml
-rw-r--r--  1 jenkins jenkins   3345 Dec 18 01:12 .classpath
-rw-r--r--  1 jenkins jenkins   6325 Jan 18 01:12 doap_POI.rdf
-rw-r--r--  1 jenkins jenkins   2934 Jan  9 01:12 file-leak-detector.exclude
-rw-r--r--  1 jenkins jenkins   6229 Nov 12 01:13 forrest.properties
-rw-r--r--  1 jenkins jenkins     53 Nov 12 01:13 .gitattributes
drwxr-xr-x  3 jenkins jenkins   4096 Dec 21 01:12 .github
-rw-r--r--  1 jenkins jenkins    482 Dec 13 19:13 .gitignore
drwxr-xr-x  3 jenkins jenkins   4096 Nov 12 01:13 gradle
drwxr-xr-x  8 jenkins jenkins   4096 Jan 19 01:13 .gradle
-rwxr-xr-x  1 jenkins jenkins   5770 Jan 19 01:12 gradlew
-rw-r--r--  1 jenkins jenkins   3058 Jan 19 01:12 gradlew.bat
drwxr-xr-x  2 jenkins jenkins   4096 Jan  6 01:15 jenkins
-rw-r--r--  1 jenkins jenkins 167284 Nov 12 01:13 KEYS
drwxr-xr-x  2 jenkins jenkins   4096 Nov 12 01:13 legal
drwxr-xr-x  9 jenkins jenkins   4096 Nov 12 01:14 lib
drwxr-xr-x  2 jenkins jenkins   4096 Jan 14 01:12 maven
drwxr-xr-x  3 jenkins jenkins   4096 Jan 18 01:12 osgi
-rw-r--r--  1 jenkins jenkins   4813 Nov 12 01:13 patch.xml
-rw-r--r--  1 jenkins jenkins    426 Nov 12 01:13 .project
-rw-r--r--  1 jenkins jenkins   4278 Dec 13 19:13 README.rst
drwxr-xr-x  2 jenkins jenkins   4096 Nov 12 01:13 .settings
-rw-r--r--  1 jenkins jenkins    556 Nov 12 01:13 settings.gradle
drwxr-xr-x  9 jenkins jenkins   4096 Jan 14 01:12 sonar
drwxr-xr-x 16 jenkins jenkins   4096 Nov 12 01:14 src
drwxr-xr-x  4 jenkins jenkins   4096 Jan 25 01:12 .svn
drwxr-xr-x 15 jenkins jenkins   4096 Jan  6 01:15 test-data
-rw-r--r--  1 jenkins jenkins    419 Dec  8 01:12 .travis.yml
+ echo which ant
which ant
+ which ant
/usr/bin/ant
+ ant -version
Apache Ant(TM) version 1.10.5 compiled on March 28 2019
+ echo <project default="test"><target name="test"><echo>Java ${ant.java.version}/${java.version}</echo><exec executable="javac"><arg value="-version"/></exec></target></project>
+ ant -f build.javacheck.xml -v
Apache Ant(TM) version 1.10.5 compiled on March 28 2019
Buildfile: <https://ci-builds.apache.org/job/POI/job/POI-DSL-API-Check/ws/build.javacheck.xml>
Detected Java version: 1.8 in: /usr/local/asfpackages/java/openjdk-8u252-b09/jre
Detected OS: Linux
parsing buildfile <https://ci-builds.apache.org/job/POI/job/POI-DSL-API-Check/ws/build.javacheck.xml> with URI = <https://ci-builds.apache.org/job/POI/job/POI-DSL-API-Check/ws/build.javacheck.xml>
Project base dir set to: <https://ci-builds.apache.org/job/POI/job/POI-DSL-API-Check/ws/>
Build sequence for target(s) `test' is [test]
Complete build sequence is [test, ]

test:
parsing buildfile jar:file:/usr/share/ant/lib/ant.jar!/org/apache/tools/ant/antlib.xml with URI = jar:file:/usr/share/ant/lib/ant.jar!/org/apache/tools/ant/antlib.xml from a zip file
     [echo] Java 1.8/1.8.0_252
     [exec] Current OS is Linux
     [exec] Executing 'javac' with arguments:
     [exec] '-version'
     [exec]
     [exec] The ' characters around the executable and arguments are
     [exec] not part of the command.
     [exec] javac 1.8.0_252

BUILD SUCCESSFUL
Total time: 0 seconds
+ exit 0
[Gradle] - Launching build.
[POI-DSL-API-Check] $ <https://ci-builds.apache.org/job/POI/job/POI-DSL-API-Check/ws/gradlew> japicmp
To honour the JVM settings for this build a single-use Daemon process will be forked. See https://docs.gradle.org/6.8/userguide/gradle_daemon.html#sec:disabling_the_daemon.
Daemon will be stopped at the end of the build

> Configure project :
Trying to override old definition of datatype junit

> Task :main:compileJava UP-TO-DATE
> Task :main:processResources UP-TO-DATE
> Task :main:classes UP-TO-DATE
> Task :main:jar UP-TO-DATE
> Task :ooxml:ant-check-jars
> Task :ooxml:ant-fetch-jars
> Task :ooxml:ant-check-ooxml-jars
> Task :ooxml:ant-fetch-ooxml-jars

> Task :ooxml:ant-init
[ant:echo] Using Ant: Apache Ant(TM) version 1.10.9 compiled on September 27 2020 from ${ant.home}, Ant detected Java 1.8 (may be different than actual Java sometimes...)
[ant:echo] Using Java: 1.8.0_252/1.8.0_252-b09/25.252-b09/OpenJDK 64-Bit Server VM from Oracle Corporation on Linux: 4.15.0-58-generic
[ant:echo] Building Apache POI version 5.0.1-SNAPSHOT and RC: RC1

> Task :ooxml:ant-check-compiled-ooxml-xsds
> Task :ooxml:ant-compile-ooxml-xsds
> Task :scratchpad:compileJava UP-TO-DATE
> Task :scratchpad:processResources UP-TO-DATE
> Task :scratchpad:classes UP-TO-DATE
> Task :scratchpad:jar UP-TO-DATE
> Task :ooxml:compileJava UP-TO-DATE
> Task :ooxml:processResources UP-TO-DATE
> Task :ooxml:classes UP-TO-DATE
> Task :ooxml:jar UP-TO-DATE
> Task :examples:compileJava
> Task :examples:processResources NO-SOURCE
> Task :examples:classes
> Task :examples:jar
> Task :examples:japicmp SKIPPED
> Task :excelant:compileJava UP-TO-DATE
> Task :excelant:processResources UP-TO-DATE
> Task :excelant:classes UP-TO-DATE
> Task :excelant:jar UP-TO-DATE
> Task :excelant:japicmp FAILED

FAILURE: Build failed with an exception.

* What went wrong:
Execution failed for task ':excelant:japicmp'.
> Failed to load file from jar 'META-INF/versions/9/module-info.class' as class file: invalid constant type: 19 at 3.

* Try:
Run with --stacktrace option to get the stack trace. Run with --info or --debug option to get more log output. Run with --scan to get full insights.

* Get more help at https://help.gradle.org

Deprecated Gradle features were used in this build, making it incompatible with Gradle 7.0.
Use '--warning-mode all' to show the individual deprecation warnings.
See https://docs.gradle.org/6.8/userguide/command_line_interface.html#sec:command_line_warnings

BUILD FAILED in 17s
22 actionable tasks: 10 executed, 12 up-to-date
Build step 'Invoke Gradle script' changed build result to FAILURE
Build step 'Invoke Gradle script' marked build as failure
Archiving artifacts
[Fast Archiver] Compressed 29.34 MB of artifacts by 99.2% relative to #90

---------------------------------------------------------------------
To unsubscribe, e-mail: [hidden email]
For additional commands, e-mail: [hidden email]

Reply | Threaded
Open this post in threaded view
|

Build failed in Jenkins: POI » POI-DSL-API-Check #98

Apache Jenkins Server
See <https://ci-builds.apache.org/job/POI/job/POI-DSL-API-Check/98/display/redirect?page=changes>

Changes:

[Andreas Beeker] Sonar fixes
add asserts to tests


------------------------------------------
[...truncated 103.44 KB...]
At revision 1885924

No changes for https://svn.apache.org/repos/asf/poi/site/forrest.properties since the previous build
No changes for https://svn.apache.org/repos/asf/poi/site/src/documentation since the previous build
[POI-DSL-API-Check] $ /bin/sh -xe /tmp/jenkins6668911391074999577.sh
+ svn status
?       build.javacheck.xml
    X   forrest.properties
X       src/documentation

Performing status on external item at 'src/documentation':
+ echo Java-Home: /home/jenkins/tools/java/latest1.8
Java-Home: /home/jenkins/tools/java/latest1.8
+ ls -al /home/jenkins/tools/java/latest1.8/
total 51232
drwxrwxr-x  9 root root     4096 Jul  2  2020 .
drwxr-xr-x 39 root root     4096 Jan  2 19:01 ..
-r--r--r--  1 root root     1522 Apr  6  2020 ASSEMBLY_EXCEPTION
drwxrwxr-x  2 root root     4096 Jul  2  2020 bin
drwxrwxr-x 10 root root     4096 Jul  2  2020 demo
drwxrwxr-x  3 root root     4096 Jul  2  2020 include
drwxrwxr-x  4 root root     4096 Jul  2  2020 jre
drwxrwxr-x  3 root root     4096 Jul  2  2020 lib
-r--r--r--  1 root root    19274 Apr  6  2020 LICENSE
drwxrwxr-x  4 root root     4096 Jul  2  2020 man
-rw-rw-r--  1 root root      238 Apr  6  2020 release
drwxrwxr-x 10 root root     4096 Jul  2  2020 sample
-rw-rw-r--  1 root root 52236869 Apr  6  2020 src.zip
-r--r--r--  1 root root   153250 Apr  6  2020 THIRD_PARTY_README
+ ls -al /home/jenkins/tools/java/latest1.8/bin
total 748
drwxrwxr-x 2 root root   4096 Jul  2  2020 .
drwxrwxr-x 9 root root   4096 Jul  2  2020 ..
-rwxr-xr-x 1 root root   9065 Apr  6  2020 appletviewer
-rwxr-xr-x 1 root root   9073 Apr  6  2020 clhsdb
-rwxr-xr-x 1 root root   9065 Apr  6  2020 extcheck
-rwxr-xr-x 1 root root   9065 Apr  6  2020 hsdb
-rwxr-xr-x 1 root root   9057 Apr  6  2020 idlj
-rwxr-xr-x 1 root root   9057 Apr  6  2020 jar
-rwxr-xr-x 1 root root   9065 Apr  6  2020 jarsigner
-rwxr-xr-x 1 root root   8930 Apr  6  2020 java
-rwxr-xr-x 1 root root   9057 Apr  6  2020 javac
-rwxr-xr-x 1 root root   9065 Apr  6  2020 javadoc
-rwxr-xr-x 1 root root   9057 Apr  6  2020 javah
-rwxr-xr-x 1 root root   9057 Apr  6  2020 javap
-rwxrwxr-x 1 root root   2806 Apr  6  2020 java-rmi.cgi
-rwxr-xr-x 1 root root   9057 Apr  6  2020 jcmd
-rwxr-xr-x 1 root root   9089 Apr  6  2020 jconsole
-rwxr-xr-x 1 root root   9065 Apr  6  2020 jdb
-rwxr-xr-x 1 root root   9057 Apr  6  2020 jdeps
-rwxr-xr-x 1 root root   9057 Apr  6  2020 jhat
-rwxr-xr-x 1 root root   9097 Apr  6  2020 jinfo
-rwxr-xr-x 1 root root   9057 Apr  6  2020 jjs
-rwxr-xr-x 1 root root   9097 Apr  6  2020 jmap
-rwxr-xr-x 1 root root   9057 Apr  6  2020 jps
-rwxr-xr-x 1 root root   9065 Apr  6  2020 jrunscript
-rwxr-xr-x 1 root root   9073 Apr  6  2020 jsadebugd
-rwxr-xr-x 1 root root   9105 Apr  6  2020 jstack
-rwxr-xr-x 1 root root   9057 Apr  6  2020 jstat
-rwxr-xr-x 1 root root   9065 Apr  6  2020 jstatd
-rwxr-xr-x 1 root root   9065 Apr  6  2020 keytool
-rwxr-xr-x 1 root root   9065 Apr  6  2020 native2ascii
-rwxr-xr-x 1 root root   9105 Apr  6  2020 orbd
-rwxr-xr-x 1 root root   9065 Apr  6  2020 pack200
-rwxr-xr-x 1 root root   9065 Apr  6  2020 policytool
-rwxr-xr-x 1 root root   9057 Apr  6  2020 rmic
-rwxr-xr-x 1 root root   9057 Apr  6  2020 rmid
-rwxr-xr-x 1 root root   9065 Apr  6  2020 rmiregistry
-rwxr-xr-x 1 root root   9065 Apr  6  2020 schemagen
-rwxr-xr-x 1 root root   9065 Apr  6  2020 serialver
-rwxr-xr-x 1 root root   9065 Apr  6  2020 servertool
-rwxr-xr-x 1 root root   9113 Apr  6  2020 tnameserv
-rwxr-xr-x 1 root root 245802 Apr  6  2020 unpack200
-rwxr-xr-x 1 root root   9057 Apr  6  2020 wsgen
-rwxr-xr-x 1 root root   9065 Apr  6  2020 wsimport
-rwxr-xr-x 1 root root   9057 Apr  6  2020 xjc
+ /home/jenkins/tools/java/latest1.8/bin/java -version
openjdk version "1.8.0_252"
OpenJDK Runtime Environment (build 1.8.0_252-b09)
OpenJDK 64-Bit Server VM (build 25.252-b09, mixed mode)
+ echo which java
which java
+ which java
/home/jenkins/tools/java/latest1.8/bin/java
+ java -version
openjdk version "1.8.0_252"
OpenJDK Runtime Environment (build 1.8.0_252-b09)
OpenJDK 64-Bit Server VM (build 25.252-b09, mixed mode)
+ echo which javac
which javac
+ which javac
/home/jenkins/tools/java/latest1.8/bin/javac
+ javac -version
javac 1.8.0_252
+ echo Ant-Home:
Ant-Home:
+ ls -al
total 476
drwxr-xr-x 16 jenkins jenkins   4096 Jan 27 01:12 .
drwxr-xr-x  8 jenkins jenkins   4096 Jan  6 12:55 ..
drwxr-xr-x 30 jenkins jenkins   4096 Dec 31 01:13 build
-rw-r--r--  1 jenkins jenkins  14850 Jan 27 01:12 build.gradle
-rw-r--r--  1 jenkins jenkins    172 Dec 31 01:13 build.javacheck.xml
-rw-r--r--  1 jenkins jenkins 157398 Jan 27 01:12 build.xml
-rw-r--r--  1 jenkins jenkins   3345 Dec 31 01:12 .classpath
-rw-r--r--  1 jenkins jenkins   6325 Jan 27 01:12 doap_POI.rdf
-rw-r--r--  1 jenkins jenkins   2934 Jan 27 01:12 file-leak-detector.exclude
-rw-r--r--  1 jenkins jenkins   6229 Dec 31 01:12 forrest.properties
-rw-r--r--  1 jenkins jenkins     53 Dec 31 01:12 .gitattributes
drwxr-xr-x  3 jenkins jenkins   4096 Dec 31 01:12 .github
-rw-r--r--  1 jenkins jenkins    482 Dec 31 01:12 .gitignore
drwxr-xr-x  3 jenkins jenkins   4096 Dec 31 01:12 gradle
drwxr-xr-x  6 jenkins jenkins   4096 Dec 31 01:13 .gradle
-rwxr-xr-x  1 jenkins jenkins   5770 Jan 27 01:12 gradlew
-rw-r--r--  1 jenkins jenkins   3058 Jan 27 01:12 gradlew.bat
drwxr-xr-x  2 jenkins jenkins   4096 Dec 31 01:12 jenkins
-rw-r--r--  1 jenkins jenkins 167284 Dec 31 01:12 KEYS
drwxr-xr-x  2 jenkins jenkins   4096 Dec 31 01:12 legal
drwxr-xr-x  9 jenkins jenkins   4096 Dec 31 01:13 lib
drwxr-xr-x  2 jenkins jenkins   4096 Jan 27 01:12 maven
drwxr-xr-x  3 jenkins jenkins   4096 Jan 27 01:12 osgi
-rw-r--r--  1 jenkins jenkins   4813 Dec 31 01:12 patch.xml
-rw-r--r--  1 jenkins jenkins    426 Dec 31 01:12 .project
-rw-r--r--  1 jenkins jenkins   4278 Dec 31 01:12 README.rst
drwxr-xr-x  2 jenkins jenkins   4096 Dec 31 01:12 .settings
-rw-r--r--  1 jenkins jenkins    556 Dec 31 01:12 settings.gradle
drwxr-xr-x  9 jenkins jenkins   4096 Jan 27 01:12 sonar
drwxr-xr-x 16 jenkins jenkins   4096 Dec 31 01:12 src
drwxr-xr-x  4 jenkins jenkins   4096 Jan 27 01:13 .svn
drwxr-xr-x 15 jenkins jenkins   4096 Dec 31 01:12 test-data
-rw-r--r--  1 jenkins jenkins    419 Dec 31 01:12 .travis.yml
+ echo which ant
which ant
+ which ant
/usr/bin/ant
+ ant -version
Apache Ant(TM) version 1.10.5 compiled on March 28 2019
+ echo <project default="test"><target name="test"><echo>Java ${ant.java.version}/${java.version}</echo><exec executable="javac"><arg value="-version"/></exec></target></project>
+ ant -f build.javacheck.xml -v
Apache Ant(TM) version 1.10.5 compiled on March 28 2019
Buildfile: <https://ci-builds.apache.org/job/POI/job/POI-DSL-API-Check/ws/build.javacheck.xml>
Detected Java version: 1.8 in: /usr/local/asfpackages/java/openjdk-8u252-b09/jre
Detected OS: Linux
parsing buildfile <https://ci-builds.apache.org/job/POI/job/POI-DSL-API-Check/ws/build.javacheck.xml> with URI = <https://ci-builds.apache.org/job/POI/job/POI-DSL-API-Check/ws/build.javacheck.xml>
Project base dir set to: <https://ci-builds.apache.org/job/POI/job/POI-DSL-API-Check/ws/>
Build sequence for target(s) `test' is [test]
Complete build sequence is [test, ]

test:
parsing buildfile jar:file:/usr/share/ant/lib/ant.jar!/org/apache/tools/ant/antlib.xml with URI = jar:file:/usr/share/ant/lib/ant.jar!/org/apache/tools/ant/antlib.xml from a zip file
     [echo] Java 1.8/1.8.0_252
     [exec] Current OS is Linux
     [exec] Executing 'javac' with arguments:
     [exec] '-version'
     [exec]
     [exec] The ' characters around the executable and arguments are
     [exec] not part of the command.
     [exec] javac 1.8.0_252

BUILD SUCCESSFUL
Total time: 0 seconds
+ exit 0
[Gradle] - Launching build.
[POI-DSL-API-Check] $ <https://ci-builds.apache.org/job/POI/job/POI-DSL-API-Check/ws/gradlew> japicmp
Downloading https://services.gradle.org/distributions/gradle-6.8-bin.zip
..........10%..........20%..........30%...........40%..........50%..........60%..........70%...........80%..........90%..........100%
To honour the JVM settings for this build a single-use Daemon process will be forked. See https://docs.gradle.org/6.8/userguide/gradle_daemon.html#sec:disabling_the_daemon.
Daemon will be stopped at the end of the build

> Configure project :
Trying to override old definition of datatype junit

> Task :main:compileJava
Note: Some input files use or override a deprecated API.
Note: Recompile with -Xlint:deprecation for details.
Note: Some input files use unchecked or unsafe operations.
Note: Recompile with -Xlint:unchecked for details.

> Task :main:processResources
> Task :main:classes
> Task :main:jar
> Task :ooxml:ant-check-jars
> Task :ooxml:ant-fetch-jars
> Task :ooxml:ant-check-ooxml-jars
> Task :ooxml:ant-fetch-ooxml-jars

> Task :ooxml:ant-init
[ant:echo] Using Ant: Apache Ant(TM) version 1.10.9 compiled on September 27 2020 from ${ant.home}, Ant detected Java 1.8 (may be different than actual Java sometimes...)
[ant:echo] Using Java: 1.8.0_252/1.8.0_252-b09/25.252-b09/OpenJDK 64-Bit Server VM from Oracle Corporation on Linux: 4.15.0-108-generic
[ant:echo] Building Apache POI version 5.0.1-SNAPSHOT and RC: RC1

> Task :ooxml:ant-check-compiled-ooxml-xsds

> Task :ooxml:ant-compile-ooxml-xsds
SchemaCompiler  Metadata LOAD:org/apache/xmlbeans/metadata GEN:org/apache/poi/schemas/ooxml
Time to build schema type system: 2.145 seconds
Time to generate code: 5.999 seconds

> Task :scratchpad:compileJava
Note: Some input files use or override a deprecated API.
Note: Recompile with -Xlint:deprecation for details.
Note: Some input files use unchecked or unsafe operations.
Note: Recompile with -Xlint:unchecked for details.

> Task :scratchpad:processResources
> Task :scratchpad:classes
> Task :scratchpad:jar

> Task :ooxml:compileJava
Note: Some input files use or override a deprecated API.
Note: Recompile with -Xlint:deprecation for details.
Note: <https://ci-builds.apache.org/job/POI/job/POI-DSL-API-Check/ws/src/ooxml/java/org/apache/poi/xslf/draw/SVGImageRenderer.java> uses unchecked or unsafe operations.
Note: Recompile with -Xlint:unchecked for details.

> Task :ooxml:processResources
> Task :ooxml:classes
> Task :ooxml:jar
> Task :examples:compileJava
> Task :examples:processResources NO-SOURCE
> Task :examples:classes
> Task :examples:jar
> Task :examples:japicmp SKIPPED
> Task :excelant:compileJava
> Task :excelant:processResources
> Task :excelant:classes
> Task :excelant:jar
> Task :excelant:japicmp FAILED

FAILURE: Build failed with an exception.

* What went wrong:
Execution failed for task ':excelant:japicmp'.
> Failed to load file from jar 'META-INF/versions/9/module-info.class' as class file: invalid constant type: 19 at 3.

* Try:
Run with --stacktrace option to get the stack trace. Run with --info or --debug option to get more log output. Run with --scan to get full insights.

* Get more help at https://help.gradle.org

Deprecated Gradle features were used in this build, making it incompatible with Gradle 7.0.
Use '--warning-mode all' to show the individual deprecation warnings.
See https://docs.gradle.org/6.8/userguide/command_line_interface.html#sec:command_line_warnings

BUILD FAILED in 2m 15s
22 actionable tasks: 22 executed
Build step 'Invoke Gradle script' changed build result to FAILURE
Build step 'Invoke Gradle script' marked build as failure
Archiving artifacts
[Fast Archiver] Compressed 30.00 MB of artifacts by 98.6% relative to #90

---------------------------------------------------------------------
To unsubscribe, e-mail: [hidden email]
For additional commands, e-mail: [hidden email]

Reply | Threaded
Open this post in threaded view
|

Build failed in Jenkins: POI » POI-DSL-API-Check #99

Apache Jenkins Server
See <https://ci-builds.apache.org/job/POI/job/POI-DSL-API-Check/99/display/redirect?page=changes>

Changes:

[Andreas Beeker] Sonar fixes
add asserts to tests


------------------------------------------
[...truncated 240 B...]
LANG=en_US.UTF-8
FORREST_HOME=/home/jenkins/tools/forrest/latest

[EnvInject] - Variables injected successfully.
[EnvInject] - Injecting contributions.
Building remotely on H42 (ubuntu) in workspace <https://ci-builds.apache.org/job/POI/job/POI-DSL-API-Check/ws/>
[WS-CLEANUP] Deleting project workspace...
[WS-CLEANUP] Done
Updating https://svn.apache.org/repos/asf/poi/trunk at revision '2021-01-28T01:12:13.156 +0000'
U         src/ooxml/testcases/org/apache/poi/xssf/usermodel/TestXSSFRichTextString.java
U         src/ooxml/testcases/org/apache/poi/xssf/usermodel/TestXSSFSheet.java
U         src/ooxml/testcases/org/apache/poi/xssf/usermodel/TestXSSFSheetShiftRows.java
U         src/ooxml/testcases/org/apache/poi/xwpf/usermodel/TestXWPFStyles.java

<-- Got one external: forrest.properties, svn url: https://svn.apache.org/repos/asf/poi/site/forrest.properties -->
Fetching 'https://svn.apache.org/repos/asf/poi/site/forrest.properties' at -1 into '<https://ci-builds.apache.org/job/POI/job/POI-DSL-API-Check/ws/forrest.properties'>
At revision 1885956


<-- Got one external: documentation, svn url: https://svn.apache.org/repos/asf/poi/site/src/documentation -->
Fetching 'https://svn.apache.org/repos/asf/poi/site/src/documentation' at -1 into '<https://ci-builds.apache.org/job/POI/job/POI-DSL-API-Check/ws/src/documentation'>
At revision 1885956

At revision 1885956

No changes for https://svn.apache.org/repos/asf/poi/site/forrest.properties since the previous build
No changes for https://svn.apache.org/repos/asf/poi/site/src/documentation since the previous build
[POI-DSL-API-Check] $ /bin/sh -xe /tmp/jenkins6864185133263972079.sh
+ svn status
?       build.javacheck.xml
    X   forrest.properties
X       src/documentation

Performing status on external item at 'src/documentation':
+ echo Java-Home: /home/jenkins/tools/java/latest1.8
Java-Home: /home/jenkins/tools/java/latest1.8
+ ls -al /home/jenkins/tools/java/latest1.8/
total 51232
drwxrwxr-x  9 root root     4096 Jul  2  2020 .
drwxr-xr-x 39 root root     4096 Jan  2 19:01 ..
-r--r--r--  1 root root     1522 Apr  6  2020 ASSEMBLY_EXCEPTION
drwxrwxr-x  2 root root     4096 Jul  2  2020 bin
drwxrwxr-x 10 root root     4096 Jul  2  2020 demo
drwxrwxr-x  3 root root     4096 Jul  2  2020 include
drwxrwxr-x  4 root root     4096 Jul  2  2020 jre
drwxrwxr-x  3 root root     4096 Jul  2  2020 lib
-r--r--r--  1 root root    19274 Apr  6  2020 LICENSE
drwxrwxr-x  4 root root     4096 Jul  2  2020 man
-rw-rw-r--  1 root root      238 Apr  6  2020 release
drwxrwxr-x 10 root root     4096 Jul  2  2020 sample
-rw-rw-r--  1 root root 52236869 Apr  6  2020 src.zip
-r--r--r--  1 root root   153250 Apr  6  2020 THIRD_PARTY_README
+ ls -al /home/jenkins/tools/java/latest1.8/bin
total 748
drwxrwxr-x 2 root root   4096 Jul  2  2020 .
drwxrwxr-x 9 root root   4096 Jul  2  2020 ..
-rwxr-xr-x 1 root root   9065 Apr  6  2020 appletviewer
-rwxr-xr-x 1 root root   9073 Apr  6  2020 clhsdb
-rwxr-xr-x 1 root root   9065 Apr  6  2020 extcheck
-rwxr-xr-x 1 root root   9065 Apr  6  2020 hsdb
-rwxr-xr-x 1 root root   9057 Apr  6  2020 idlj
-rwxr-xr-x 1 root root   9057 Apr  6  2020 jar
-rwxr-xr-x 1 root root   9065 Apr  6  2020 jarsigner
-rwxr-xr-x 1 root root   8930 Apr  6  2020 java
-rwxr-xr-x 1 root root   9057 Apr  6  2020 javac
-rwxr-xr-x 1 root root   9065 Apr  6  2020 javadoc
-rwxr-xr-x 1 root root   9057 Apr  6  2020 javah
-rwxr-xr-x 1 root root   9057 Apr  6  2020 javap
-rwxrwxr-x 1 root root   2806 Apr  6  2020 java-rmi.cgi
-rwxr-xr-x 1 root root   9057 Apr  6  2020 jcmd
-rwxr-xr-x 1 root root   9089 Apr  6  2020 jconsole
-rwxr-xr-x 1 root root   9065 Apr  6  2020 jdb
-rwxr-xr-x 1 root root   9057 Apr  6  2020 jdeps
-rwxr-xr-x 1 root root   9057 Apr  6  2020 jhat
-rwxr-xr-x 1 root root   9097 Apr  6  2020 jinfo
-rwxr-xr-x 1 root root   9057 Apr  6  2020 jjs
-rwxr-xr-x 1 root root   9097 Apr  6  2020 jmap
-rwxr-xr-x 1 root root   9057 Apr  6  2020 jps
-rwxr-xr-x 1 root root   9065 Apr  6  2020 jrunscript
-rwxr-xr-x 1 root root   9073 Apr  6  2020 jsadebugd
-rwxr-xr-x 1 root root   9105 Apr  6  2020 jstack
-rwxr-xr-x 1 root root   9057 Apr  6  2020 jstat
-rwxr-xr-x 1 root root   9065 Apr  6  2020 jstatd
-rwxr-xr-x 1 root root   9065 Apr  6  2020 keytool
-rwxr-xr-x 1 root root   9065 Apr  6  2020 native2ascii
-rwxr-xr-x 1 root root   9105 Apr  6  2020 orbd
-rwxr-xr-x 1 root root   9065 Apr  6  2020 pack200
-rwxr-xr-x 1 root root   9065 Apr  6  2020 policytool
-rwxr-xr-x 1 root root   9057 Apr  6  2020 rmic
-rwxr-xr-x 1 root root   9057 Apr  6  2020 rmid
-rwxr-xr-x 1 root root   9065 Apr  6  2020 rmiregistry
-rwxr-xr-x 1 root root   9065 Apr  6  2020 schemagen
-rwxr-xr-x 1 root root   9065 Apr  6  2020 serialver
-rwxr-xr-x 1 root root   9065 Apr  6  2020 servertool
-rwxr-xr-x 1 root root   9113 Apr  6  2020 tnameserv
-rwxr-xr-x 1 root root 245802 Apr  6  2020 unpack200
-rwxr-xr-x 1 root root   9057 Apr  6  2020 wsgen
-rwxr-xr-x 1 root root   9065 Apr  6  2020 wsimport
-rwxr-xr-x 1 root root   9057 Apr  6  2020 xjc
+ /home/jenkins/tools/java/latest1.8/bin/java -version
openjdk version "1.8.0_252"
OpenJDK Runtime Environment (build 1.8.0_252-b09)
OpenJDK 64-Bit Server VM (build 25.252-b09, mixed mode)
+ echo which java
which java
+ which java
/home/jenkins/tools/java/latest1.8/bin/java
+ java -version
openjdk version "1.8.0_252"
OpenJDK Runtime Environment (build 1.8.0_252-b09)
OpenJDK 64-Bit Server VM (build 25.252-b09, mixed mode)
+ echo which javac
which javac
+ which javac
/home/jenkins/tools/java/latest1.8/bin/javac
+ javac -version
javac 1.8.0_252
+ echo Ant-Home:
Ant-Home:
+ ls -al
total 476
drwxr-xr-x 16 jenkins jenkins   4096 Jan 27 01:12 .
drwxr-xr-x  8 jenkins jenkins   4096 Jan  6 12:55 ..
drwxr-xr-x 30 jenkins jenkins   4096 Dec 31 01:13 build
-rw-r--r--  1 jenkins jenkins  14850 Jan 27 01:12 build.gradle
-rw-r--r--  1 jenkins jenkins    172 Jan 27 01:13 build.javacheck.xml
-rw-r--r--  1 jenkins jenkins 157398 Jan 27 01:12 build.xml
-rw-r--r--  1 jenkins jenkins   3345 Dec 31 01:12 .classpath
-rw-r--r--  1 jenkins jenkins   6325 Jan 27 01:12 doap_POI.rdf
-rw-r--r--  1 jenkins jenkins   2934 Jan 27 01:12 file-leak-detector.exclude
-rw-r--r--  1 jenkins jenkins   6229 Dec 31 01:12 forrest.properties
-rw-r--r--  1 jenkins jenkins     53 Dec 31 01:12 .gitattributes
drwxr-xr-x  3 jenkins jenkins   4096 Dec 31 01:12 .github
-rw-r--r--  1 jenkins jenkins    482 Dec 31 01:12 .gitignore
drwxr-xr-x  3 jenkins jenkins   4096 Dec 31 01:12 gradle
drwxr-xr-x  7 jenkins jenkins   4096 Jan 27 01:15 .gradle
-rwxr-xr-x  1 jenkins jenkins   5770 Jan 27 01:12 gradlew
-rw-r--r--  1 jenkins jenkins   3058 Jan 27 01:12 gradlew.bat
drwxr-xr-x  2 jenkins jenkins   4096 Dec 31 01:12 jenkins
-rw-r--r--  1 jenkins jenkins 167284 Dec 31 01:12 KEYS
drwxr-xr-x  2 jenkins jenkins   4096 Dec 31 01:12 legal
drwxr-xr-x  9 jenkins jenkins   4096 Dec 31 01:13 lib
drwxr-xr-x  2 jenkins jenkins   4096 Jan 27 01:12 maven
drwxr-xr-x  3 jenkins jenkins   4096 Jan 27 01:12 osgi
-rw-r--r--  1 jenkins jenkins   4813 Dec 31 01:12 patch.xml
-rw-r--r--  1 jenkins jenkins    426 Dec 31 01:12 .project
-rw-r--r--  1 jenkins jenkins   4278 Dec 31 01:12 README.rst
drwxr-xr-x  2 jenkins jenkins   4096 Dec 31 01:12 .settings
-rw-r--r--  1 jenkins jenkins    556 Dec 31 01:12 settings.gradle
drwxr-xr-x  9 jenkins jenkins   4096 Jan 27 01:12 sonar
drwxr-xr-x 16 jenkins jenkins   4096 Dec 31 01:12 src
drwxr-xr-x  4 jenkins jenkins   4096 Jan 28 01:12 .svn
drwxr-xr-x 15 jenkins jenkins   4096 Dec 31 01:12 test-data
-rw-r--r--  1 jenkins jenkins    419 Dec 31 01:12 .travis.yml
+ echo which ant
which ant
+ which ant
/usr/bin/ant
+ ant -version
Apache Ant(TM) version 1.10.5 compiled on March 28 2019
+ echo <project default="test"><target name="test"><echo>Java ${ant.java.version}/${java.version}</echo><exec executable="javac"><arg value="-version"/></exec></target></project>
+ ant -f build.javacheck.xml -v
Apache Ant(TM) version 1.10.5 compiled on March 28 2019
Buildfile: <https://ci-builds.apache.org/job/POI/job/POI-DSL-API-Check/ws/build.javacheck.xml>
Detected Java version: 1.8 in: /usr/local/asfpackages/java/openjdk-8u252-b09/jre
Detected OS: Linux
parsing buildfile <https://ci-builds.apache.org/job/POI/job/POI-DSL-API-Check/ws/build.javacheck.xml> with URI = <https://ci-builds.apache.org/job/POI/job/POI-DSL-API-Check/ws/build.javacheck.xml>
Project base dir set to: <https://ci-builds.apache.org/job/POI/job/POI-DSL-API-Check/ws/>
Build sequence for target(s) `test' is [test]
Complete build sequence is [test, ]

test:
parsing buildfile jar:file:/usr/share/ant/lib/ant.jar!/org/apache/tools/ant/antlib.xml with URI = jar:file:/usr/share/ant/lib/ant.jar!/org/apache/tools/ant/antlib.xml from a zip file
     [echo] Java 1.8/1.8.0_252
     [exec] Current OS is Linux
     [exec] Executing 'javac' with arguments:
     [exec] '-version'
     [exec]
     [exec] The ' characters around the executable and arguments are
     [exec] not part of the command.
     [exec] javac 1.8.0_252

BUILD SUCCESSFUL
Total time: 0 seconds
+ exit 0
[Gradle] - Launching build.
[POI-DSL-API-Check] $ <https://ci-builds.apache.org/job/POI/job/POI-DSL-API-Check/ws/gradlew> japicmp
To honour the JVM settings for this build a single-use Daemon process will be forked. See https://docs.gradle.org/6.8/userguide/gradle_daemon.html#sec:disabling_the_daemon.
Daemon will be stopped at the end of the build

> Configure project :
Trying to override old definition of datatype junit

> Task :main:compileJava UP-TO-DATE
> Task :main:processResources UP-TO-DATE
> Task :main:classes UP-TO-DATE
> Task :main:jar UP-TO-DATE
> Task :ooxml:ant-check-jars
> Task :ooxml:ant-fetch-jars
> Task :ooxml:ant-check-ooxml-jars
> Task :ooxml:ant-fetch-ooxml-jars

> Task :ooxml:ant-init
[ant:echo] Using Ant: Apache Ant(TM) version 1.10.9 compiled on September 27 2020 from ${ant.home}, Ant detected Java 1.8 (may be different than actual Java sometimes...)
[ant:echo] Using Java: 1.8.0_252/1.8.0_252-b09/25.252-b09/OpenJDK 64-Bit Server VM from Oracle Corporation on Linux: 4.15.0-108-generic
[ant:echo] Building Apache POI version 5.0.1-SNAPSHOT and RC: RC1

> Task :ooxml:ant-check-compiled-ooxml-xsds
> Task :ooxml:ant-compile-ooxml-xsds
> Task :scratchpad:compileJava UP-TO-DATE
> Task :scratchpad:processResources UP-TO-DATE
> Task :scratchpad:classes UP-TO-DATE
> Task :scratchpad:jar UP-TO-DATE
> Task :ooxml:compileJava UP-TO-DATE
> Task :ooxml:processResources UP-TO-DATE
> Task :ooxml:classes UP-TO-DATE
> Task :ooxml:jar UP-TO-DATE
> Task :examples:compileJava UP-TO-DATE
> Task :examples:processResources NO-SOURCE
> Task :examples:classes UP-TO-DATE
> Task :examples:jar UP-TO-DATE
> Task :examples:japicmp SKIPPED
> Task :excelant:compileJava UP-TO-DATE
> Task :excelant:processResources UP-TO-DATE
> Task :excelant:classes UP-TO-DATE
> Task :excelant:jar UP-TO-DATE
> Task :excelant:japicmp FAILED

FAILURE: Build failed with an exception.

* What went wrong:
Execution failed for task ':excelant:japicmp'.
> Failed to load file from jar 'META-INF/versions/9/module-info.class' as class file: invalid constant type: 19 at 3.

* Try:
Run with --stacktrace option to get the stack trace. Run with --info or --debug option to get more log output. Run with --scan to get full insights.

* Get more help at https://help.gradle.org

Deprecated Gradle features were used in this build, making it incompatible with Gradle 7.0.
Use '--warning-mode all' to show the individual deprecation warnings.
See https://docs.gradle.org/6.8/userguide/command_line_interface.html#sec:command_line_warnings

BUILD FAILED in 15s
22 actionable tasks: 8 executed, 14 up-to-date
Build step 'Invoke Gradle script' changed build result to FAILURE
Build step 'Invoke Gradle script' marked build as failure
Archiving artifacts
[Fast Archiver] Compressed 30.00 MB of artifacts by 98.6% relative to #90

---------------------------------------------------------------------
To unsubscribe, e-mail: [hidden email]
For additional commands, e-mail: [hidden email]

Reply | Threaded
Open this post in threaded view
|

Build failed in Jenkins: POI » POI-DSL-API-Check #100

Apache Jenkins Server
See <https://ci-builds.apache.org/job/POI/job/POI-DSL-API-Check/100/display/redirect?page=changes>

Changes:

[Andreas Beeker] Sonar fixes
add asserts to tests

[Dominik Stadler] Bug 65099: Fix incorrect handling of styles in XWPFStyle.getUsedStyleList

Closes github #216

[Dominik Stadler] Adjust integration-test slightly for running mass-regression-tests

[Dominik Stadler] Apply IDE suggestions, add toString(), adjust JavaDoc and simplify code slightly

[Dominik Stadler] Enable storing an SXSSF workbook twice

Verify this via a unit-test for all types of workbooks
Add a test to verify the contents is byte-for-byte equal
Also remove an overwritten test which works the same now for all three workbook-types


------------------------------------------
[...truncated 3.97 KB...]
At revision 1886074


<-- Got one external: documentation, svn url: https://svn.apache.org/repos/asf/poi/site/src/documentation -->
Fetching 'https://svn.apache.org/repos/asf/poi/site/src/documentation' at -1 into '<https://ci-builds.apache.org/job/POI/job/POI-DSL-API-Check/ws/src/documentation'>
At revision 1886074

At revision 1886074

No changes for https://svn.apache.org/repos/asf/poi/site/forrest.properties since the previous build
No changes for https://svn.apache.org/repos/asf/poi/site/src/documentation since the previous build
[POI-DSL-API-Check] $ /bin/sh -xe /tmp/jenkins3403119345729689497.sh
+ svn status
?       build.javacheck.xml
    X   forrest.properties
X       src/documentation

Performing status on external item at 'src/documentation':
+ echo Java-Home: /home/jenkins/tools/java/latest1.8
Java-Home: /home/jenkins/tools/java/latest1.8
+ ls -al /home/jenkins/tools/java/latest1.8/
total 25824
drwxr-xr-x  8 root root     4096 Jan 29 21:12 .
drwxr-xr-x 40 root root     4096 Jan 29 21:12 ..
drwxr-xr-x  2 root root     4096 Jan 29 21:12 bin
-r--r--r--  1 root root     3244 Dec  9 12:47 COPYRIGHT
drwxr-xr-x  3 root root     4096 Jan 29 21:12 include
-rw-r--r--  1 root root  5226870 Dec  9 10:15 javafx-src.zip
-rw-r--r--  1 root root      195 Dec  9 12:47 jmc.txt
drwxr-xr-x  6 root root     4096 Jan 29 21:12 jre
drwxr-xr-x  4 root root     4096 Jan 29 21:12 legal
drwxr-xr-x  4 root root     4096 Jan 29 21:12 lib
-r--r--r--  1 root root       44 Dec  9 12:47 LICENSE
drwxr-xr-x  4 root root     4096 Jan 29 21:12 man
-r--r--r--  1 root root      159 Dec  9 12:47 README.html
-rw-r--r--  1 root root      424 Dec  9 12:47 release
-rw-r--r--  1 root root 21147701 Dec  9 12:47 src.zip
-rw-r--r--  1 root root      190 Dec  9 10:15 THIRDPARTYLICENSEREADME-JAVAFX.txt
-r--r--r--  1 root root      190 Dec  9 12:47 THIRDPARTYLICENSEREADME.txt
+ ls -al /home/jenkins/tools/java/latest1.8/bin
total 836
drwxr-xr-x 2 root root   4096 Jan 29 21:12 .
drwxr-xr-x 8 root root   4096 Jan 29 21:12 ..
-rwxr-xr-x 1 root root   8840 Dec  9 12:47 appletviewer
lrwxrwxrwx 1 root root      8 Dec  9 12:47 ControlPanel -> jcontrol
-rwxr-xr-x 1 root root   8832 Dec  9 12:47 extcheck
-rwxr-xr-x 1 root root   8832 Dec  9 12:47 idlj
-rwxr-xr-x 1 root root   8832 Dec  9 12:47 jar
-rwxr-xr-x 1 root root   8832 Dec  9 12:47 jarsigner
-rwxr-xr-x 1 root root   8712 Dec  9 12:47 java
-rwxr-xr-x 1 root root   8832 Dec  9 12:47 javac
-rwxr-xr-x 1 root root   8832 Dec  9 12:47 javadoc
-rwxr-xr-x 1 root root   2293 Dec  9 10:15 javafxpackager
-rwxr-xr-x 1 root root   8832 Dec  9 12:47 javah
-rwxr-xr-x 1 root root   8832 Dec  9 12:47 javap
-rwxr-xr-x 1 root root   2293 Dec  9 10:15 javapackager
-rwxr-xr-x 1 root root   1809 Dec  9 12:47 java-rmi.cgi
-rwxr-xr-x 1 root root 148896 Dec  9 12:47 javaws
-rwxr-xr-x 1 root root   8832 Dec  9 12:47 jcmd
-rwxr-xr-x 1 root root   8856 Dec  9 12:47 jconsole
-rwxr-xr-x 1 root root   6264 Dec  9 12:47 jcontrol
-rwxr-xr-x 1 root root   8848 Dec  9 12:47 jdb
-rwxr-xr-x 1 root root   8832 Dec  9 12:47 jdeps
-rwxr-xr-x 1 root root   8832 Dec  9 12:47 jhat
-rwxr-xr-x 1 root root   8896 Dec  9 12:47 jinfo
-rwxr-xr-x 1 root root   8832 Dec  9 12:47 jjs
-rwxr-xr-x 1 root root   8896 Dec  9 12:47 jmap
-rwxr-xr-x 1 root root   8832 Dec  9 12:47 jps
-rwxr-xr-x 1 root root   8840 Dec  9 12:47 jrunscript
-rwxr-xr-x 1 root root   8848 Dec  9 12:47 jsadebugd
-rwxr-xr-x 1 root root   8896 Dec  9 12:47 jstack
-rwxr-xr-x 1 root root   8832 Dec  9 12:47 jstat
-rwxr-xr-x 1 root root   8832 Dec  9 12:47 jstatd
-rwxr-xr-x 1 root root   5110 Jan 14  2017 jvisualvm
-rwxr-xr-x 1 root root   8832 Dec  9 12:47 keytool
-rwxr-xr-x 1 root root   8840 Dec  9 12:47 native2ascii
-rwxr-xr-x 1 root root   8904 Dec  9 12:47 orbd
-rwxr-xr-x 1 root root   8832 Dec  9 12:47 pack200
-rwxr-xr-x 1 root root   8840 Dec  9 12:47 policytool
-rwxr-xr-x 1 root root   8832 Dec  9 12:47 rmic
-rwxr-xr-x 1 root root   8832 Dec  9 12:47 rmid
-rwxr-xr-x 1 root root   8840 Dec  9 12:47 rmiregistry
-rwxr-xr-x 1 root root   8832 Dec  9 12:47 schemagen
-rwxr-xr-x 1 root root   8832 Dec  9 12:47 serialver
-rwxr-xr-x 1 root root   8840 Dec  9 12:47 servertool
-rwxr-xr-x 1 root root   8904 Dec  9 12:47 tnameserv
-rwxr-xr-x 1 root root 186960 Dec  9 12:47 unpack200
-rwxr-xr-x 1 root root   8832 Dec  9 12:47 wsgen
-rwxr-xr-x 1 root root   8832 Dec  9 12:47 wsimport
-rwxr-xr-x 1 root root   8832 Dec  9 12:47 xjc
+ /home/jenkins/tools/java/latest1.8/bin/java -version
java version "1.8.0_281"
Java(TM) SE Runtime Environment (build 1.8.0_281-b09)
Java HotSpot(TM) 64-Bit Server VM (build 25.281-b09, mixed mode)
+ echo which java
which java
+ which java
/home/jenkins/tools/java/latest1.8/bin/java
+ java -version
java version "1.8.0_281"
Java(TM) SE Runtime Environment (build 1.8.0_281-b09)
Java HotSpot(TM) 64-Bit Server VM (build 25.281-b09, mixed mode)
+ echo which javac
which javac
+ which javac
/home/jenkins/tools/java/latest1.8/bin/javac
+ javac -version
javac 1.8.0_281
+ echo Ant-Home:
Ant-Home:
+ ls -al
total 476
drwxr-xr-x 16 jenkins jenkins   4096 Jan 19 01:12 .
drwxr-xr-x  8 jenkins jenkins   4096 Jan 18 20:41 ..
drwxr-xr-x 30 jenkins jenkins   4096 Nov 12 01:14 build
-rw-r--r--  1 jenkins jenkins  14850 Jan 19 01:12 build.gradle
-rw-r--r--  1 jenkins jenkins    172 Jan 25 01:12 build.javacheck.xml
-rw-r--r--  1 jenkins jenkins 157398 Jan 24 01:12 build.xml
-rw-r--r--  1 jenkins jenkins   3345 Dec 18 01:12 .classpath
-rw-r--r--  1 jenkins jenkins   6325 Jan 18 01:12 doap_POI.rdf
-rw-r--r--  1 jenkins jenkins   2934 Jan  9 01:12 file-leak-detector.exclude
-rw-r--r--  1 jenkins jenkins   6229 Nov 12 01:13 forrest.properties
-rw-r--r--  1 jenkins jenkins     53 Nov 12 01:13 .gitattributes
drwxr-xr-x  3 jenkins jenkins   4096 Dec 21 01:12 .github
-rw-r--r--  1 jenkins jenkins    482 Dec 13 19:13 .gitignore
drwxr-xr-x  3 jenkins jenkins   4096 Nov 12 01:13 gradle
drwxr-xr-x  8 jenkins jenkins   4096 Jan 19 01:13 .gradle
-rwxr-xr-x  1 jenkins jenkins   5770 Jan 19 01:12 gradlew
-rw-r--r--  1 jenkins jenkins   3058 Jan 19 01:12 gradlew.bat
drwxr-xr-x  2 jenkins jenkins   4096 Jan  6 01:15 jenkins
-rw-r--r--  1 jenkins jenkins 167284 Nov 12 01:13 KEYS
drwxr-xr-x  2 jenkins jenkins   4096 Nov 12 01:13 legal
drwxr-xr-x  9 jenkins jenkins   4096 Nov 12 01:14 lib
drwxr-xr-x  2 jenkins jenkins   4096 Jan 14 01:12 maven
drwxr-xr-x  3 jenkins jenkins   4096 Jan 18 01:12 osgi
-rw-r--r--  1 jenkins jenkins   4813 Nov 12 01:13 patch.xml
-rw-r--r--  1 jenkins jenkins    426 Nov 12 01:13 .project
-rw-r--r--  1 jenkins jenkins   4278 Dec 13 19:13 README.rst
drwxr-xr-x  2 jenkins jenkins   4096 Nov 12 01:13 .settings
-rw-r--r--  1 jenkins jenkins    556 Nov 12 01:13 settings.gradle
drwxr-xr-x  9 jenkins jenkins   4096 Jan 14 01:12 sonar
drwxr-xr-x 16 jenkins jenkins   4096 Nov 12 01:14 src
drwxr-xr-x  4 jenkins jenkins   4096 Jan 31 01:12 .svn
drwxr-xr-x 15 jenkins jenkins   4096 Jan  6 01:15 test-data
-rw-r--r--  1 jenkins jenkins    419 Dec  8 01:12 .travis.yml
+ echo which ant
which ant
+ which ant
/usr/bin/ant
+ ant -version
Apache Ant(TM) version 1.10.5 compiled on March 28 2019
+ echo <project default="test"><target name="test"><echo>Java ${ant.java.version}/${java.version}</echo><exec executable="javac"><arg value="-version"/></exec></target></project>
+ ant -f build.javacheck.xml -v
Apache Ant(TM) version 1.10.5 compiled on March 28 2019
Buildfile: <https://ci-builds.apache.org/job/POI/job/POI-DSL-API-Check/ws/build.javacheck.xml>
Detected Java version: 1.8 in: /usr/local/asfpackages/java/oraclejdk-1.8.0-281/jre
Detected OS: Linux
parsing buildfile <https://ci-builds.apache.org/job/POI/job/POI-DSL-API-Check/ws/build.javacheck.xml> with URI = <https://ci-builds.apache.org/job/POI/job/POI-DSL-API-Check/ws/build.javacheck.xml>
Project base dir set to: <https://ci-builds.apache.org/job/POI/job/POI-DSL-API-Check/ws/>
Build sequence for target(s) `test' is [test]
Complete build sequence is [test, ]

test:
parsing buildfile jar:file:/usr/share/ant/lib/ant.jar!/org/apache/tools/ant/antlib.xml with URI = jar:file:/usr/share/ant/lib/ant.jar!/org/apache/tools/ant/antlib.xml from a zip file
     [echo] Java 1.8/1.8.0_281
     [exec] Current OS is Linux
     [exec] Executing 'javac' with arguments:
     [exec] '-version'
     [exec]
     [exec] The ' characters around the executable and arguments are
     [exec] not part of the command.
     [exec] javac 1.8.0_281

BUILD SUCCESSFUL
Total time: 0 seconds
+ exit 0
[Gradle] - Launching build.
[POI-DSL-API-Check] $ <https://ci-builds.apache.org/job/POI/job/POI-DSL-API-Check/ws/gradlew> japicmp
To honour the JVM settings for this build a single-use Daemon process will be forked. See https://docs.gradle.org/6.8/userguide/gradle_daemon.html#sec:disabling_the_daemon.
Daemon will be stopped at the end of the build

> Configure project :
Trying to override old definition of datatype junit

> Task :main:compileJava
Note: Some input files use or override a deprecated API.
Note: Recompile with -Xlint:deprecation for details.

> Task :main:processResources UP-TO-DATE
> Task :main:classes
> Task :main:jar UP-TO-DATE
> Task :ooxml:ant-check-jars
> Task :ooxml:ant-fetch-jars
> Task :ooxml:ant-check-ooxml-jars
> Task :ooxml:ant-fetch-ooxml-jars

> Task :ooxml:ant-init
[ant:echo] Using Ant: Apache Ant(TM) version 1.10.9 compiled on September 27 2020 from ${ant.home}, Ant detected Java 1.8 (may be different than actual Java sometimes...)
[ant:echo] Using Java: 1.8.0_281/1.8.0_281-b09/25.281-b09/Java HotSpot(TM) 64-Bit Server VM from Oracle Corporation on Linux: 4.15.0-58-generic
[ant:echo] Building Apache POI version 5.0.1-SNAPSHOT and RC: RC1

> Task :ooxml:ant-check-compiled-ooxml-xsds
> Task :ooxml:ant-compile-ooxml-xsds
> Task :scratchpad:compileJava UP-TO-DATE
> Task :scratchpad:processResources UP-TO-DATE
> Task :scratchpad:classes UP-TO-DATE
> Task :scratchpad:jar UP-TO-DATE

> Task :ooxml:compileJava
Note: Some input files use or override a deprecated API.
Note: Recompile with -Xlint:deprecation for details.
Note: <https://ci-builds.apache.org/job/POI/job/POI-DSL-API-Check/ws/src/ooxml/java/org/apache/poi/xslf/draw/SVGImageRenderer.java> uses unchecked or unsafe operations.
Note: Recompile with -Xlint:unchecked for details.

> Task :ooxml:processResources UP-TO-DATE
> Task :ooxml:classes
> Task :ooxml:jar
> Task :examples:compileJava
> Task :examples:processResources NO-SOURCE
> Task :examples:classes
> Task :examples:jar UP-TO-DATE
> Task :examples:japicmp SKIPPED
> Task :excelant:compileJava
> Task :excelant:processResources UP-TO-DATE
> Task :excelant:classes
> Task :excelant:jar UP-TO-DATE
> Task :excelant:japicmp FAILED

FAILURE: Build failed with an exception.

* What went wrong:
Execution failed for task ':excelant:japicmp'.
> Failed to load file from jar 'META-INF/versions/9/module-info.class' as class file: invalid constant type: 19 at 3.

* Try:
Run with --stacktrace option to get the stack trace. Run with --info or --debug option to get more log output. Run with --scan to get full insights.

* Get more help at https://help.gradle.org

Deprecated Gradle features were used in this build, making it incompatible with Gradle 7.0.
Use '--warning-mode all' to show the individual deprecation warnings.
See https://docs.gradle.org/6.8/userguide/command_line_interface.html#sec:command_line_warnings

BUILD FAILED in 39s
22 actionable tasks: 13 executed, 9 up-to-date
Build step 'Invoke Gradle script' changed build result to FAILURE
Build step 'Invoke Gradle script' marked build as failure
Archiving artifacts
[Fast Archiver] Compressed 29.34 MB of artifacts by 99.2% relative to #90

---------------------------------------------------------------------
To unsubscribe, e-mail: [hidden email]
For additional commands, e-mail: [hidden email]

Reply | Threaded
Open this post in threaded view
|

Build failed in Jenkins: POI » POI-DSL-API-Check #101

Apache Jenkins Server
See <https://ci-builds.apache.org/job/POI/job/POI-DSL-API-Check/101/display/redirect?page=changes>

Changes:

[Marius Volkhart] Fix inconsistent logging statement

The conditions check for max, but the logging was copy/pasted and still uses the minimum.

[Alain Béarez] Bugfixes for XDDF charts

[Alain Béarez] Clone only content of imported chart


------------------------------------------
[...truncated 1.12 KB...]

<-- Got one external: forrest.properties, svn url: https://svn.apache.org/repos/asf/poi/site/forrest.properties -->
Fetching 'https://svn.apache.org/repos/asf/poi/site/forrest.properties' at -1 into '<https://ci-builds.apache.org/job/POI/job/POI-DSL-API-Check/ws/forrest.properties'>
At revision 1886089


<-- Got one external: documentation, svn url: https://svn.apache.org/repos/asf/poi/site/src/documentation -->
Fetching 'https://svn.apache.org/repos/asf/poi/site/src/documentation' at -1 into '<https://ci-builds.apache.org/job/POI/job/POI-DSL-API-Check/ws/src/documentation'>
U         src/documentation/content/xdocs/changes.xml
At revision 1886089

At revision 1886089

No changes for https://svn.apache.org/repos/asf/poi/site/forrest.properties since the previous build
[POI-DSL-API-Check] $ /bin/sh -xe /tmp/jenkins757810302962407960.sh
+ svn status
?       build.javacheck.xml
    X   forrest.properties
X       src/documentation

Performing status on external item at 'src/documentation':
+ echo Java-Home: /home/jenkins/tools/java/latest1.8
Java-Home: /home/jenkins/tools/java/latest1.8
+ ls -al /home/jenkins/tools/java/latest1.8/
total 25824
drwxr-xr-x  8 root root     4096 Jan 29 21:12 .
drwxr-xr-x 40 root root     4096 Jan 29 21:12 ..
drwxr-xr-x  2 root root     4096 Jan 29 21:12 bin
-r--r--r--  1 root root     3244 Dec  9 12:47 COPYRIGHT
drwxr-xr-x  3 root root     4096 Jan 29 21:12 include
-rw-r--r--  1 root root  5226870 Dec  9 10:15 javafx-src.zip
-rw-r--r--  1 root root      195 Dec  9 12:47 jmc.txt
drwxr-xr-x  6 root root     4096 Jan 29 21:12 jre
drwxr-xr-x  4 root root     4096 Jan 29 21:12 legal
drwxr-xr-x  4 root root     4096 Jan 29 21:12 lib
-r--r--r--  1 root root       44 Dec  9 12:47 LICENSE
drwxr-xr-x  4 root root     4096 Jan 29 21:12 man
-r--r--r--  1 root root      159 Dec  9 12:47 README.html
-rw-r--r--  1 root root      424 Dec  9 12:47 release
-rw-r--r--  1 root root 21147701 Dec  9 12:47 src.zip
-rw-r--r--  1 root root      190 Dec  9 10:15 THIRDPARTYLICENSEREADME-JAVAFX.txt
-r--r--r--  1 root root      190 Dec  9 12:47 THIRDPARTYLICENSEREADME.txt
+ ls -al /home/jenkins/tools/java/latest1.8/bin
total 836
drwxr-xr-x 2 root root   4096 Jan 29 21:12 .
drwxr-xr-x 8 root root   4096 Jan 29 21:12 ..
-rwxr-xr-x 1 root root   8840 Dec  9 12:47 appletviewer
lrwxrwxrwx 1 root root      8 Dec  9 12:47 ControlPanel -> jcontrol
-rwxr-xr-x 1 root root   8832 Dec  9 12:47 extcheck
-rwxr-xr-x 1 root root   8832 Dec  9 12:47 idlj
-rwxr-xr-x 1 root root   8832 Dec  9 12:47 jar
-rwxr-xr-x 1 root root   8832 Dec  9 12:47 jarsigner
-rwxr-xr-x 1 root root   8712 Dec  9 12:47 java
-rwxr-xr-x 1 root root   8832 Dec  9 12:47 javac
-rwxr-xr-x 1 root root   8832 Dec  9 12:47 javadoc
-rwxr-xr-x 1 root root   2293 Dec  9 10:15 javafxpackager
-rwxr-xr-x 1 root root   8832 Dec  9 12:47 javah
-rwxr-xr-x 1 root root   8832 Dec  9 12:47 javap
-rwxr-xr-x 1 root root   2293 Dec  9 10:15 javapackager
-rwxr-xr-x 1 root root   1809 Dec  9 12:47 java-rmi.cgi
-rwxr-xr-x 1 root root 148896 Dec  9 12:47 javaws
-rwxr-xr-x 1 root root   8832 Dec  9 12:47 jcmd
-rwxr-xr-x 1 root root   8856 Dec  9 12:47 jconsole
-rwxr-xr-x 1 root root   6264 Dec  9 12:47 jcontrol
-rwxr-xr-x 1 root root   8848 Dec  9 12:47 jdb
-rwxr-xr-x 1 root root   8832 Dec  9 12:47 jdeps
-rwxr-xr-x 1 root root   8832 Dec  9 12:47 jhat
-rwxr-xr-x 1 root root   8896 Dec  9 12:47 jinfo
-rwxr-xr-x 1 root root   8832 Dec  9 12:47 jjs
-rwxr-xr-x 1 root root   8896 Dec  9 12:47 jmap
-rwxr-xr-x 1 root root   8832 Dec  9 12:47 jps
-rwxr-xr-x 1 root root   8840 Dec  9 12:47 jrunscript
-rwxr-xr-x 1 root root   8848 Dec  9 12:47 jsadebugd
-rwxr-xr-x 1 root root   8896 Dec  9 12:47 jstack
-rwxr-xr-x 1 root root   8832 Dec  9 12:47 jstat
-rwxr-xr-x 1 root root   8832 Dec  9 12:47 jstatd
-rwxr-xr-x 1 root root   5110 Jan 14  2017 jvisualvm
-rwxr-xr-x 1 root root   8832 Dec  9 12:47 keytool
-rwxr-xr-x 1 root root   8840 Dec  9 12:47 native2ascii
-rwxr-xr-x 1 root root   8904 Dec  9 12:47 orbd
-rwxr-xr-x 1 root root   8832 Dec  9 12:47 pack200
-rwxr-xr-x 1 root root   8840 Dec  9 12:47 policytool
-rwxr-xr-x 1 root root   8832 Dec  9 12:47 rmic
-rwxr-xr-x 1 root root   8832 Dec  9 12:47 rmid
-rwxr-xr-x 1 root root   8840 Dec  9 12:47 rmiregistry
-rwxr-xr-x 1 root root   8832 Dec  9 12:47 schemagen
-rwxr-xr-x 1 root root   8832 Dec  9 12:47 serialver
-rwxr-xr-x 1 root root   8840 Dec  9 12:47 servertool
-rwxr-xr-x 1 root root   8904 Dec  9 12:47 tnameserv
-rwxr-xr-x 1 root root 186960 Dec  9 12:47 unpack200
-rwxr-xr-x 1 root root   8832 Dec  9 12:47 wsgen
-rwxr-xr-x 1 root root   8832 Dec  9 12:47 wsimport
-rwxr-xr-x 1 root root   8832 Dec  9 12:47 xjc
+ /home/jenkins/tools/java/latest1.8/bin/java -version
java version "1.8.0_281"
Java(TM) SE Runtime Environment (build 1.8.0_281-b09)
Java HotSpot(TM) 64-Bit Server VM (build 25.281-b09, mixed mode)
+ echo which java
which java
+ which java
/home/jenkins/tools/java/latest1.8/bin/java
+ java -version
java version "1.8.0_281"
Java(TM) SE Runtime Environment (build 1.8.0_281-b09)
Java HotSpot(TM) 64-Bit Server VM (build 25.281-b09, mixed mode)
+ echo which javac
which javac
+ which javac
/home/jenkins/tools/java/latest1.8/bin/javac
+ javac -version
javac 1.8.0_281
+ echo Ant-Home:
Ant-Home:
+ ls -al
total 476
drwxr-xr-x 16 jenkins jenkins   4096 Jan 19 01:12 .
drwxr-xr-x  8 jenkins jenkins   4096 Jan 18 20:41 ..
drwxr-xr-x 30 jenkins jenkins   4096 Nov 12 01:14 build
-rw-r--r--  1 jenkins jenkins  14850 Jan 19 01:12 build.gradle
-rw-r--r--  1 jenkins jenkins    172 Jan 31 01:12 build.javacheck.xml
-rw-r--r--  1 jenkins jenkins 157398 Jan 24 01:12 build.xml
-rw-r--r--  1 jenkins jenkins   3345 Dec 18 01:12 .classpath
-rw-r--r--  1 jenkins jenkins   6325 Jan 18 01:12 doap_POI.rdf
-rw-r--r--  1 jenkins jenkins   2934 Jan  9 01:12 file-leak-detector.exclude
-rw-r--r--  1 jenkins jenkins   6229 Nov 12 01:13 forrest.properties
-rw-r--r--  1 jenkins jenkins     53 Nov 12 01:13 .gitattributes
drwxr-xr-x  3 jenkins jenkins   4096 Dec 21 01:12 .github
-rw-r--r--  1 jenkins jenkins    482 Dec 13 19:13 .gitignore
drwxr-xr-x  3 jenkins jenkins   4096 Nov 12 01:13 gradle
drwxr-xr-x  7 jenkins jenkins   4096 Jan 31 01:13 .gradle
-rwxr-xr-x  1 jenkins jenkins   5770 Jan 19 01:12 gradlew
-rw-r--r--  1 jenkins jenkins   3058 Jan 19 01:12 gradlew.bat
drwxr-xr-x  2 jenkins jenkins   4096 Jan  6 01:15 jenkins
-rw-r--r--  1 jenkins jenkins 167284 Nov 12 01:13 KEYS
drwxr-xr-x  2 jenkins jenkins   4096 Nov 12 01:13 legal
drwxr-xr-x  9 jenkins jenkins   4096 Nov 12 01:14 lib
drwxr-xr-x  2 jenkins jenkins   4096 Jan 14 01:12 maven
drwxr-xr-x  3 jenkins jenkins   4096 Jan 18 01:12 osgi
-rw-r--r--  1 jenkins jenkins   4813 Nov 12 01:13 patch.xml
-rw-r--r--  1 jenkins jenkins    426 Nov 12 01:13 .project
-rw-r--r--  1 jenkins jenkins   4278 Dec 13 19:13 README.rst
drwxr-xr-x  2 jenkins jenkins   4096 Nov 12 01:13 .settings
-rw-r--r--  1 jenkins jenkins    556 Nov 12 01:13 settings.gradle
drwxr-xr-x  9 jenkins jenkins   4096 Jan 14 01:12 sonar
drwxr-xr-x 16 jenkins jenkins   4096 Nov 12 01:14 src
drwxr-xr-x  4 jenkins jenkins   4096 Feb  1 01:12 .svn
drwxr-xr-x 15 jenkins jenkins   4096 Jan  6 01:15 test-data
-rw-r--r--  1 jenkins jenkins    419 Dec  8 01:12 .travis.yml
+ echo which ant
which ant
+ which ant
/usr/bin/ant
+ ant -version
Apache Ant(TM) version 1.10.5 compiled on March 28 2019
+ echo <project default="test"><target name="test"><echo>Java ${ant.java.version}/${java.version}</echo><exec executable="javac"><arg value="-version"/></exec></target></project>
+ ant -f build.javacheck.xml -v
Apache Ant(TM) version 1.10.5 compiled on March 28 2019
Buildfile: <https://ci-builds.apache.org/job/POI/job/POI-DSL-API-Check/ws/build.javacheck.xml>
Detected Java version: 1.8 in: /usr/local/asfpackages/java/oraclejdk-1.8.0-281/jre
Detected OS: Linux
parsing buildfile <https://ci-builds.apache.org/job/POI/job/POI-DSL-API-Check/ws/build.javacheck.xml> with URI = <https://ci-builds.apache.org/job/POI/job/POI-DSL-API-Check/ws/build.javacheck.xml>
Project base dir set to: <https://ci-builds.apache.org/job/POI/job/POI-DSL-API-Check/ws/>
Build sequence for target(s) `test' is [test]
Complete build sequence is [test, ]

test:
parsing buildfile jar:file:/usr/share/ant/lib/ant.jar!/org/apache/tools/ant/antlib.xml with URI = jar:file:/usr/share/ant/lib/ant.jar!/org/apache/tools/ant/antlib.xml from a zip file
     [echo] Java 1.8/1.8.0_281
     [exec] Current OS is Linux
     [exec] Executing 'javac' with arguments:
     [exec] '-version'
     [exec]
     [exec] The ' characters around the executable and arguments are
     [exec] not part of the command.
     [exec] javac 1.8.0_281

BUILD SUCCESSFUL
Total time: 0 seconds
+ exit 0
[Gradle] - Launching build.
[POI-DSL-API-Check] $ <https://ci-builds.apache.org/job/POI/job/POI-DSL-API-Check/ws/gradlew> japicmp
To honour the JVM settings for this build a single-use Daemon process will be forked. See https://docs.gradle.org/6.8/userguide/gradle_daemon.html#sec:disabling_the_daemon.
Daemon will be stopped at the end of the build

> Configure project :
Trying to override old definition of datatype junit

> Task :main:compileJava
> Task :main:processResources UP-TO-DATE
> Task :main:classes
> Task :main:jar
> Task :ooxml:ant-check-jars
> Task :ooxml:ant-fetch-jars
> Task :ooxml:ant-check-ooxml-jars
> Task :ooxml:ant-fetch-ooxml-jars

> Task :ooxml:ant-init
[ant:echo] Using Ant: Apache Ant(TM) version 1.10.9 compiled on September 27 2020 from ${ant.home}, Ant detected Java 1.8 (may be different than actual Java sometimes...)
[ant:echo] Using Java: 1.8.0_281/1.8.0_281-b09/25.281-b09/Java HotSpot(TM) 64-Bit Server VM from Oracle Corporation on Linux: 4.15.0-58-generic
[ant:echo] Building Apache POI version 5.0.1-SNAPSHOT and RC: RC1

> Task :ooxml:ant-check-compiled-ooxml-xsds
> Task :ooxml:ant-compile-ooxml-xsds
> Task :scratchpad:compileJava UP-TO-DATE
> Task :scratchpad:processResources UP-TO-DATE
> Task :scratchpad:classes UP-TO-DATE
> Task :scratchpad:jar UP-TO-DATE

> Task :ooxml:compileJava
Note: Some input files use or override a deprecated API.
Note: Recompile with -Xlint:deprecation for details.
Note: <https://ci-builds.apache.org/job/POI/job/POI-DSL-API-Check/ws/src/ooxml/java/org/apache/poi/xslf/draw/SVGImageRenderer.java> uses unchecked or unsafe operations.
Note: Recompile with -Xlint:unchecked for details.

> Task :ooxml:processResources UP-TO-DATE
> Task :ooxml:classes
> Task :ooxml:jar
> Task :examples:compileJava UP-TO-DATE
> Task :examples:processResources NO-SOURCE
> Task :examples:classes UP-TO-DATE
> Task :examples:jar UP-TO-DATE
> Task :examples:japicmp SKIPPED
> Task :excelant:compileJava UP-TO-DATE
> Task :excelant:processResources UP-TO-DATE
> Task :excelant:classes UP-TO-DATE
> Task :excelant:jar UP-TO-DATE
> Task :excelant:japicmp FAILED

FAILURE: Build failed with an exception.

* What went wrong:
Execution failed for task ':excelant:japicmp'.
> Failed to load file from jar 'META-INF/versions/9/module-info.class' as class file: invalid constant type: 19 at 3.

* Try:
Run with --stacktrace option to get the stack trace. Run with --info or --debug option to get more log output. Run with --scan to get full insights.

* Get more help at https://help.gradle.org

Deprecated Gradle features were used in this build, making it incompatible with Gradle 7.0.
Use '--warning-mode all' to show the individual deprecation warnings.
See https://docs.gradle.org/6.8/userguide/command_line_interface.html#sec:command_line_warnings

BUILD FAILED in 28s
22 actionable tasks: 12 executed, 10 up-to-date
Build step 'Invoke Gradle script' changed build result to FAILURE
Build step 'Invoke Gradle script' marked build as failure
Archiving artifacts
[Fast Archiver] Compressed 29.34 MB of artifacts by 99.2% relative to #90

---------------------------------------------------------------------
To unsubscribe, e-mail: [hidden email]
For additional commands, e-mail: [hidden email]

Reply | Threaded
Open this post in threaded view
|

Build failed in Jenkins: POI » POI-DSL-API-Check #102

Apache Jenkins Server
See <https://ci-builds.apache.org/job/POI/job/POI-DSL-API-Check/102/display/redirect?page=changes>

Changes:

[PJ Fanning] remove accidental commit

[PJ Fanning] [bug-65120] PartAlreadyExistsException when creating cell comments (after some comments removed). Thanks to Raúl Wegmann


------------------------------------------
[...truncated 380.12 KB...]

No changes for https://svn.apache.org/repos/asf/poi/site/forrest.properties since the previous build
No changes for https://svn.apache.org/repos/asf/poi/site/src/documentation since the previous build
[POI-DSL-API-Check] $ /bin/sh -xe /tmp/jenkins2090492115785482414.sh
+ svn status
    X   forrest.properties
X       src/documentation

Performing status on external item at 'src/documentation':
+ echo Java-Home: /home/jenkins/tools/java/latest1.8
Java-Home: /home/jenkins/tools/java/latest1.8
+ ls -al /home/jenkins/tools/java/latest1.8/
total 25824
drwxr-xr-x  8 root root     4096 Jan 29 21:10 .
drwxr-xr-x 40 root root     4096 Jan 29 21:09 ..
drwxr-xr-x  2 root root     4096 Jan 29 21:10 bin
-r--r--r--  1 root root     3244 Dec  9 12:47 COPYRIGHT
drwxr-xr-x  3 root root     4096 Jan 29 21:10 include
-rw-r--r--  1 root root  5226870 Dec  9 10:15 javafx-src.zip
-rw-r--r--  1 root root      195 Dec  9 12:47 jmc.txt
drwxr-xr-x  6 root root     4096 Jan 29 21:10 jre
drwxr-xr-x  4 root root     4096 Jan 29 21:10 legal
drwxr-xr-x  4 root root     4096 Jan 29 21:10 lib
-r--r--r--  1 root root       44 Dec  9 12:47 LICENSE
drwxr-xr-x  4 root root     4096 Jan 29 21:10 man
-r--r--r--  1 root root      159 Dec  9 12:47 README.html
-rw-r--r--  1 root root      424 Dec  9 12:47 release
-rw-r--r--  1 root root 21147701 Dec  9 12:47 src.zip
-rw-r--r--  1 root root      190 Dec  9 10:15 THIRDPARTYLICENSEREADME-JAVAFX.txt
-r--r--r--  1 root root      190 Dec  9 12:47 THIRDPARTYLICENSEREADME.txt
+ ls -al /home/jenkins/tools/java/latest1.8/bin
total 836
drwxr-xr-x 2 root root   4096 Jan 29 21:10 .
drwxr-xr-x 8 root root   4096 Jan 29 21:10 ..
-rwxr-xr-x 1 root root   8840 Dec  9 12:47 appletviewer
lrwxrwxrwx 1 root root      8 Dec  9 12:47 ControlPanel -> jcontrol
-rwxr-xr-x 1 root root   8832 Dec  9 12:47 extcheck
-rwxr-xr-x 1 root root   8832 Dec  9 12:47 idlj
-rwxr-xr-x 1 root root   8832 Dec  9 12:47 jar
-rwxr-xr-x 1 root root   8832 Dec  9 12:47 jarsigner
-rwxr-xr-x 1 root root   8712 Dec  9 12:47 java
-rwxr-xr-x 1 root root   8832 Dec  9 12:47 javac
-rwxr-xr-x 1 root root   8832 Dec  9 12:47 javadoc
-rwxr-xr-x 1 root root   2293 Dec  9 10:15 javafxpackager
-rwxr-xr-x 1 root root   8832 Dec  9 12:47 javah
-rwxr-xr-x 1 root root   8832 Dec  9 12:47 javap
-rwxr-xr-x 1 root root   2293 Dec  9 10:15 javapackager
-rwxr-xr-x 1 root root   1809 Dec  9 12:47 java-rmi.cgi
-rwxr-xr-x 1 root root 148896 Dec  9 12:47 javaws
-rwxr-xr-x 1 root root   8832 Dec  9 12:47 jcmd
-rwxr-xr-x 1 root root   8856 Dec  9 12:47 jconsole
-rwxr-xr-x 1 root root   6264 Dec  9 12:47 jcontrol
-rwxr-xr-x 1 root root   8848 Dec  9 12:47 jdb
-rwxr-xr-x 1 root root   8832 Dec  9 12:47 jdeps
-rwxr-xr-x 1 root root   8832 Dec  9 12:47 jhat
-rwxr-xr-x 1 root root   8896 Dec  9 12:47 jinfo
-rwxr-xr-x 1 root root   8832 Dec  9 12:47 jjs
-rwxr-xr-x 1 root root   8896 Dec  9 12:47 jmap
-rwxr-xr-x 1 root root   8832 Dec  9 12:47 jps
-rwxr-xr-x 1 root root   8840 Dec  9 12:47 jrunscript
-rwxr-xr-x 1 root root   8848 Dec  9 12:47 jsadebugd
-rwxr-xr-x 1 root root   8896 Dec  9 12:47 jstack
-rwxr-xr-x 1 root root   8832 Dec  9 12:47 jstat
-rwxr-xr-x 1 root root   8832 Dec  9 12:47 jstatd
-rwxr-xr-x 1 root root   5110 Jan 14  2017 jvisualvm
-rwxr-xr-x 1 root root   8832 Dec  9 12:47 keytool
-rwxr-xr-x 1 root root   8840 Dec  9 12:47 native2ascii
-rwxr-xr-x 1 root root   8904 Dec  9 12:47 orbd
-rwxr-xr-x 1 root root   8832 Dec  9 12:47 pack200
-rwxr-xr-x 1 root root   8840 Dec  9 12:47 policytool
-rwxr-xr-x 1 root root   8832 Dec  9 12:47 rmic
-rwxr-xr-x 1 root root   8832 Dec  9 12:47 rmid
-rwxr-xr-x 1 root root   8840 Dec  9 12:47 rmiregistry
-rwxr-xr-x 1 root root   8832 Dec  9 12:47 schemagen
-rwxr-xr-x 1 root root   8832 Dec  9 12:47 serialver
-rwxr-xr-x 1 root root   8840 Dec  9 12:47 servertool
-rwxr-xr-x 1 root root   8904 Dec  9 12:47 tnameserv
-rwxr-xr-x 1 root root 186960 Dec  9 12:47 unpack200
-rwxr-xr-x 1 root root   8832 Dec  9 12:47 wsgen
-rwxr-xr-x 1 root root   8832 Dec  9 12:47 wsimport
-rwxr-xr-x 1 root root   8832 Dec  9 12:47 xjc
+ /home/jenkins/tools/java/latest1.8/bin/java -version
java version "1.8.0_281"
Java(TM) SE Runtime Environment (build 1.8.0_281-b09)
Java HotSpot(TM) 64-Bit Server VM (build 25.281-b09, mixed mode)
+ echo which java
which java
+ which java
/home/jenkins/tools/java/latest1.8/bin/java
+ java -version
java version "1.8.0_281"
Java(TM) SE Runtime Environment (build 1.8.0_281-b09)
Java HotSpot(TM) 64-Bit Server VM (build 25.281-b09, mixed mode)
+ echo which javac
which javac
+ which javac
/home/jenkins/tools/java/latest1.8/bin/javac
+ javac -version
javac 1.8.0_281
+ echo Ant-Home:
Ant-Home:
+ ls -al
total 460
drwxr-xr-x 13 jenkins jenkins   4096 Feb  3 09:15 .
drwxr-xr-x  7 jenkins jenkins   4096 Feb  3 09:10 ..
-rw-r--r--  1 jenkins jenkins  14850 Feb  3 09:14 build.gradle
-rw-r--r--  1 jenkins jenkins 157398 Feb  3 09:15 build.xml
-rw-r--r--  1 jenkins jenkins   3345 Feb  3 09:15 .classpath
-rw-r--r--  1 jenkins jenkins   6325 Feb  3 09:15 doap_POI.rdf
-rw-r--r--  1 jenkins jenkins   2934 Feb  3 09:15 file-leak-detector.exclude
-rw-r--r--  1 jenkins jenkins   6229 Feb  3 09:15 forrest.properties
-rw-r--r--  1 jenkins jenkins     53 Feb  3 09:15 .gitattributes
drwxr-xr-x  3 jenkins jenkins   4096 Feb  3 09:15 .github
-rw-r--r--  1 jenkins jenkins    482 Feb  3 09:15 .gitignore
drwxr-xr-x  3 jenkins jenkins   4096 Feb  3 09:15 gradle
-rwxr-xr-x  1 jenkins jenkins   5770 Feb  3 09:15 gradlew
-rw-r--r--  1 jenkins jenkins   3058 Feb  3 09:15 gradlew.bat
drwxr-xr-x  2 jenkins jenkins   4096 Feb  3 09:15 jenkins
-rw-r--r--  1 jenkins jenkins 167284 Feb  3 09:15 KEYS
drwxr-xr-x  2 jenkins jenkins   4096 Feb  3 09:15 legal
drwxr-xr-x  2 jenkins jenkins   4096 Feb  3 09:15 maven
drwxr-xr-x  3 jenkins jenkins   4096 Feb  3 09:15 osgi
-rw-r--r--  1 jenkins jenkins   4813 Feb  3 09:15 patch.xml
-rw-r--r--  1 jenkins jenkins    426 Feb  3 09:15 .project
-rw-r--r--  1 jenkins jenkins   4278 Feb  3 09:15 README.rst
drwxr-xr-x  2 jenkins jenkins   4096 Feb  3 09:15 .settings
-rw-r--r--  1 jenkins jenkins    556 Feb  3 09:15 settings.gradle
drwxr-xr-x  9 jenkins jenkins   4096 Feb  3 09:15 sonar
drwxr-xr-x 16 jenkins jenkins   4096 Feb  3 09:15 src
drwxr-xr-x  4 jenkins jenkins   4096 Feb  3 09:15 .svn
drwxr-xr-x 15 jenkins jenkins   4096 Feb  3 09:15 test-data
-rw-r--r--  1 jenkins jenkins    419 Feb  3 09:15 .travis.yml
+ echo which ant
which ant
+ which ant
/usr/bin/ant
+ ant -version
Apache Ant(TM) version 1.10.5 compiled on March 28 2019
+ echo <project default="test"><target name="test"><echo>Java ${ant.java.version}/${java.version}</echo><exec executable="javac"><arg value="-version"/></exec></target></project>
+ ant -f build.javacheck.xml -v
Apache Ant(TM) version 1.10.5 compiled on March 28 2019
Buildfile: <https://ci-builds.apache.org/job/POI/job/POI-DSL-API-Check/ws/build.javacheck.xml>
Detected Java version: 1.8 in: /usr/local/asfpackages/java/oraclejdk-1.8.0-281/jre
Detected OS: Linux
parsing buildfile <https://ci-builds.apache.org/job/POI/job/POI-DSL-API-Check/ws/build.javacheck.xml> with URI = <https://ci-builds.apache.org/job/POI/job/POI-DSL-API-Check/ws/build.javacheck.xml>
Project base dir set to: <https://ci-builds.apache.org/job/POI/job/POI-DSL-API-Check/ws/>
Build sequence for target(s) `test' is [test]
Complete build sequence is [test, ]

test:
parsing buildfile jar:file:/usr/share/ant/lib/ant.jar!/org/apache/tools/ant/antlib.xml with URI = jar:file:/usr/share/ant/lib/ant.jar!/org/apache/tools/ant/antlib.xml from a zip file
     [echo] Java 1.8/1.8.0_281
     [exec] Current OS is Linux
     [exec] Executing 'javac' with arguments:
     [exec] '-version'
     [exec]
     [exec] The ' characters around the executable and arguments are
     [exec] not part of the command.
     [exec] javac 1.8.0_281

BUILD SUCCESSFUL
Total time: 0 seconds
+ exit 0
[Gradle] - Launching build.
[POI-DSL-API-Check] $ <https://ci-builds.apache.org/job/POI/job/POI-DSL-API-Check/ws/gradlew> japicmp
Downloading https://services.gradle.org/distributions/gradle-6.8-bin.zip
..........10%..........20%..........30%...........40%..........50%..........60%..........70%...........80%..........90%..........100%
To honour the JVM settings for this build a single-use Daemon process will be forked. See https://docs.gradle.org/6.8/userguide/gradle_daemon.html#sec:disabling_the_daemon.
Daemon will be stopped at the end of the build

> Configure project :
Trying to override old definition of datatype junit

> Task :main:compileJava
Note: Some input files use or override a deprecated API.
Note: Recompile with -Xlint:deprecation for details.
Note: Some input files use unchecked or unsafe operations.
Note: Recompile with -Xlint:unchecked for details.

> Task :main:processResources
> Task :main:classes
> Task :main:jar
> Task :ooxml:ant-check-jars
> Task :ooxml:ant-fetch-jars
> Task :ooxml:ant-check-ooxml-jars
> Task :ooxml:ant-fetch-ooxml-jars

> Task :ooxml:ant-init
[ant:echo] Using Ant: Apache Ant(TM) version 1.10.9 compiled on September 27 2020 from ${ant.home}, Ant detected Java 1.8 (may be different than actual Java sometimes...)
[ant:echo] Using Java: 1.8.0_281/1.8.0_281-b09/25.281-b09/Java HotSpot(TM) 64-Bit Server VM from Oracle Corporation on Linux: 4.15.0-72-generic
[ant:echo] Building Apache POI version 5.0.1-SNAPSHOT and RC: RC1

> Task :ooxml:ant-check-compiled-ooxml-xsds

> Task :ooxml:ant-compile-ooxml-xsds
SchemaCompiler  Metadata LOAD:org/apache/xmlbeans/metadata GEN:org/apache/poi/schemas/ooxml
Time to build schema type system: 3.163 seconds
Time to generate code: 8.941 seconds

> Task :scratchpad:compileJava
Note: Some input files use or override a deprecated API.
Note: Recompile with -Xlint:deprecation for details.
Note: Some input files use unchecked or unsafe operations.
Note: Recompile with -Xlint:unchecked for details.

> Task :scratchpad:processResources
> Task :scratchpad:classes
> Task :scratchpad:jar

> Task :ooxml:compileJava
Note: Some input files use or override a deprecated API.
Note: Recompile with -Xlint:deprecation for details.
Note: <https://ci-builds.apache.org/job/POI/job/POI-DSL-API-Check/ws/src/ooxml/java/org/apache/poi/xslf/draw/SVGImageRenderer.java> uses unchecked or unsafe operations.
Note: Recompile with -Xlint:unchecked for details.

> Task :ooxml:processResources
> Task :ooxml:classes
> Task :ooxml:jar
> Task :examples:compileJava
> Task :examples:processResources NO-SOURCE
> Task :examples:classes
> Task :examples:jar
> Task :examples:japicmp SKIPPED
> Task :excelant:compileJava
> Task :excelant:processResources
> Task :excelant:classes
> Task :excelant:jar
> Task :excelant:japicmp FAILED

FAILURE: Build failed with an exception.

* What went wrong:
Execution failed for task ':excelant:japicmp'.
> Failed to load file from jar 'META-INF/versions/9/module-info.class' as class file: invalid constant type: 19 at 3.

* Try:
Run with --stacktrace option to get the stack trace. Run with --info or --debug option to get more log output. Run with --scan to get full insights.

* Get more help at https://help.gradle.org

Deprecated Gradle features were used in this build, making it incompatible with Gradle 7.0.
Use '--warning-mode all' to show the individual deprecation warnings.
See https://docs.gradle.org/6.8/userguide/command_line_interface.html#sec:command_line_warnings

BUILD FAILED in 3m 21s
22 actionable tasks: 22 executed
Build step 'Invoke Gradle script' changed build result to FAILURE
Build step 'Invoke Gradle script' marked build as failure
Archiving artifacts

---------------------------------------------------------------------
To unsubscribe, e-mail: [hidden email]
For additional commands, e-mail: [hidden email]

Reply | Threaded
Open this post in threaded view
|

Build failed in Jenkins: POI » POI-DSL-API-Check #103

Apache Jenkins Server
See <https://ci-builds.apache.org/job/POI/job/POI-DSL-API-Check/103/display/redirect?page=changes>

Changes:

[Marius Volkhart] Cache Gradle wrapper & caches during GitHub Actions

[Marius Volkhart] Cache Maven repo during GitHub Actions


------------------------------------------
[...truncated 1.13 KB...]

<-- Got one external: forrest.properties, svn url: https://svn.apache.org/repos/asf/poi/site/forrest.properties -->
Fetching 'https://svn.apache.org/repos/asf/poi/site/forrest.properties' at -1 into '<https://ci-builds.apache.org/job/POI/job/POI-DSL-API-Check/ws/forrest.properties'>
At revision 1886266


<-- Got one external: documentation, svn url: https://svn.apache.org/repos/asf/poi/site/src/documentation -->
Fetching 'https://svn.apache.org/repos/asf/poi/site/src/documentation' at -1 into '<https://ci-builds.apache.org/job/POI/job/POI-DSL-API-Check/ws/src/documentation'>
At revision 1886266

At revision 1886266

No changes for https://svn.apache.org/repos/asf/poi/site/forrest.properties since the previous build
No changes for https://svn.apache.org/repos/asf/poi/site/src/documentation since the previous build
[POI-DSL-API-Check] $ /bin/sh -xe /tmp/jenkins3661503290973565449.sh
+ svn status
?       build.javacheck.xml
    X   forrest.properties
X       src/documentation

Performing status on external item at 'src/documentation':
+ echo Java-Home: /home/jenkins/tools/java/latest1.8
Java-Home: /home/jenkins/tools/java/latest1.8
+ ls -al /home/jenkins/tools/java/latest1.8/
total 25824
drwxr-xr-x  8 root root     4096 Jan 29 21:12 .
drwxr-xr-x 40 root root     4096 Jan 29 21:12 ..
drwxr-xr-x  2 root root     4096 Jan 29 21:12 bin
-r--r--r--  1 root root     3244 Dec  9 12:47 COPYRIGHT
drwxr-xr-x  3 root root     4096 Jan 29 21:12 include
-rw-r--r--  1 root root  5226870 Dec  9 10:15 javafx-src.zip
-rw-r--r--  1 root root      195 Dec  9 12:47 jmc.txt
drwxr-xr-x  6 root root     4096 Jan 29 21:12 jre
drwxr-xr-x  4 root root     4096 Jan 29 21:12 legal
drwxr-xr-x  4 root root     4096 Jan 29 21:12 lib
-r--r--r--  1 root root       44 Dec  9 12:47 LICENSE
drwxr-xr-x  4 root root     4096 Jan 29 21:12 man
-r--r--r--  1 root root      159 Dec  9 12:47 README.html
-rw-r--r--  1 root root      424 Dec  9 12:47 release
-rw-r--r--  1 root root 21147701 Dec  9 12:47 src.zip
-rw-r--r--  1 root root      190 Dec  9 10:15 THIRDPARTYLICENSEREADME-JAVAFX.txt
-r--r--r--  1 root root      190 Dec  9 12:47 THIRDPARTYLICENSEREADME.txt
+ ls -al /home/jenkins/tools/java/latest1.8/bin
total 836
drwxr-xr-x 2 root root   4096 Jan 29 21:12 .
drwxr-xr-x 8 root root   4096 Jan 29 21:12 ..
-rwxr-xr-x 1 root root   8840 Dec  9 12:47 appletviewer
lrwxrwxrwx 1 root root      8 Dec  9 12:47 ControlPanel -> jcontrol
-rwxr-xr-x 1 root root   8832 Dec  9 12:47 extcheck
-rwxr-xr-x 1 root root   8832 Dec  9 12:47 idlj
-rwxr-xr-x 1 root root   8832 Dec  9 12:47 jar
-rwxr-xr-x 1 root root   8832 Dec  9 12:47 jarsigner
-rwxr-xr-x 1 root root   8712 Dec  9 12:47 java
-rwxr-xr-x 1 root root   8832 Dec  9 12:47 javac
-rwxr-xr-x 1 root root   8832 Dec  9 12:47 javadoc
-rwxr-xr-x 1 root root   2293 Dec  9 10:15 javafxpackager
-rwxr-xr-x 1 root root   8832 Dec  9 12:47 javah
-rwxr-xr-x 1 root root   8832 Dec  9 12:47 javap
-rwxr-xr-x 1 root root   2293 Dec  9 10:15 javapackager
-rwxr-xr-x 1 root root   1809 Dec  9 12:47 java-rmi.cgi
-rwxr-xr-x 1 root root 148896 Dec  9 12:47 javaws
-rwxr-xr-x 1 root root   8832 Dec  9 12:47 jcmd
-rwxr-xr-x 1 root root   8856 Dec  9 12:47 jconsole
-rwxr-xr-x 1 root root   6264 Dec  9 12:47 jcontrol
-rwxr-xr-x 1 root root   8848 Dec  9 12:47 jdb
-rwxr-xr-x 1 root root   8832 Dec  9 12:47 jdeps
-rwxr-xr-x 1 root root   8832 Dec  9 12:47 jhat
-rwxr-xr-x 1 root root   8896 Dec  9 12:47 jinfo
-rwxr-xr-x 1 root root   8832 Dec  9 12:47 jjs
-rwxr-xr-x 1 root root   8896 Dec  9 12:47 jmap
-rwxr-xr-x 1 root root   8832 Dec  9 12:47 jps
-rwxr-xr-x 1 root root   8840 Dec  9 12:47 jrunscript
-rwxr-xr-x 1 root root   8848 Dec  9 12:47 jsadebugd
-rwxr-xr-x 1 root root   8896 Dec  9 12:47 jstack
-rwxr-xr-x 1 root root   8832 Dec  9 12:47 jstat
-rwxr-xr-x 1 root root   8832 Dec  9 12:47 jstatd
-rwxr-xr-x 1 root root   5110 Jan 14  2017 jvisualvm
-rwxr-xr-x 1 root root   8832 Dec  9 12:47 keytool
-rwxr-xr-x 1 root root   8840 Dec  9 12:47 native2ascii
-rwxr-xr-x 1 root root   8904 Dec  9 12:47 orbd
-rwxr-xr-x 1 root root   8832 Dec  9 12:47 pack200
-rwxr-xr-x 1 root root   8840 Dec  9 12:47 policytool
-rwxr-xr-x 1 root root   8832 Dec  9 12:47 rmic
-rwxr-xr-x 1 root root   8832 Dec  9 12:47 rmid
-rwxr-xr-x 1 root root   8840 Dec  9 12:47 rmiregistry
-rwxr-xr-x 1 root root   8832 Dec  9 12:47 schemagen
-rwxr-xr-x 1 root root   8832 Dec  9 12:47 serialver
-rwxr-xr-x 1 root root   8840 Dec  9 12:47 servertool
-rwxr-xr-x 1 root root   8904 Dec  9 12:47 tnameserv
-rwxr-xr-x 1 root root 186960 Dec  9 12:47 unpack200
-rwxr-xr-x 1 root root   8832 Dec  9 12:47 wsgen
-rwxr-xr-x 1 root root   8832 Dec  9 12:47 wsimport
-rwxr-xr-x 1 root root   8832 Dec  9 12:47 xjc
+ /home/jenkins/tools/java/latest1.8/bin/java -version
java version "1.8.0_281"
Java(TM) SE Runtime Environment (build 1.8.0_281-b09)
Java HotSpot(TM) 64-Bit Server VM (build 25.281-b09, mixed mode)
+ echo which java
which java
+ which java
/home/jenkins/tools/java/latest1.8/bin/java
+ java -version
java version "1.8.0_281"
Java(TM) SE Runtime Environment (build 1.8.0_281-b09)
Java HotSpot(TM) 64-Bit Server VM (build 25.281-b09, mixed mode)
+ echo which javac
which javac
+ which javac
/home/jenkins/tools/java/latest1.8/bin/javac
+ javac -version
javac 1.8.0_281
+ echo Ant-Home:
Ant-Home:
+ ls -al
total 476
drwxr-xr-x 16 jenkins jenkins   4096 Jan 19 01:12 .
drwxr-xr-x  6 jenkins jenkins   4096 Feb  6 14:02 ..
drwxr-xr-x 30 jenkins jenkins   4096 Nov 12 01:14 build
-rw-r--r--  1 jenkins jenkins  14850 Jan 19 01:12 build.gradle
-rw-r--r--  1 jenkins jenkins    172 Feb  1 01:12 build.javacheck.xml
-rw-r--r--  1 jenkins jenkins 157398 Jan 24 01:12 build.xml
-rw-r--r--  1 jenkins jenkins   3345 Dec 18 01:12 .classpath
-rw-r--r--  1 jenkins jenkins   6325 Jan 18 01:12 doap_POI.rdf
-rw-r--r--  1 jenkins jenkins   2934 Jan  9 01:12 file-leak-detector.exclude
-rw-r--r--  1 jenkins jenkins   6229 Nov 12 01:13 forrest.properties
-rw-r--r--  1 jenkins jenkins     53 Nov 12 01:13 .gitattributes
drwxr-xr-x  3 jenkins jenkins   4096 Dec 21 01:12 .github
-rw-r--r--  1 jenkins jenkins    482 Dec 13 19:13 .gitignore
drwxr-xr-x  3 jenkins jenkins   4096 Nov 12 01:13 gradle
drwxr-xr-x  7 jenkins jenkins   4096 Jan 31 01:13 .gradle
-rwxr-xr-x  1 jenkins jenkins   5770 Jan 19 01:12 gradlew
-rw-r--r--  1 jenkins jenkins   3058 Jan 19 01:12 gradlew.bat
drwxr-xr-x  2 jenkins jenkins   4096 Jan  6 01:15 jenkins
-rw-r--r--  1 jenkins jenkins 167284 Nov 12 01:13 KEYS
drwxr-xr-x  2 jenkins jenkins   4096 Nov 12 01:13 legal
drwxr-xr-x  9 jenkins jenkins   4096 Nov 12 01:14 lib
drwxr-xr-x  2 jenkins jenkins   4096 Jan 14 01:12 maven
drwxr-xr-x  3 jenkins jenkins   4096 Jan 18 01:12 osgi
-rw-r--r--  1 jenkins jenkins   4813 Nov 12 01:13 patch.xml
-rw-r--r--  1 jenkins jenkins    426 Nov 12 01:13 .project
-rw-r--r--  1 jenkins jenkins   4278 Dec 13 19:13 README.rst
drwxr-xr-x  2 jenkins jenkins   4096 Nov 12 01:13 .settings
-rw-r--r--  1 jenkins jenkins    556 Nov 12 01:13 settings.gradle
drwxr-xr-x  9 jenkins jenkins   4096 Jan 14 01:12 sonar
drwxr-xr-x 16 jenkins jenkins   4096 Nov 12 01:14 src
drwxr-xr-x  4 jenkins jenkins   4096 Feb  7 01:12 .svn
drwxr-xr-x 15 jenkins jenkins   4096 Jan  6 01:15 test-data
-rw-r--r--  1 jenkins jenkins    419 Dec  8 01:12 .travis.yml
+ echo which ant
which ant
+ which ant
/usr/bin/ant
+ ant -version
Apache Ant(TM) version 1.10.5 compiled on March 28 2019
+ echo <project default="test"><target name="test"><echo>Java ${ant.java.version}/${java.version}</echo><exec executable="javac"><arg value="-version"/></exec></target></project>
+ ant -f build.javacheck.xml -v
Apache Ant(TM) version 1.10.5 compiled on March 28 2019
Buildfile: <https://ci-builds.apache.org/job/POI/job/POI-DSL-API-Check/ws/build.javacheck.xml>
Detected Java version: 1.8 in: /usr/local/asfpackages/java/oraclejdk-1.8.0-281/jre
Detected OS: Linux
parsing buildfile <https://ci-builds.apache.org/job/POI/job/POI-DSL-API-Check/ws/build.javacheck.xml> with URI = <https://ci-builds.apache.org/job/POI/job/POI-DSL-API-Check/ws/build.javacheck.xml>
Project base dir set to: <https://ci-builds.apache.org/job/POI/job/POI-DSL-API-Check/ws/>
Build sequence for target(s) `test' is [test]
Complete build sequence is [test, ]

test:
parsing buildfile jar:file:/usr/share/ant/lib/ant.jar!/org/apache/tools/ant/antlib.xml with URI = jar:file:/usr/share/ant/lib/ant.jar!/org/apache/tools/ant/antlib.xml from a zip file
     [echo] Java 1.8/1.8.0_281
     [exec] Current OS is Linux
     [exec] Executing 'javac' with arguments:
     [exec] '-version'
     [exec]
     [exec] The ' characters around the executable and arguments are
     [exec] not part of the command.
     [exec] javac 1.8.0_281

BUILD SUCCESSFUL
Total time: 0 seconds
+ exit 0
[Gradle] - Launching build.
[POI-DSL-API-Check] $ <https://ci-builds.apache.org/job/POI/job/POI-DSL-API-Check/ws/gradlew> japicmp
To honour the JVM settings for this build a single-use Daemon process will be forked. See https://docs.gradle.org/6.8/userguide/gradle_daemon.html#sec:disabling_the_daemon.
Daemon will be stopped at the end of the build

> Configure project :
Trying to override old definition of datatype junit

> Task :main:compileJava UP-TO-DATE
> Task :main:processResources UP-TO-DATE
> Task :main:classes UP-TO-DATE
> Task :main:jar UP-TO-DATE
> Task :ooxml:ant-check-jars
> Task :ooxml:ant-fetch-jars
> Task :ooxml:ant-check-ooxml-jars
> Task :ooxml:ant-fetch-ooxml-jars

> Task :ooxml:ant-init
[ant:echo] Using Ant: Apache Ant(TM) version 1.10.9 compiled on September 27 2020 from ${ant.home}, Ant detected Java 1.8 (may be different than actual Java sometimes...)
[ant:echo] Using Java: 1.8.0_281/1.8.0_281-b09/25.281-b09/Java HotSpot(TM) 64-Bit Server VM from Oracle Corporation on Linux: 4.15.0-58-generic
[ant:echo] Building Apache POI version 5.0.1-SNAPSHOT and RC: RC1

> Task :ooxml:ant-check-compiled-ooxml-xsds
> Task :ooxml:ant-compile-ooxml-xsds
> Task :scratchpad:compileJava UP-TO-DATE
> Task :scratchpad:processResources UP-TO-DATE
> Task :scratchpad:classes UP-TO-DATE
> Task :scratchpad:jar UP-TO-DATE

> Task :ooxml:compileJava
Note: Some input files use or override a deprecated API.
Note: Recompile with -Xlint:deprecation for details.
Note: <https://ci-builds.apache.org/job/POI/job/POI-DSL-API-Check/ws/src/ooxml/java/org/apache/poi/xslf/draw/SVGImageRenderer.java> uses unchecked or unsafe operations.
Note: Recompile with -Xlint:unchecked for details.

> Task :ooxml:processResources UP-TO-DATE
> Task :ooxml:classes
> Task :ooxml:jar
> Task :examples:compileJava UP-TO-DATE
> Task :examples:processResources NO-SOURCE
> Task :examples:classes UP-TO-DATE
> Task :examples:jar UP-TO-DATE
> Task :examples:japicmp SKIPPED
> Task :excelant:compileJava UP-TO-DATE
> Task :excelant:processResources UP-TO-DATE
> Task :excelant:classes UP-TO-DATE
> Task :excelant:jar UP-TO-DATE
> Task :excelant:japicmp FAILED

FAILURE: Build failed with an exception.

* What went wrong:
Execution failed for task ':excelant:japicmp'.
> Failed to load file from jar 'META-INF/versions/9/module-info.class' as class file: invalid constant type: 19 at 3.

* Try:
Run with --stacktrace option to get the stack trace. Run with --info or --debug option to get more log output. Run with --scan to get full insights.

* Get more help at https://help.gradle.org

Deprecated Gradle features were used in this build, making it incompatible with Gradle 7.0.
Use '--warning-mode all' to show the individual deprecation warnings.
See https://docs.gradle.org/6.8/userguide/command_line_interface.html#sec:command_line_warnings

BUILD FAILED in 28s
22 actionable tasks: 10 executed, 12 up-to-date
Build step 'Invoke Gradle script' changed build result to FAILURE
Build step 'Invoke Gradle script' marked build as failure
Archiving artifacts
[Fast Archiver] Compressed 29.34 MB of artifacts by 99.2% relative to #90

---------------------------------------------------------------------
To unsubscribe, e-mail: [hidden email]
For additional commands, e-mail: [hidden email]

Reply | Threaded
Open this post in threaded view
|

Build failed in Jenkins: POI » POI-DSL-API-Check #104

Apache Jenkins Server
See <https://ci-builds.apache.org/job/POI/job/POI-DSL-API-Check/104/display/redirect?page=changes>

Changes:

[Marius Volkhart] [github-219] Add GitHub Action to verify Gradle wrapper

Thanks to Valery Yatsynovich. This closes #219


------------------------------------------
[...truncated 379 B...]
[EnvInject] - Injecting contributions.
Building remotely on H22 (ubuntu) in workspace <https://ci-builds.apache.org/job/POI/job/POI-DSL-API-Check/ws/>
[WS-CLEANUP] Deleting project workspace...
[WS-CLEANUP] Done
Updating https://svn.apache.org/repos/asf/poi/trunk at revision '2021-02-08T01:12:12.363 +0000'
U         .github/workflows/test-gradle.yml

<-- Got one external: forrest.properties, svn url: https://svn.apache.org/repos/asf/poi/site/forrest.properties -->
Fetching 'https://svn.apache.org/repos/asf/poi/site/forrest.properties' at -1 into '<https://ci-builds.apache.org/job/POI/job/POI-DSL-API-Check/ws/forrest.properties'>
At revision 1886299


<-- Got one external: documentation, svn url: https://svn.apache.org/repos/asf/poi/site/src/documentation -->
Fetching 'https://svn.apache.org/repos/asf/poi/site/src/documentation' at -1 into '<https://ci-builds.apache.org/job/POI/job/POI-DSL-API-Check/ws/src/documentation'>
At revision 1886299

At revision 1886299

No changes for https://svn.apache.org/repos/asf/poi/site/forrest.properties since the previous build
No changes for https://svn.apache.org/repos/asf/poi/site/src/documentation since the previous build
[POI-DSL-API-Check] $ /bin/sh -xe /tmp/jenkins3703233662315372433.sh
+ svn status
?       build.javacheck.xml
    X   forrest.properties
X       src/documentation

Performing status on external item at 'src/documentation':
+ echo Java-Home: /home/jenkins/tools/java/latest1.8
Java-Home: /home/jenkins/tools/java/latest1.8
+ ls -al /home/jenkins/tools/java/latest1.8/
total 25824
drwxr-xr-x  8 root root     4096 Jan 29 21:12 .
drwxr-xr-x 42 root root     4096 Feb  7 13:06 ..
drwxr-xr-x  2 root root     4096 Jan 29 21:12 bin
-r--r--r--  1 root root     3244 Dec  9 12:47 COPYRIGHT
drwxr-xr-x  3 root root     4096 Jan 29 21:12 include
-rw-r--r--  1 root root  5226870 Dec  9 10:15 javafx-src.zip
-rw-r--r--  1 root root      195 Dec  9 12:47 jmc.txt
drwxr-xr-x  6 root root     4096 Jan 29 21:12 jre
drwxr-xr-x  4 root root     4096 Jan 29 21:12 legal
drwxr-xr-x  4 root root     4096 Jan 29 21:12 lib
-r--r--r--  1 root root       44 Dec  9 12:47 LICENSE
drwxr-xr-x  4 root root     4096 Jan 29 21:12 man
-r--r--r--  1 root root      159 Dec  9 12:47 README.html
-rw-r--r--  1 root root      424 Dec  9 12:47 release
-rw-r--r--  1 root root 21147701 Dec  9 12:47 src.zip
-rw-r--r--  1 root root      190 Dec  9 10:15 THIRDPARTYLICENSEREADME-JAVAFX.txt
-r--r--r--  1 root root      190 Dec  9 12:47 THIRDPARTYLICENSEREADME.txt
+ ls -al /home/jenkins/tools/java/latest1.8/bin
total 836
drwxr-xr-x 2 root root   4096 Jan 29 21:12 .
drwxr-xr-x 8 root root   4096 Jan 29 21:12 ..
-rwxr-xr-x 1 root root   8840 Dec  9 12:47 appletviewer
lrwxrwxrwx 1 root root      8 Dec  9 12:47 ControlPanel -> jcontrol
-rwxr-xr-x 1 root root   8832 Dec  9 12:47 extcheck
-rwxr-xr-x 1 root root   8832 Dec  9 12:47 idlj
-rwxr-xr-x 1 root root   8832 Dec  9 12:47 jar
-rwxr-xr-x 1 root root   8832 Dec  9 12:47 jarsigner
-rwxr-xr-x 1 root root   8712 Dec  9 12:47 java
-rwxr-xr-x 1 root root   8832 Dec  9 12:47 javac
-rwxr-xr-x 1 root root   8832 Dec  9 12:47 javadoc
-rwxr-xr-x 1 root root   2293 Dec  9 10:15 javafxpackager
-rwxr-xr-x 1 root root   8832 Dec  9 12:47 javah
-rwxr-xr-x 1 root root   8832 Dec  9 12:47 javap
-rwxr-xr-x 1 root root   2293 Dec  9 10:15 javapackager
-rwxr-xr-x 1 root root   1809 Dec  9 12:47 java-rmi.cgi
-rwxr-xr-x 1 root root 148896 Dec  9 12:47 javaws
-rwxr-xr-x 1 root root   8832 Dec  9 12:47 jcmd
-rwxr-xr-x 1 root root   8856 Dec  9 12:47 jconsole
-rwxr-xr-x 1 root root   6264 Dec  9 12:47 jcontrol
-rwxr-xr-x 1 root root   8848 Dec  9 12:47 jdb
-rwxr-xr-x 1 root root   8832 Dec  9 12:47 jdeps
-rwxr-xr-x 1 root root   8832 Dec  9 12:47 jhat
-rwxr-xr-x 1 root root   8896 Dec  9 12:47 jinfo
-rwxr-xr-x 1 root root   8832 Dec  9 12:47 jjs
-rwxr-xr-x 1 root root   8896 Dec  9 12:47 jmap
-rwxr-xr-x 1 root root   8832 Dec  9 12:47 jps
-rwxr-xr-x 1 root root   8840 Dec  9 12:47 jrunscript
-rwxr-xr-x 1 root root   8848 Dec  9 12:47 jsadebugd
-rwxr-xr-x 1 root root   8896 Dec  9 12:47 jstack
-rwxr-xr-x 1 root root   8832 Dec  9 12:47 jstat
-rwxr-xr-x 1 root root   8832 Dec  9 12:47 jstatd
-rwxr-xr-x 1 root root   5110 Jan 14  2017 jvisualvm
-rwxr-xr-x 1 root root   8832 Dec  9 12:47 keytool
-rwxr-xr-x 1 root root   8840 Dec  9 12:47 native2ascii
-rwxr-xr-x 1 root root   8904 Dec  9 12:47 orbd
-rwxr-xr-x 1 root root   8832 Dec  9 12:47 pack200
-rwxr-xr-x 1 root root   8840 Dec  9 12:47 policytool
-rwxr-xr-x 1 root root   8832 Dec  9 12:47 rmic
-rwxr-xr-x 1 root root   8832 Dec  9 12:47 rmid
-rwxr-xr-x 1 root root   8840 Dec  9 12:47 rmiregistry
-rwxr-xr-x 1 root root   8832 Dec  9 12:47 schemagen
-rwxr-xr-x 1 root root   8832 Dec  9 12:47 serialver
-rwxr-xr-x 1 root root   8840 Dec  9 12:47 servertool
-rwxr-xr-x 1 root root   8904 Dec  9 12:47 tnameserv
-rwxr-xr-x 1 root root 186960 Dec  9 12:47 unpack200
-rwxr-xr-x 1 root root   8832 Dec  9 12:47 wsgen
-rwxr-xr-x 1 root root   8832 Dec  9 12:47 wsimport
-rwxr-xr-x 1 root root   8832 Dec  9 12:47 xjc
+ /home/jenkins/tools/java/latest1.8/bin/java -version
java version "1.8.0_281"
Java(TM) SE Runtime Environment (build 1.8.0_281-b09)
Java HotSpot(TM) 64-Bit Server VM (build 25.281-b09, mixed mode)
+ echo which java
which java
+ which java
/home/jenkins/tools/java/latest1.8/bin/java
+ java -version
java version "1.8.0_281"
Java(TM) SE Runtime Environment (build 1.8.0_281-b09)
Java HotSpot(TM) 64-Bit Server VM (build 25.281-b09, mixed mode)
+ echo which javac
which javac
+ which javac
/home/jenkins/tools/java/latest1.8/bin/javac
+ javac -version
javac 1.8.0_281
+ echo Ant-Home:
Ant-Home:
+ ls -al
total 476
drwxr-xr-x 16 jenkins jenkins   4096 Jan 19 01:12 .
drwxr-xr-x  6 jenkins jenkins   4096 Feb  6 14:02 ..
drwxr-xr-x 30 jenkins jenkins   4096 Nov 12 01:14 build
-rw-r--r--  1 jenkins jenkins  14850 Jan 19 01:12 build.gradle
-rw-r--r--  1 jenkins jenkins    172 Feb  7 01:12 build.javacheck.xml
-rw-r--r--  1 jenkins jenkins 157398 Jan 24 01:12 build.xml
-rw-r--r--  1 jenkins jenkins   3345 Dec 18 01:12 .classpath
-rw-r--r--  1 jenkins jenkins   6325 Jan 18 01:12 doap_POI.rdf
-rw-r--r--  1 jenkins jenkins   2934 Jan  9 01:12 file-leak-detector.exclude
-rw-r--r--  1 jenkins jenkins   6229 Nov 12 01:13 forrest.properties
-rw-r--r--  1 jenkins jenkins     53 Nov 12 01:13 .gitattributes
drwxr-xr-x  3 jenkins jenkins   4096 Dec 21 01:12 .github
-rw-r--r--  1 jenkins jenkins    482 Dec 13 19:13 .gitignore
drwxr-xr-x  3 jenkins jenkins   4096 Nov 12 01:13 gradle
drwxr-xr-x  7 jenkins jenkins   4096 Jan 31 01:13 .gradle
-rwxr-xr-x  1 jenkins jenkins   5770 Jan 19 01:12 gradlew
-rw-r--r--  1 jenkins jenkins   3058 Jan 19 01:12 gradlew.bat
drwxr-xr-x  2 jenkins jenkins   4096 Jan  6 01:15 jenkins
-rw-r--r--  1 jenkins jenkins 167284 Nov 12 01:13 KEYS
drwxr-xr-x  2 jenkins jenkins   4096 Nov 12 01:13 legal
drwxr-xr-x  9 jenkins jenkins   4096 Nov 12 01:14 lib
drwxr-xr-x  2 jenkins jenkins   4096 Jan 14 01:12 maven
drwxr-xr-x  3 jenkins jenkins   4096 Jan 18 01:12 osgi
-rw-r--r--  1 jenkins jenkins   4813 Nov 12 01:13 patch.xml
-rw-r--r--  1 jenkins jenkins    426 Nov 12 01:13 .project
-rw-r--r--  1 jenkins jenkins   4278 Dec 13 19:13 README.rst
drwxr-xr-x  2 jenkins jenkins   4096 Nov 12 01:13 .settings
-rw-r--r--  1 jenkins jenkins    556 Nov 12 01:13 settings.gradle
drwxr-xr-x  9 jenkins jenkins   4096 Jan 14 01:12 sonar
drwxr-xr-x 16 jenkins jenkins   4096 Nov 12 01:14 src
drwxr-xr-x  4 jenkins jenkins   4096 Feb  8 01:12 .svn
drwxr-xr-x 15 jenkins jenkins   4096 Jan  6 01:15 test-data
-rw-r--r--  1 jenkins jenkins    419 Dec  8 01:12 .travis.yml
+ echo which ant
which ant
+ which ant
/usr/bin/ant
+ ant -version
Apache Ant(TM) version 1.10.5 compiled on March 28 2019
+ echo <project default="test"><target name="test"><echo>Java ${ant.java.version}/${java.version}</echo><exec executable="javac"><arg value="-version"/></exec></target></project>
+ ant -f build.javacheck.xml -v
Apache Ant(TM) version 1.10.5 compiled on March 28 2019
Buildfile: <https://ci-builds.apache.org/job/POI/job/POI-DSL-API-Check/ws/build.javacheck.xml>
Detected Java version: 1.8 in: /usr/local/asfpackages/java/oraclejdk-1.8.0-281/jre
Detected OS: Linux
parsing buildfile <https://ci-builds.apache.org/job/POI/job/POI-DSL-API-Check/ws/build.javacheck.xml> with URI = <https://ci-builds.apache.org/job/POI/job/POI-DSL-API-Check/ws/build.javacheck.xml>
Project base dir set to: <https://ci-builds.apache.org/job/POI/job/POI-DSL-API-Check/ws/>
Build sequence for target(s) `test' is [test]
Complete build sequence is [test, ]

test:
parsing buildfile jar:file:/usr/share/ant/lib/ant.jar!/org/apache/tools/ant/antlib.xml with URI = jar:file:/usr/share/ant/lib/ant.jar!/org/apache/tools/ant/antlib.xml from a zip file
     [echo] Java 1.8/1.8.0_281
     [exec] Current OS is Linux
     [exec] Executing 'javac' with arguments:
     [exec] '-version'
     [exec]
     [exec] The ' characters around the executable and arguments are
     [exec] not part of the command.
     [exec] javac 1.8.0_281

BUILD SUCCESSFUL
Total time: 0 seconds
+ exit 0
[Gradle] - Launching build.
[POI-DSL-API-Check] $ <https://ci-builds.apache.org/job/POI/job/POI-DSL-API-Check/ws/gradlew> japicmp
To honour the JVM settings for this build a single-use Daemon process will be forked. See https://docs.gradle.org/6.8/userguide/gradle_daemon.html#sec:disabling_the_daemon.
Daemon will be stopped at the end of the build

> Configure project :
Trying to override old definition of datatype junit

> Task :main:compileJava UP-TO-DATE
> Task :main:processResources UP-TO-DATE
> Task :main:classes UP-TO-DATE
> Task :main:jar UP-TO-DATE
> Task :ooxml:ant-check-jars
> Task :ooxml:ant-fetch-jars
> Task :ooxml:ant-check-ooxml-jars
> Task :ooxml:ant-fetch-ooxml-jars

> Task :ooxml:ant-init
[ant:echo] Using Ant: Apache Ant(TM) version 1.10.9 compiled on September 27 2020 from ${ant.home}, Ant detected Java 1.8 (may be different than actual Java sometimes...)
[ant:echo] Using Java: 1.8.0_281/1.8.0_281-b09/25.281-b09/Java HotSpot(TM) 64-Bit Server VM from Oracle Corporation on Linux: 4.15.0-58-generic
[ant:echo] Building Apache POI version 5.0.1-SNAPSHOT and RC: RC1

> Task :ooxml:ant-check-compiled-ooxml-xsds
> Task :ooxml:ant-compile-ooxml-xsds
> Task :scratchpad:compileJava UP-TO-DATE
> Task :scratchpad:processResources UP-TO-DATE
> Task :scratchpad:classes UP-TO-DATE
> Task :scratchpad:jar UP-TO-DATE
> Task :ooxml:compileJava UP-TO-DATE
> Task :ooxml:processResources UP-TO-DATE
> Task :ooxml:classes UP-TO-DATE
> Task :ooxml:jar UP-TO-DATE
> Task :examples:compileJava UP-TO-DATE
> Task :examples:processResources NO-SOURCE
> Task :examples:classes UP-TO-DATE
> Task :examples:jar UP-TO-DATE
> Task :examples:japicmp SKIPPED
> Task :excelant:compileJava UP-TO-DATE
> Task :excelant:processResources UP-TO-DATE
> Task :excelant:classes UP-TO-DATE
> Task :excelant:jar UP-TO-DATE
> Task :excelant:japicmp FAILED

FAILURE: Build failed with an exception.

* What went wrong:
Execution failed for task ':excelant:japicmp'.
> Failed to load file from jar 'META-INF/versions/9/module-info.class' as class file: invalid constant type: 19 at 3.

* Try:
Run with --stacktrace option to get the stack trace. Run with --info or --debug option to get more log output. Run with --scan to get full insights.

* Get more help at https://help.gradle.org

Deprecated Gradle features were used in this build, making it incompatible with Gradle 7.0.
Use '--warning-mode all' to show the individual deprecation warnings.
See https://docs.gradle.org/6.8/userguide/command_line_interface.html#sec:command_line_warnings

BUILD FAILED in 26s
22 actionable tasks: 8 executed, 14 up-to-date
Build step 'Invoke Gradle script' changed build result to FAILURE
Build step 'Invoke Gradle script' marked build as failure
Archiving artifacts
[Fast Archiver] Compressed 29.34 MB of artifacts by 99.2% relative to #90

---------------------------------------------------------------------
To unsubscribe, e-mail: [hidden email]
For additional commands, e-mail: [hidden email]

Reply | Threaded
Open this post in threaded view
|

Build failed in Jenkins: POI » POI-DSL-API-Check #105

Apache Jenkins Server
See <https://ci-builds.apache.org/job/POI/job/POI-DSL-API-Check/105/display/redirect?page=changes>

Changes:

[Alain Béarez] Import slide notes when importing slide content

[Alain Béarez] Fix slide notes content import part from bug 57835


------------------------------------------
[...truncated 1.11 KB...]

<-- Got one external: forrest.properties, svn url: https://svn.apache.org/repos/asf/poi/site/forrest.properties -->
Fetching 'https://svn.apache.org/repos/asf/poi/site/forrest.properties' at -1 into '<https://ci-builds.apache.org/job/POI/job/POI-DSL-API-Check/ws/forrest.properties'>
At revision 1886344


<-- Got one external: documentation, svn url: https://svn.apache.org/repos/asf/poi/site/src/documentation -->
Fetching 'https://svn.apache.org/repos/asf/poi/site/src/documentation' at -1 into '<https://ci-builds.apache.org/job/POI/job/POI-DSL-API-Check/ws/src/documentation'>
U         src/documentation/content/xdocs/changes.xml
At revision 1886344

At revision 1886344

No changes for https://svn.apache.org/repos/asf/poi/site/forrest.properties since the previous build
[POI-DSL-API-Check] $ /bin/sh -xe /tmp/jenkins7041240213880045001.sh
+ svn status
?       build.javacheck.xml
    X   forrest.properties
X       src/documentation

Performing status on external item at 'src/documentation':
+ echo Java-Home: /home/jenkins/tools/java/latest1.8
Java-Home: /home/jenkins/tools/java/latest1.8
+ ls -al /home/jenkins/tools/java/latest1.8/
total 25824
drwxr-xr-x  8 root root     4096 Jan 29 21:12 .
drwxr-xr-x 42 root root     4096 Feb  7 13:06 ..
drwxr-xr-x  2 root root     4096 Jan 29 21:12 bin
-r--r--r--  1 root root     3244 Dec  9 12:47 COPYRIGHT
drwxr-xr-x  3 root root     4096 Jan 29 21:12 include
-rw-r--r--  1 root root  5226870 Dec  9 10:15 javafx-src.zip
-rw-r--r--  1 root root      195 Dec  9 12:47 jmc.txt
drwxr-xr-x  6 root root     4096 Jan 29 21:12 jre
drwxr-xr-x  4 root root     4096 Jan 29 21:12 legal
drwxr-xr-x  4 root root     4096 Jan 29 21:12 lib
-r--r--r--  1 root root       44 Dec  9 12:47 LICENSE
drwxr-xr-x  4 root root     4096 Jan 29 21:12 man
-r--r--r--  1 root root      159 Dec  9 12:47 README.html
-rw-r--r--  1 root root      424 Dec  9 12:47 release
-rw-r--r--  1 root root 21147701 Dec  9 12:47 src.zip
-rw-r--r--  1 root root      190 Dec  9 10:15 THIRDPARTYLICENSEREADME-JAVAFX.txt
-r--r--r--  1 root root      190 Dec  9 12:47 THIRDPARTYLICENSEREADME.txt
+ ls -al /home/jenkins/tools/java/latest1.8/bin
total 836
drwxr-xr-x 2 root root   4096 Jan 29 21:12 .
drwxr-xr-x 8 root root   4096 Jan 29 21:12 ..
-rwxr-xr-x 1 root root   8840 Dec  9 12:47 appletviewer
lrwxrwxrwx 1 root root      8 Dec  9 12:47 ControlPanel -> jcontrol
-rwxr-xr-x 1 root root   8832 Dec  9 12:47 extcheck
-rwxr-xr-x 1 root root   8832 Dec  9 12:47 idlj
-rwxr-xr-x 1 root root   8832 Dec  9 12:47 jar
-rwxr-xr-x 1 root root   8832 Dec  9 12:47 jarsigner
-rwxr-xr-x 1 root root   8712 Dec  9 12:47 java
-rwxr-xr-x 1 root root   8832 Dec  9 12:47 javac
-rwxr-xr-x 1 root root   8832 Dec  9 12:47 javadoc
-rwxr-xr-x 1 root root   2293 Dec  9 10:15 javafxpackager
-rwxr-xr-x 1 root root   8832 Dec  9 12:47 javah
-rwxr-xr-x 1 root root   8832 Dec  9 12:47 javap
-rwxr-xr-x 1 root root   2293 Dec  9 10:15 javapackager
-rwxr-xr-x 1 root root   1809 Dec  9 12:47 java-rmi.cgi
-rwxr-xr-x 1 root root 148896 Dec  9 12:47 javaws
-rwxr-xr-x 1 root root   8832 Dec  9 12:47 jcmd
-rwxr-xr-x 1 root root   8856 Dec  9 12:47 jconsole
-rwxr-xr-x 1 root root   6264 Dec  9 12:47 jcontrol
-rwxr-xr-x 1 root root   8848 Dec  9 12:47 jdb
-rwxr-xr-x 1 root root   8832 Dec  9 12:47 jdeps
-rwxr-xr-x 1 root root   8832 Dec  9 12:47 jhat
-rwxr-xr-x 1 root root   8896 Dec  9 12:47 jinfo
-rwxr-xr-x 1 root root   8832 Dec  9 12:47 jjs
-rwxr-xr-x 1 root root   8896 Dec  9 12:47 jmap
-rwxr-xr-x 1 root root   8832 Dec  9 12:47 jps
-rwxr-xr-x 1 root root   8840 Dec  9 12:47 jrunscript
-rwxr-xr-x 1 root root   8848 Dec  9 12:47 jsadebugd
-rwxr-xr-x 1 root root   8896 Dec  9 12:47 jstack
-rwxr-xr-x 1 root root   8832 Dec  9 12:47 jstat
-rwxr-xr-x 1 root root   8832 Dec  9 12:47 jstatd
-rwxr-xr-x 1 root root   5110 Jan 14  2017 jvisualvm
-rwxr-xr-x 1 root root   8832 Dec  9 12:47 keytool
-rwxr-xr-x 1 root root   8840 Dec  9 12:47 native2ascii
-rwxr-xr-x 1 root root   8904 Dec  9 12:47 orbd
-rwxr-xr-x 1 root root   8832 Dec  9 12:47 pack200
-rwxr-xr-x 1 root root   8840 Dec  9 12:47 policytool
-rwxr-xr-x 1 root root   8832 Dec  9 12:47 rmic
-rwxr-xr-x 1 root root   8832 Dec  9 12:47 rmid
-rwxr-xr-x 1 root root   8840 Dec  9 12:47 rmiregistry
-rwxr-xr-x 1 root root   8832 Dec  9 12:47 schemagen
-rwxr-xr-x 1 root root   8832 Dec  9 12:47 serialver
-rwxr-xr-x 1 root root   8840 Dec  9 12:47 servertool
-rwxr-xr-x 1 root root   8904 Dec  9 12:47 tnameserv
-rwxr-xr-x 1 root root 186960 Dec  9 12:47 unpack200
-rwxr-xr-x 1 root root   8832 Dec  9 12:47 wsgen
-rwxr-xr-x 1 root root   8832 Dec  9 12:47 wsimport
-rwxr-xr-x 1 root root   8832 Dec  9 12:47 xjc
+ /home/jenkins/tools/java/latest1.8/bin/java -version
java version "1.8.0_281"
Java(TM) SE Runtime Environment (build 1.8.0_281-b09)
Java HotSpot(TM) 64-Bit Server VM (build 25.281-b09, mixed mode)
+ echo which java
which java
+ which java
/home/jenkins/tools/java/latest1.8/bin/java
+ java -version
java version "1.8.0_281"
Java(TM) SE Runtime Environment (build 1.8.0_281-b09)
Java HotSpot(TM) 64-Bit Server VM (build 25.281-b09, mixed mode)
+ echo which javac
which javac
+ which javac
/home/jenkins/tools/java/latest1.8/bin/javac
+ javac -version
javac 1.8.0_281
+ echo Ant-Home:
Ant-Home:
+ ls -al
total 476
drwxr-xr-x 16 jenkins jenkins   4096 Jan 19 01:12 .
drwxr-xr-x  5 jenkins jenkins   4096 Feb  8 14:15 ..
drwxr-xr-x 30 jenkins jenkins   4096 Nov 12 01:14 build
-rw-r--r--  1 jenkins jenkins  14850 Jan 19 01:12 build.gradle
-rw-r--r--  1 jenkins jenkins    172 Feb  8 01:12 build.javacheck.xml
-rw-r--r--  1 jenkins jenkins 157398 Jan 24 01:12 build.xml
-rw-r--r--  1 jenkins jenkins   3345 Dec 18 01:12 .classpath
-rw-r--r--  1 jenkins jenkins   6325 Jan 18 01:12 doap_POI.rdf
-rw-r--r--  1 jenkins jenkins   2934 Jan  9 01:12 file-leak-detector.exclude
-rw-r--r--  1 jenkins jenkins   6229 Nov 12 01:13 forrest.properties
-rw-r--r--  1 jenkins jenkins     53 Nov 12 01:13 .gitattributes
drwxr-xr-x  3 jenkins jenkins   4096 Dec 21 01:12 .github
-rw-r--r--  1 jenkins jenkins    482 Dec 13 19:13 .gitignore
drwxr-xr-x  3 jenkins jenkins   4096 Nov 12 01:13 gradle
drwxr-xr-x  7 jenkins jenkins   4096 Jan 31 01:13 .gradle
-rwxr-xr-x  1 jenkins jenkins   5770 Jan 19 01:12 gradlew
-rw-r--r--  1 jenkins jenkins   3058 Jan 19 01:12 gradlew.bat
drwxr-xr-x  2 jenkins jenkins   4096 Jan  6 01:15 jenkins
-rw-r--r--  1 jenkins jenkins 167284 Nov 12 01:13 KEYS
drwxr-xr-x  2 jenkins jenkins   4096 Nov 12 01:13 legal
drwxr-xr-x  9 jenkins jenkins   4096 Nov 12 01:14 lib
drwxr-xr-x  2 jenkins jenkins   4096 Jan 14 01:12 maven
drwxr-xr-x  3 jenkins jenkins   4096 Jan 18 01:12 osgi
-rw-r--r--  1 jenkins jenkins   4813 Nov 12 01:13 patch.xml
-rw-r--r--  1 jenkins jenkins    426 Nov 12 01:13 .project
-rw-r--r--  1 jenkins jenkins   4278 Dec 13 19:13 README.rst
drwxr-xr-x  2 jenkins jenkins   4096 Nov 12 01:13 .settings
-rw-r--r--  1 jenkins jenkins    556 Nov 12 01:13 settings.gradle
drwxr-xr-x  9 jenkins jenkins   4096 Jan 14 01:12 sonar
drwxr-xr-x 16 jenkins jenkins   4096 Nov 12 01:14 src
drwxr-xr-x  4 jenkins jenkins   4096 Feb  9 01:12 .svn
drwxr-xr-x 15 jenkins jenkins   4096 Jan  6 01:15 test-data
-rw-r--r--  1 jenkins jenkins    419 Dec  8 01:12 .travis.yml
+ echo which ant
which ant
+ which ant
/usr/bin/ant
+ ant -version
Apache Ant(TM) version 1.10.5 compiled on March 28 2019
+ echo <project default="test"><target name="test"><echo>Java ${ant.java.version}/${java.version}</echo><exec executable="javac"><arg value="-version"/></exec></target></project>
+ ant -f build.javacheck.xml -v
Apache Ant(TM) version 1.10.5 compiled on March 28 2019
Buildfile: <https://ci-builds.apache.org/job/POI/job/POI-DSL-API-Check/ws/build.javacheck.xml>
Detected Java version: 1.8 in: /usr/local/asfpackages/java/oraclejdk-1.8.0-281/jre
Detected OS: Linux
parsing buildfile <https://ci-builds.apache.org/job/POI/job/POI-DSL-API-Check/ws/build.javacheck.xml> with URI = <https://ci-builds.apache.org/job/POI/job/POI-DSL-API-Check/ws/build.javacheck.xml>
Project base dir set to: <https://ci-builds.apache.org/job/POI/job/POI-DSL-API-Check/ws/>
Build sequence for target(s) `test' is [test]
Complete build sequence is [test, ]

test:
parsing buildfile jar:file:/usr/share/ant/lib/ant.jar!/org/apache/tools/ant/antlib.xml with URI = jar:file:/usr/share/ant/lib/ant.jar!/org/apache/tools/ant/antlib.xml from a zip file
     [echo] Java 1.8/1.8.0_281
     [exec] Current OS is Linux
     [exec] Executing 'javac' with arguments:
     [exec] '-version'
     [exec]
     [exec] The ' characters around the executable and arguments are
     [exec] not part of the command.
     [exec] javac 1.8.0_281

BUILD SUCCESSFUL
Total time: 0 seconds
+ exit 0
[Gradle] - Launching build.
[POI-DSL-API-Check] $ <https://ci-builds.apache.org/job/POI/job/POI-DSL-API-Check/ws/gradlew> japicmp
To honour the JVM settings for this build a single-use Daemon process will be forked. See https://docs.gradle.org/6.8/userguide/gradle_daemon.html#sec:disabling_the_daemon.
Daemon will be stopped at the end of the build

> Configure project :
Trying to override old definition of datatype junit

> Task :main:compileJava UP-TO-DATE
> Task :main:processResources UP-TO-DATE
> Task :main:classes UP-TO-DATE
> Task :main:jar UP-TO-DATE
> Task :ooxml:ant-check-jars
> Task :ooxml:ant-fetch-jars
> Task :ooxml:ant-check-ooxml-jars
> Task :ooxml:ant-fetch-ooxml-jars

> Task :ooxml:ant-init
[ant:echo] Using Ant: Apache Ant(TM) version 1.10.9 compiled on September 27 2020 from ${ant.home}, Ant detected Java 1.8 (may be different than actual Java sometimes...)
[ant:echo] Using Java: 1.8.0_281/1.8.0_281-b09/25.281-b09/Java HotSpot(TM) 64-Bit Server VM from Oracle Corporation on Linux: 4.15.0-58-generic
[ant:echo] Building Apache POI version 5.0.1-SNAPSHOT and RC: RC1

> Task :ooxml:ant-check-compiled-ooxml-xsds
> Task :ooxml:ant-compile-ooxml-xsds
> Task :scratchpad:compileJava UP-TO-DATE
> Task :scratchpad:processResources UP-TO-DATE
> Task :scratchpad:classes UP-TO-DATE
> Task :scratchpad:jar UP-TO-DATE

> Task :ooxml:compileJava
Note: Some input files use or override a deprecated API.
Note: Recompile with -Xlint:deprecation for details.
Note: <https://ci-builds.apache.org/job/POI/job/POI-DSL-API-Check/ws/src/ooxml/java/org/apache/poi/xslf/draw/SVGImageRenderer.java> uses unchecked or unsafe operations.
Note: Recompile with -Xlint:unchecked for details.

> Task :ooxml:processResources UP-TO-DATE
> Task :ooxml:classes
> Task :ooxml:jar
> Task :examples:compileJava UP-TO-DATE
> Task :examples:processResources NO-SOURCE
> Task :examples:classes UP-TO-DATE
> Task :examples:jar UP-TO-DATE
> Task :examples:japicmp SKIPPED
> Task :excelant:compileJava UP-TO-DATE
> Task :excelant:processResources UP-TO-DATE
> Task :excelant:classes UP-TO-DATE
> Task :excelant:jar UP-TO-DATE
> Task :excelant:japicmp FAILED

FAILURE: Build failed with an exception.

* What went wrong:
Execution failed for task ':excelant:japicmp'.
> Failed to load file from jar 'META-INF/versions/9/module-info.class' as class file: invalid constant type: 19 at 3.

* Try:
Run with --stacktrace option to get the stack trace. Run with --info or --debug option to get more log output. Run with --scan to get full insights.

* Get more help at https://help.gradle.org

Deprecated Gradle features were used in this build, making it incompatible with Gradle 7.0.
Use '--warning-mode all' to show the individual deprecation warnings.
See https://docs.gradle.org/6.8/userguide/command_line_interface.html#sec:command_line_warnings

BUILD FAILED in 23s
22 actionable tasks: 10 executed, 12 up-to-date
Build step 'Invoke Gradle script' changed build result to FAILURE
Build step 'Invoke Gradle script' marked build as failure
Archiving artifacts
[Fast Archiver] Compressed 29.34 MB of artifacts by 99.2% relative to #90

---------------------------------------------------------------------
To unsubscribe, e-mail: [hidden email]
For additional commands, e-mail: [hidden email]

Reply | Threaded
Open this post in threaded view
|

Build failed in Jenkins: POI » POI-DSL-API-Check #106

Apache Jenkins Server
See <https://ci-builds.apache.org/job/POI/job/POI-DSL-API-Check/106/display/redirect?page=changes>

Changes:

[Marius Volkhart] Fix GitHub Action yaml for Gradle build


------------------------------------------
[...truncated 379 B...]
[EnvInject] - Injecting contributions.
Building remotely on H22 (ubuntu) in workspace <https://ci-builds.apache.org/job/POI/job/POI-DSL-API-Check/ws/>
[WS-CLEANUP] Deleting project workspace...
[WS-CLEANUP] Done
Updating https://svn.apache.org/repos/asf/poi/trunk at revision '2021-02-12T01:12:11.792 +0000'
U         .github/workflows/test-gradle.yml

<-- Got one external: forrest.properties, svn url: https://svn.apache.org/repos/asf/poi/site/forrest.properties -->
Fetching 'https://svn.apache.org/repos/asf/poi/site/forrest.properties' at -1 into '<https://ci-builds.apache.org/job/POI/job/POI-DSL-API-Check/ws/forrest.properties'>
At revision 1886450


<-- Got one external: documentation, svn url: https://svn.apache.org/repos/asf/poi/site/src/documentation -->
Fetching 'https://svn.apache.org/repos/asf/poi/site/src/documentation' at -1 into '<https://ci-builds.apache.org/job/POI/job/POI-DSL-API-Check/ws/src/documentation'>
At revision 1886450

At revision 1886450

No changes for https://svn.apache.org/repos/asf/poi/site/forrest.properties since the previous build
No changes for https://svn.apache.org/repos/asf/poi/site/src/documentation since the previous build
[POI-DSL-API-Check] $ /bin/sh -xe /tmp/jenkins2481231391435352530.sh
+ svn status
?       build.javacheck.xml
    X   forrest.properties
X       src/documentation

Performing status on external item at 'src/documentation':
+ echo Java-Home: /home/jenkins/tools/java/latest1.8
Java-Home: /home/jenkins/tools/java/latest1.8
+ ls -al /home/jenkins/tools/java/latest1.8/
total 25824
drwxr-xr-x  8 root root     4096 Jan 29 21:12 .
drwxr-xr-x 42 root root     4096 Feb  7 13:06 ..
drwxr-xr-x  2 root root     4096 Jan 29 21:12 bin
-r--r--r--  1 root root     3244 Dec  9 12:47 COPYRIGHT
drwxr-xr-x  3 root root     4096 Jan 29 21:12 include
-rw-r--r--  1 root root  5226870 Dec  9 10:15 javafx-src.zip
-rw-r--r--  1 root root      195 Dec  9 12:47 jmc.txt
drwxr-xr-x  6 root root     4096 Jan 29 21:12 jre
drwxr-xr-x  4 root root     4096 Jan 29 21:12 legal
drwxr-xr-x  4 root root     4096 Jan 29 21:12 lib
-r--r--r--  1 root root       44 Dec  9 12:47 LICENSE
drwxr-xr-x  4 root root     4096 Jan 29 21:12 man
-r--r--r--  1 root root      159 Dec  9 12:47 README.html
-rw-r--r--  1 root root      424 Dec  9 12:47 release
-rw-r--r--  1 root root 21147701 Dec  9 12:47 src.zip
-rw-r--r--  1 root root      190 Dec  9 10:15 THIRDPARTYLICENSEREADME-JAVAFX.txt
-r--r--r--  1 root root      190 Dec  9 12:47 THIRDPARTYLICENSEREADME.txt
+ ls -al /home/jenkins/tools/java/latest1.8/bin
total 836
drwxr-xr-x 2 root root   4096 Jan 29 21:12 .
drwxr-xr-x 8 root root   4096 Jan 29 21:12 ..
-rwxr-xr-x 1 root root   8840 Dec  9 12:47 appletviewer
lrwxrwxrwx 1 root root      8 Dec  9 12:47 ControlPanel -> jcontrol
-rwxr-xr-x 1 root root   8832 Dec  9 12:47 extcheck
-rwxr-xr-x 1 root root   8832 Dec  9 12:47 idlj
-rwxr-xr-x 1 root root   8832 Dec  9 12:47 jar
-rwxr-xr-x 1 root root   8832 Dec  9 12:47 jarsigner
-rwxr-xr-x 1 root root   8712 Dec  9 12:47 java
-rwxr-xr-x 1 root root   8832 Dec  9 12:47 javac
-rwxr-xr-x 1 root root   8832 Dec  9 12:47 javadoc
-rwxr-xr-x 1 root root   2293 Dec  9 10:15 javafxpackager
-rwxr-xr-x 1 root root   8832 Dec  9 12:47 javah
-rwxr-xr-x 1 root root   8832 Dec  9 12:47 javap
-rwxr-xr-x 1 root root   2293 Dec  9 10:15 javapackager
-rwxr-xr-x 1 root root   1809 Dec  9 12:47 java-rmi.cgi
-rwxr-xr-x 1 root root 148896 Dec  9 12:47 javaws
-rwxr-xr-x 1 root root   8832 Dec  9 12:47 jcmd
-rwxr-xr-x 1 root root   8856 Dec  9 12:47 jconsole
-rwxr-xr-x 1 root root   6264 Dec  9 12:47 jcontrol
-rwxr-xr-x 1 root root   8848 Dec  9 12:47 jdb
-rwxr-xr-x 1 root root   8832 Dec  9 12:47 jdeps
-rwxr-xr-x 1 root root   8832 Dec  9 12:47 jhat
-rwxr-xr-x 1 root root   8896 Dec  9 12:47 jinfo
-rwxr-xr-x 1 root root   8832 Dec  9 12:47 jjs
-rwxr-xr-x 1 root root   8896 Dec  9 12:47 jmap
-rwxr-xr-x 1 root root   8832 Dec  9 12:47 jps
-rwxr-xr-x 1 root root   8840 Dec  9 12:47 jrunscript
-rwxr-xr-x 1 root root   8848 Dec  9 12:47 jsadebugd
-rwxr-xr-x 1 root root   8896 Dec  9 12:47 jstack
-rwxr-xr-x 1 root root   8832 Dec  9 12:47 jstat
-rwxr-xr-x 1 root root   8832 Dec  9 12:47 jstatd
-rwxr-xr-x 1 root root   5110 Jan 14  2017 jvisualvm
-rwxr-xr-x 1 root root   8832 Dec  9 12:47 keytool
-rwxr-xr-x 1 root root   8840 Dec  9 12:47 native2ascii
-rwxr-xr-x 1 root root   8904 Dec  9 12:47 orbd
-rwxr-xr-x 1 root root   8832 Dec  9 12:47 pack200
-rwxr-xr-x 1 root root   8840 Dec  9 12:47 policytool
-rwxr-xr-x 1 root root   8832 Dec  9 12:47 rmic
-rwxr-xr-x 1 root root   8832 Dec  9 12:47 rmid
-rwxr-xr-x 1 root root   8840 Dec  9 12:47 rmiregistry
-rwxr-xr-x 1 root root   8832 Dec  9 12:47 schemagen
-rwxr-xr-x 1 root root   8832 Dec  9 12:47 serialver
-rwxr-xr-x 1 root root   8840 Dec  9 12:47 servertool
-rwxr-xr-x 1 root root   8904 Dec  9 12:47 tnameserv
-rwxr-xr-x 1 root root 186960 Dec  9 12:47 unpack200
-rwxr-xr-x 1 root root   8832 Dec  9 12:47 wsgen
-rwxr-xr-x 1 root root   8832 Dec  9 12:47 wsimport
-rwxr-xr-x 1 root root   8832 Dec  9 12:47 xjc
+ /home/jenkins/tools/java/latest1.8/bin/java -version
java version "1.8.0_281"
Java(TM) SE Runtime Environment (build 1.8.0_281-b09)
Java HotSpot(TM) 64-Bit Server VM (build 25.281-b09, mixed mode)
+ echo which java
which java
+ which java
/home/jenkins/tools/java/latest1.8/bin/java
+ java -version
java version "1.8.0_281"
Java(TM) SE Runtime Environment (build 1.8.0_281-b09)
Java HotSpot(TM) 64-Bit Server VM (build 25.281-b09, mixed mode)
+ echo which javac
which javac
+ which javac
/home/jenkins/tools/java/latest1.8/bin/javac
+ javac -version
javac 1.8.0_281
+ echo Ant-Home:
Ant-Home:
+ ls -al
total 476
drwxr-xr-x 16 jenkins jenkins   4096 Jan 19 01:12 .
drwxr-xr-x  4 jenkins jenkins   4096 Feb 11 14:18 ..
drwxr-xr-x 30 jenkins jenkins   4096 Nov 12 01:14 build
-rw-r--r--  1 jenkins jenkins  14850 Jan 19 01:12 build.gradle
-rw-r--r--  1 jenkins jenkins    172 Feb  9 01:12 build.javacheck.xml
-rw-r--r--  1 jenkins jenkins 157398 Jan 24 01:12 build.xml
-rw-r--r--  1 jenkins jenkins   3345 Dec 18 01:12 .classpath
-rw-r--r--  1 jenkins jenkins   6325 Jan 18 01:12 doap_POI.rdf
-rw-r--r--  1 jenkins jenkins   2934 Jan  9 01:12 file-leak-detector.exclude
-rw-r--r--  1 jenkins jenkins   6229 Nov 12 01:13 forrest.properties
-rw-r--r--  1 jenkins jenkins     53 Nov 12 01:13 .gitattributes
drwxr-xr-x  3 jenkins jenkins   4096 Dec 21 01:12 .github
-rw-r--r--  1 jenkins jenkins    482 Dec 13 19:13 .gitignore
drwxr-xr-x  3 jenkins jenkins   4096 Nov 12 01:13 gradle
drwxr-xr-x  7 jenkins jenkins   4096 Jan 31 01:13 .gradle
-rwxr-xr-x  1 jenkins jenkins   5770 Jan 19 01:12 gradlew
-rw-r--r--  1 jenkins jenkins   3058 Jan 19 01:12 gradlew.bat
drwxr-xr-x  2 jenkins jenkins   4096 Jan  6 01:15 jenkins
-rw-r--r--  1 jenkins jenkins 167284 Nov 12 01:13 KEYS
drwxr-xr-x  2 jenkins jenkins   4096 Nov 12 01:13 legal
drwxr-xr-x  9 jenkins jenkins   4096 Nov 12 01:14 lib
drwxr-xr-x  2 jenkins jenkins   4096 Jan 14 01:12 maven
drwxr-xr-x  3 jenkins jenkins   4096 Jan 18 01:12 osgi
-rw-r--r--  1 jenkins jenkins   4813 Nov 12 01:13 patch.xml
-rw-r--r--  1 jenkins jenkins    426 Nov 12 01:13 .project
-rw-r--r--  1 jenkins jenkins   4278 Dec 13 19:13 README.rst
drwxr-xr-x  2 jenkins jenkins   4096 Nov 12 01:13 .settings
-rw-r--r--  1 jenkins jenkins    556 Nov 12 01:13 settings.gradle
drwxr-xr-x  9 jenkins jenkins   4096 Jan 14 01:12 sonar
drwxr-xr-x 16 jenkins jenkins   4096 Nov 12 01:14 src
drwxr-xr-x  4 jenkins jenkins   4096 Feb 12 01:12 .svn
drwxr-xr-x 15 jenkins jenkins   4096 Jan  6 01:15 test-data
-rw-r--r--  1 jenkins jenkins    419 Dec  8 01:12 .travis.yml
+ echo which ant
which ant
+ which ant
/usr/bin/ant
+ ant -version
Apache Ant(TM) version 1.10.5 compiled on March 28 2019
+ echo <project default="test"><target name="test"><echo>Java ${ant.java.version}/${java.version}</echo><exec executable="javac"><arg value="-version"/></exec></target></project>
+ ant -f build.javacheck.xml -v
Apache Ant(TM) version 1.10.5 compiled on March 28 2019
Buildfile: <https://ci-builds.apache.org/job/POI/job/POI-DSL-API-Check/ws/build.javacheck.xml>
Detected Java version: 1.8 in: /usr/local/asfpackages/java/oraclejdk-1.8.0-281/jre
Detected OS: Linux
parsing buildfile <https://ci-builds.apache.org/job/POI/job/POI-DSL-API-Check/ws/build.javacheck.xml> with URI = <https://ci-builds.apache.org/job/POI/job/POI-DSL-API-Check/ws/build.javacheck.xml>
Project base dir set to: <https://ci-builds.apache.org/job/POI/job/POI-DSL-API-Check/ws/>
Build sequence for target(s) `test' is [test]
Complete build sequence is [test, ]

test:
parsing buildfile jar:file:/usr/share/ant/lib/ant.jar!/org/apache/tools/ant/antlib.xml with URI = jar:file:/usr/share/ant/lib/ant.jar!/org/apache/tools/ant/antlib.xml from a zip file
     [echo] Java 1.8/1.8.0_281
     [exec] Current OS is Linux
     [exec] Executing 'javac' with arguments:
     [exec] '-version'
     [exec]
     [exec] The ' characters around the executable and arguments are
     [exec] not part of the command.
     [exec] javac 1.8.0_281

BUILD SUCCESSFUL
Total time: 0 seconds
+ exit 0
[Gradle] - Launching build.
[POI-DSL-API-Check] $ <https://ci-builds.apache.org/job/POI/job/POI-DSL-API-Check/ws/gradlew> japicmp
To honour the JVM settings for this build a single-use Daemon process will be forked. See https://docs.gradle.org/6.8/userguide/gradle_daemon.html#sec:disabling_the_daemon.
Daemon will be stopped at the end of the build

> Configure project :
Trying to override old definition of datatype junit

> Task :main:compileJava UP-TO-DATE
> Task :main:processResources UP-TO-DATE
> Task :main:classes UP-TO-DATE
> Task :main:jar UP-TO-DATE
> Task :ooxml:ant-check-jars
> Task :ooxml:ant-fetch-jars
> Task :ooxml:ant-check-ooxml-jars
> Task :ooxml:ant-fetch-ooxml-jars

> Task :ooxml:ant-init
[ant:echo] Using Ant: Apache Ant(TM) version 1.10.9 compiled on September 27 2020 from ${ant.home}, Ant detected Java 1.8 (may be different than actual Java sometimes...)
[ant:echo] Using Java: 1.8.0_281/1.8.0_281-b09/25.281-b09/Java HotSpot(TM) 64-Bit Server VM from Oracle Corporation on Linux: 4.15.0-58-generic
[ant:echo] Building Apache POI version 5.0.1-SNAPSHOT and RC: RC1

> Task :ooxml:ant-check-compiled-ooxml-xsds
> Task :ooxml:ant-compile-ooxml-xsds
> Task :scratchpad:compileJava UP-TO-DATE
> Task :scratchpad:processResources UP-TO-DATE
> Task :scratchpad:classes UP-TO-DATE
> Task :scratchpad:jar UP-TO-DATE
> Task :ooxml:compileJava UP-TO-DATE
> Task :ooxml:processResources UP-TO-DATE
> Task :ooxml:classes UP-TO-DATE
> Task :ooxml:jar UP-TO-DATE
> Task :examples:compileJava UP-TO-DATE
> Task :examples:processResources NO-SOURCE
> Task :examples:classes UP-TO-DATE
> Task :examples:jar UP-TO-DATE
> Task :examples:japicmp SKIPPED
> Task :excelant:compileJava UP-TO-DATE
> Task :excelant:processResources UP-TO-DATE
> Task :excelant:classes UP-TO-DATE
> Task :excelant:jar UP-TO-DATE
> Task :excelant:japicmp FAILED

FAILURE: Build failed with an exception.

* What went wrong:
Execution failed for task ':excelant:japicmp'.
> Failed to load file from jar 'META-INF/versions/9/module-info.class' as class file: invalid constant type: 19 at 3.

* Try:
Run with --stacktrace option to get the stack trace. Run with --info or --debug option to get more log output. Run with --scan to get full insights.

* Get more help at https://help.gradle.org

Deprecated Gradle features were used in this build, making it incompatible with Gradle 7.0.
Use '--warning-mode all' to show the individual deprecation warnings.
See https://docs.gradle.org/6.8/userguide/command_line_interface.html#sec:command_line_warnings

BUILD FAILED in 16s
22 actionable tasks: 8 executed, 14 up-to-date
Build step 'Invoke Gradle script' changed build result to FAILURE
Build step 'Invoke Gradle script' marked build as failure
Archiving artifacts
[Fast Archiver] Compressed 29.34 MB of artifacts by 99.2% relative to #90

---------------------------------------------------------------------
To unsubscribe, e-mail: [hidden email]
For additional commands, e-mail: [hidden email]

Reply | Threaded
Open this post in threaded view
|

Build failed in Jenkins: POI » POI-DSL-API-Check #107

Apache Jenkins Server
See <https://ci-builds.apache.org/job/POI/job/POI-DSL-API-Check/107/display/redirect?page=changes>

Changes:

[PJ Fanning] fix typo

[PJ Fanning] small refactor

[PJ Fanning] allo XSSFReader to be sublclassed with implementation that allows OOXMl Strict files

[PJ Fanning] batik 1.14


------------------------------------------
[...truncated 380.12 KB...]

No changes for https://svn.apache.org/repos/asf/poi/site/forrest.properties since the previous build
No changes for https://svn.apache.org/repos/asf/poi/site/src/documentation since the previous build
[POI-DSL-API-Check] $ /bin/sh -xe /tmp/jenkins4674456519745029240.sh
+ svn status
    X   forrest.properties
X       src/documentation

Performing status on external item at 'src/documentation':
+ echo Java-Home: /home/jenkins/tools/java/latest1.8
Java-Home: /home/jenkins/tools/java/latest1.8
+ ls -al /home/jenkins/tools/java/latest1.8/
total 25824
drwxr-xr-x  8 root root     4096 Jan 29 21:10 .
drwxr-xr-x 42 root root     4096 Feb  7 13:10 ..
drwxr-xr-x  2 root root     4096 Jan 29 21:10 bin
-r--r--r--  1 root root     3244 Dec  9 12:47 COPYRIGHT
drwxr-xr-x  3 root root     4096 Jan 29 21:10 include
-rw-r--r--  1 root root  5226870 Dec  9 10:15 javafx-src.zip
-rw-r--r--  1 root root      195 Dec  9 12:47 jmc.txt
drwxr-xr-x  6 root root     4096 Jan 29 21:10 jre
drwxr-xr-x  4 root root     4096 Jan 29 21:10 legal
drwxr-xr-x  4 root root     4096 Jan 29 21:10 lib
-r--r--r--  1 root root       44 Dec  9 12:47 LICENSE
drwxr-xr-x  4 root root     4096 Jan 29 21:10 man
-r--r--r--  1 root root      159 Dec  9 12:47 README.html
-rw-r--r--  1 root root      424 Dec  9 12:47 release
-rw-r--r--  1 root root 21147701 Dec  9 12:47 src.zip
-rw-r--r--  1 root root      190 Dec  9 10:15 THIRDPARTYLICENSEREADME-JAVAFX.txt
-r--r--r--  1 root root      190 Dec  9 12:47 THIRDPARTYLICENSEREADME.txt
+ ls -al /home/jenkins/tools/java/latest1.8/bin
total 836
drwxr-xr-x 2 root root   4096 Jan 29 21:10 .
drwxr-xr-x 8 root root   4096 Jan 29 21:10 ..
-rwxr-xr-x 1 root root   8840 Dec  9 12:47 appletviewer
lrwxrwxrwx 1 root root      8 Dec  9 12:47 ControlPanel -> jcontrol
-rwxr-xr-x 1 root root   8832 Dec  9 12:47 extcheck
-rwxr-xr-x 1 root root   8832 Dec  9 12:47 idlj
-rwxr-xr-x 1 root root   8832 Dec  9 12:47 jar
-rwxr-xr-x 1 root root   8832 Dec  9 12:47 jarsigner
-rwxr-xr-x 1 root root   8712 Dec  9 12:47 java
-rwxr-xr-x 1 root root   8832 Dec  9 12:47 javac
-rwxr-xr-x 1 root root   8832 Dec  9 12:47 javadoc
-rwxr-xr-x 1 root root   2293 Dec  9 10:15 javafxpackager
-rwxr-xr-x 1 root root   8832 Dec  9 12:47 javah
-rwxr-xr-x 1 root root   8832 Dec  9 12:47 javap
-rwxr-xr-x 1 root root   2293 Dec  9 10:15 javapackager
-rwxr-xr-x 1 root root   1809 Dec  9 12:47 java-rmi.cgi
-rwxr-xr-x 1 root root 148896 Dec  9 12:47 javaws
-rwxr-xr-x 1 root root   8832 Dec  9 12:47 jcmd
-rwxr-xr-x 1 root root   8856 Dec  9 12:47 jconsole
-rwxr-xr-x 1 root root   6264 Dec  9 12:47 jcontrol
-rwxr-xr-x 1 root root   8848 Dec  9 12:47 jdb
-rwxr-xr-x 1 root root   8832 Dec  9 12:47 jdeps
-rwxr-xr-x 1 root root   8832 Dec  9 12:47 jhat
-rwxr-xr-x 1 root root   8896 Dec  9 12:47 jinfo
-rwxr-xr-x 1 root root   8832 Dec  9 12:47 jjs
-rwxr-xr-x 1 root root   8896 Dec  9 12:47 jmap
-rwxr-xr-x 1 root root   8832 Dec  9 12:47 jps
-rwxr-xr-x 1 root root   8840 Dec  9 12:47 jrunscript
-rwxr-xr-x 1 root root   8848 Dec  9 12:47 jsadebugd
-rwxr-xr-x 1 root root   8896 Dec  9 12:47 jstack
-rwxr-xr-x 1 root root   8832 Dec  9 12:47 jstat
-rwxr-xr-x 1 root root   8832 Dec  9 12:47 jstatd
-rwxr-xr-x 1 root root   5110 Jan 14  2017 jvisualvm
-rwxr-xr-x 1 root root   8832 Dec  9 12:47 keytool
-rwxr-xr-x 1 root root   8840 Dec  9 12:47 native2ascii
-rwxr-xr-x 1 root root   8904 Dec  9 12:47 orbd
-rwxr-xr-x 1 root root   8832 Dec  9 12:47 pack200
-rwxr-xr-x 1 root root   8840 Dec  9 12:47 policytool
-rwxr-xr-x 1 root root   8832 Dec  9 12:47 rmic
-rwxr-xr-x 1 root root   8832 Dec  9 12:47 rmid
-rwxr-xr-x 1 root root   8840 Dec  9 12:47 rmiregistry
-rwxr-xr-x 1 root root   8832 Dec  9 12:47 schemagen
-rwxr-xr-x 1 root root   8832 Dec  9 12:47 serialver
-rwxr-xr-x 1 root root   8840 Dec  9 12:47 servertool
-rwxr-xr-x 1 root root   8904 Dec  9 12:47 tnameserv
-rwxr-xr-x 1 root root 186960 Dec  9 12:47 unpack200
-rwxr-xr-x 1 root root   8832 Dec  9 12:47 wsgen
-rwxr-xr-x 1 root root   8832 Dec  9 12:47 wsimport
-rwxr-xr-x 1 root root   8832 Dec  9 12:47 xjc
+ /home/jenkins/tools/java/latest1.8/bin/java -version
java version "1.8.0_281"
Java(TM) SE Runtime Environment (build 1.8.0_281-b09)
Java HotSpot(TM) 64-Bit Server VM (build 25.281-b09, mixed mode)
+ echo which java
which java
+ which java
/home/jenkins/tools/java/latest1.8/bin/java
+ java -version
java version "1.8.0_281"
Java(TM) SE Runtime Environment (build 1.8.0_281-b09)
Java HotSpot(TM) 64-Bit Server VM (build 25.281-b09, mixed mode)
+ echo which javac
which javac
+ which javac
/home/jenkins/tools/java/latest1.8/bin/javac
+ javac -version
javac 1.8.0_281
+ echo Ant-Home:
Ant-Home:
+ ls -al
total 460
drwxr-xr-x 13 jenkins jenkins   4096 Feb 14 01:13 .
drwxr-xr-x  8 jenkins jenkins   4096 Feb 14 01:12 ..
-rw-r--r--  1 jenkins jenkins  14850 Feb 14 01:12 build.gradle
-rw-r--r--  1 jenkins jenkins 157302 Feb 14 01:12 build.xml
-rw-r--r--  1 jenkins jenkins   3345 Feb 14 01:12 .classpath
-rw-r--r--  1 jenkins jenkins   6325 Feb 14 01:13 doap_POI.rdf
-rw-r--r--  1 jenkins jenkins   2934 Feb 14 01:13 file-leak-detector.exclude
-rw-r--r--  1 jenkins jenkins   6229 Feb 14 01:13 forrest.properties
-rw-r--r--  1 jenkins jenkins     53 Feb 14 01:13 .gitattributes
drwxr-xr-x  3 jenkins jenkins   4096 Feb 14 01:12 .github
-rw-r--r--  1 jenkins jenkins    482 Feb 14 01:13 .gitignore
drwxr-xr-x  3 jenkins jenkins   4096 Feb 14 01:13 gradle
-rwxr-xr-x  1 jenkins jenkins   5770 Feb 14 01:13 gradlew
-rw-r--r--  1 jenkins jenkins   3058 Feb 14 01:13 gradlew.bat
drwxr-xr-x  2 jenkins jenkins   4096 Feb 14 01:13 jenkins
-rw-r--r--  1 jenkins jenkins 167284 Feb 14 01:13 KEYS
drwxr-xr-x  2 jenkins jenkins   4096 Feb 14 01:13 legal
drwxr-xr-x  2 jenkins jenkins   4096 Feb 14 01:12 maven
drwxr-xr-x  3 jenkins jenkins   4096 Feb 14 01:12 osgi
-rw-r--r--  1 jenkins jenkins   4813 Feb 14 01:13 patch.xml
-rw-r--r--  1 jenkins jenkins    426 Feb 14 01:13 .project
-rw-r--r--  1 jenkins jenkins   4278 Feb 14 01:13 README.rst
drwxr-xr-x  2 jenkins jenkins   4096 Feb 14 01:13 .settings
-rw-r--r--  1 jenkins jenkins    556 Feb 14 01:13 settings.gradle
drwxr-xr-x  9 jenkins jenkins   4096 Feb 14 01:12 sonar
drwxr-xr-x 16 jenkins jenkins   4096 Feb 14 01:13 src
drwxr-xr-x  4 jenkins jenkins   4096 Feb 14 01:13 .svn
drwxr-xr-x 15 jenkins jenkins   4096 Feb 14 01:13 test-data
-rw-r--r--  1 jenkins jenkins    419 Feb 14 01:13 .travis.yml
+ echo which ant
which ant
+ which ant
/usr/bin/ant
+ ant -version
Apache Ant(TM) version 1.10.5 compiled on March 28 2019
+ echo <project default="test"><target name="test"><echo>Java ${ant.java.version}/${java.version}</echo><exec executable="javac"><arg value="-version"/></exec></target></project>
+ ant -f build.javacheck.xml -v
Apache Ant(TM) version 1.10.5 compiled on March 28 2019
Buildfile: <https://ci-builds.apache.org/job/POI/job/POI-DSL-API-Check/ws/build.javacheck.xml>
Detected Java version: 1.8 in: /usr/local/asfpackages/java/oraclejdk-1.8.0-281/jre
Detected OS: Linux
parsing buildfile <https://ci-builds.apache.org/job/POI/job/POI-DSL-API-Check/ws/build.javacheck.xml> with URI = <https://ci-builds.apache.org/job/POI/job/POI-DSL-API-Check/ws/build.javacheck.xml>
Project base dir set to: <https://ci-builds.apache.org/job/POI/job/POI-DSL-API-Check/ws/>
Build sequence for target(s) `test' is [test]
Complete build sequence is [test, ]

test:
parsing buildfile jar:file:/usr/share/ant/lib/ant.jar!/org/apache/tools/ant/antlib.xml with URI = jar:file:/usr/share/ant/lib/ant.jar!/org/apache/tools/ant/antlib.xml from a zip file
     [echo] Java 1.8/1.8.0_281
     [exec] Current OS is Linux
     [exec] Executing 'javac' with arguments:
     [exec] '-version'
     [exec]
     [exec] The ' characters around the executable and arguments are
     [exec] not part of the command.
     [exec] javac 1.8.0_281

BUILD SUCCESSFUL
Total time: 1 second
+ exit 0
[Gradle] - Launching build.
[POI-DSL-API-Check] $ <https://ci-builds.apache.org/job/POI/job/POI-DSL-API-Check/ws/gradlew> japicmp
Downloading https://services.gradle.org/distributions/gradle-6.8-bin.zip
..........10%..........20%..........30%...........40%..........50%..........60%..........70%...........80%..........90%..........100%
To honour the JVM settings for this build a single-use Daemon process will be forked. See https://docs.gradle.org/6.8/userguide/gradle_daemon.html#sec:disabling_the_daemon.
Daemon will be stopped at the end of the build

> Configure project :
Trying to override old definition of datatype junit

> Task :main:compileJava
Note: Some input files use or override a deprecated API.
Note: Recompile with -Xlint:deprecation for details.
Note: Some input files use unchecked or unsafe operations.
Note: Recompile with -Xlint:unchecked for details.

> Task :main:processResources
> Task :main:classes
> Task :main:jar
> Task :ooxml:ant-check-jars
> Task :ooxml:ant-fetch-jars
> Task :ooxml:ant-check-ooxml-jars
> Task :ooxml:ant-fetch-ooxml-jars

> Task :ooxml:ant-init
[ant:echo] Using Ant: Apache Ant(TM) version 1.10.9 compiled on September 27 2020 from ${ant.home}, Ant detected Java 1.8 (may be different than actual Java sometimes...)
[ant:echo] Using Java: 1.8.0_281/1.8.0_281-b09/25.281-b09/Java HotSpot(TM) 64-Bit Server VM from Oracle Corporation on Linux: 4.15.0-76-generic
[ant:echo] Building Apache POI version 5.0.1-SNAPSHOT and RC: RC1

> Task :ooxml:ant-check-compiled-ooxml-xsds

> Task :ooxml:ant-compile-ooxml-xsds
SchemaCompiler  Metadata LOAD:org/apache/xmlbeans/metadata GEN:org/apache/poi/schemas/ooxml
Time to build schema type system: 3.073 seconds
Time to generate code: 8.755 seconds

> Task :scratchpad:compileJava
Note: Some input files use or override a deprecated API.
Note: Recompile with -Xlint:deprecation for details.
Note: Some input files use unchecked or unsafe operations.
Note: Recompile with -Xlint:unchecked for details.

> Task :scratchpad:processResources
> Task :scratchpad:classes
> Task :scratchpad:jar

> Task :ooxml:compileJava
Note: Some input files use or override a deprecated API.
Note: Recompile with -Xlint:deprecation for details.
Note: <https://ci-builds.apache.org/job/POI/job/POI-DSL-API-Check/ws/src/ooxml/java/org/apache/poi/xslf/draw/SVGImageRenderer.java> uses unchecked or unsafe operations.
Note: Recompile with -Xlint:unchecked for details.

> Task :ooxml:processResources
> Task :ooxml:classes
> Task :ooxml:jar
> Task :examples:compileJava
> Task :examples:processResources NO-SOURCE
> Task :examples:classes
> Task :examples:jar
> Task :examples:japicmp SKIPPED
> Task :excelant:compileJava
> Task :excelant:processResources
> Task :excelant:classes
> Task :excelant:jar
> Task :excelant:japicmp FAILED

FAILURE: Build failed with an exception.

* What went wrong:
Execution failed for task ':excelant:japicmp'.
> Failed to load file from jar 'META-INF/versions/9/module-info.class' as class file: invalid constant type: 19 at 3.

* Try:
Run with --stacktrace option to get the stack trace. Run with --info or --debug option to get more log output. Run with --scan to get full insights.

* Get more help at https://help.gradle.org

Deprecated Gradle features were used in this build, making it incompatible with Gradle 7.0.
Use '--warning-mode all' to show the individual deprecation warnings.
See https://docs.gradle.org/6.8/userguide/command_line_interface.html#sec:command_line_warnings

BUILD FAILED in 3m 20s
22 actionable tasks: 22 executed
Build step 'Invoke Gradle script' changed build result to FAILURE
Build step 'Invoke Gradle script' marked build as failure
Archiving artifacts

---------------------------------------------------------------------
To unsubscribe, e-mail: [hidden email]
For additional commands, e-mail: [hidden email]

Reply | Threaded
Open this post in threaded view
|

Build failed in Jenkins: POI » POI-DSL-API-Check #108

Apache Jenkins Server
See <https://ci-builds.apache.org/job/POI/job/POI-DSL-API-Check/108/display/redirect?page=changes>

Changes:

[PJ Fanning] add test for reading core properties from ooxml strict file

[PJ Fanning] add missing CTPhoneticRun


------------------------------------------
[...truncated 1.53 KB...]

<-- Got one external: forrest.properties, svn url: https://svn.apache.org/repos/asf/poi/site/forrest.properties -->
Fetching 'https://svn.apache.org/repos/asf/poi/site/forrest.properties' at -1 into '<https://ci-builds.apache.org/job/POI/job/POI-DSL-API-Check/ws/forrest.properties'>
At revision 1886515


<-- Got one external: documentation, svn url: https://svn.apache.org/repos/asf/poi/site/src/documentation -->
Fetching 'https://svn.apache.org/repos/asf/poi/site/src/documentation' at -1 into '<https://ci-builds.apache.org/job/POI/job/POI-DSL-API-Check/ws/src/documentation'>
At revision 1886515

At revision 1886515

No changes for https://svn.apache.org/repos/asf/poi/site/forrest.properties since the previous build
No changes for https://svn.apache.org/repos/asf/poi/site/src/documentation since the previous build
[POI-DSL-API-Check] $ /bin/sh -xe /tmp/jenkins4985846105530363973.sh
+ svn status
?       build.javacheck.xml
    X   forrest.properties
X       src/documentation

Performing status on external item at 'src/documentation':
+ echo Java-Home: /home/jenkins/tools/java/latest1.8
Java-Home: /home/jenkins/tools/java/latest1.8
+ ls -al /home/jenkins/tools/java/latest1.8/
total 25824
drwxr-xr-x  8 root root     4096 Jan 29 21:12 .
drwxr-xr-x 42 root root     4096 Feb  7 13:06 ..
drwxr-xr-x  2 root root     4096 Jan 29 21:12 bin
-r--r--r--  1 root root     3244 Dec  9 12:47 COPYRIGHT
drwxr-xr-x  3 root root     4096 Jan 29 21:12 include
-rw-r--r--  1 root root  5226870 Dec  9 10:15 javafx-src.zip
-rw-r--r--  1 root root      195 Dec  9 12:47 jmc.txt
drwxr-xr-x  6 root root     4096 Jan 29 21:12 jre
drwxr-xr-x  4 root root     4096 Jan 29 21:12 legal
drwxr-xr-x  4 root root     4096 Jan 29 21:12 lib
-r--r--r--  1 root root       44 Dec  9 12:47 LICENSE
drwxr-xr-x  4 root root     4096 Jan 29 21:12 man
-r--r--r--  1 root root      159 Dec  9 12:47 README.html
-rw-r--r--  1 root root      424 Dec  9 12:47 release
-rw-r--r--  1 root root 21147701 Dec  9 12:47 src.zip
-rw-r--r--  1 root root      190 Dec  9 10:15 THIRDPARTYLICENSEREADME-JAVAFX.txt
-r--r--r--  1 root root      190 Dec  9 12:47 THIRDPARTYLICENSEREADME.txt
+ ls -al /home/jenkins/tools/java/latest1.8/bin
total 836
drwxr-xr-x 2 root root   4096 Jan 29 21:12 .
drwxr-xr-x 8 root root   4096 Jan 29 21:12 ..
-rwxr-xr-x 1 root root   8840 Dec  9 12:47 appletviewer
lrwxrwxrwx 1 root root      8 Dec  9 12:47 ControlPanel -> jcontrol
-rwxr-xr-x 1 root root   8832 Dec  9 12:47 extcheck
-rwxr-xr-x 1 root root   8832 Dec  9 12:47 idlj
-rwxr-xr-x 1 root root   8832 Dec  9 12:47 jar
-rwxr-xr-x 1 root root   8832 Dec  9 12:47 jarsigner
-rwxr-xr-x 1 root root   8712 Dec  9 12:47 java
-rwxr-xr-x 1 root root   8832 Dec  9 12:47 javac
-rwxr-xr-x 1 root root   8832 Dec  9 12:47 javadoc
-rwxr-xr-x 1 root root   2293 Dec  9 10:15 javafxpackager
-rwxr-xr-x 1 root root   8832 Dec  9 12:47 javah
-rwxr-xr-x 1 root root   8832 Dec  9 12:47 javap
-rwxr-xr-x 1 root root   2293 Dec  9 10:15 javapackager
-rwxr-xr-x 1 root root   1809 Dec  9 12:47 java-rmi.cgi
-rwxr-xr-x 1 root root 148896 Dec  9 12:47 javaws
-rwxr-xr-x 1 root root   8832 Dec  9 12:47 jcmd
-rwxr-xr-x 1 root root   8856 Dec  9 12:47 jconsole
-rwxr-xr-x 1 root root   6264 Dec  9 12:47 jcontrol
-rwxr-xr-x 1 root root   8848 Dec  9 12:47 jdb
-rwxr-xr-x 1 root root   8832 Dec  9 12:47 jdeps
-rwxr-xr-x 1 root root   8832 Dec  9 12:47 jhat
-rwxr-xr-x 1 root root   8896 Dec  9 12:47 jinfo
-rwxr-xr-x 1 root root   8832 Dec  9 12:47 jjs
-rwxr-xr-x 1 root root   8896 Dec  9 12:47 jmap
-rwxr-xr-x 1 root root   8832 Dec  9 12:47 jps
-rwxr-xr-x 1 root root   8840 Dec  9 12:47 jrunscript
-rwxr-xr-x 1 root root   8848 Dec  9 12:47 jsadebugd
-rwxr-xr-x 1 root root   8896 Dec  9 12:47 jstack
-rwxr-xr-x 1 root root   8832 Dec  9 12:47 jstat
-rwxr-xr-x 1 root root   8832 Dec  9 12:47 jstatd
-rwxr-xr-x 1 root root   5110 Jan 14  2017 jvisualvm
-rwxr-xr-x 1 root root   8832 Dec  9 12:47 keytool
-rwxr-xr-x 1 root root   8840 Dec  9 12:47 native2ascii
-rwxr-xr-x 1 root root   8904 Dec  9 12:47 orbd
-rwxr-xr-x 1 root root   8832 Dec  9 12:47 pack200
-rwxr-xr-x 1 root root   8840 Dec  9 12:47 policytool
-rwxr-xr-x 1 root root   8832 Dec  9 12:47 rmic
-rwxr-xr-x 1 root root   8832 Dec  9 12:47 rmid
-rwxr-xr-x 1 root root   8840 Dec  9 12:47 rmiregistry
-rwxr-xr-x 1 root root   8832 Dec  9 12:47 schemagen
-rwxr-xr-x 1 root root   8832 Dec  9 12:47 serialver
-rwxr-xr-x 1 root root   8840 Dec  9 12:47 servertool
-rwxr-xr-x 1 root root   8904 Dec  9 12:47 tnameserv
-rwxr-xr-x 1 root root 186960 Dec  9 12:47 unpack200
-rwxr-xr-x 1 root root   8832 Dec  9 12:47 wsgen
-rwxr-xr-x 1 root root   8832 Dec  9 12:47 wsimport
-rwxr-xr-x 1 root root   8832 Dec  9 12:47 xjc
+ /home/jenkins/tools/java/latest1.8/bin/java -version
java version "1.8.0_281"
Java(TM) SE Runtime Environment (build 1.8.0_281-b09)
Java HotSpot(TM) 64-Bit Server VM (build 25.281-b09, mixed mode)
+ echo which java
which java
+ which java
/home/jenkins/tools/java/latest1.8/bin/java
+ java -version
java version "1.8.0_281"
Java(TM) SE Runtime Environment (build 1.8.0_281-b09)
Java HotSpot(TM) 64-Bit Server VM (build 25.281-b09, mixed mode)
+ echo which javac
which javac
+ which javac
/home/jenkins/tools/java/latest1.8/bin/javac
+ javac -version
javac 1.8.0_281
+ echo Ant-Home:
Ant-Home:
+ ls -al
total 476
drwxr-xr-x 16 jenkins jenkins   4096 Jan 19 01:12 .
drwxr-xr-x  4 jenkins jenkins   4096 Feb 11 14:18 ..
drwxr-xr-x 30 jenkins jenkins   4096 Nov 12 01:14 build
-rw-r--r--  1 jenkins jenkins  14850 Feb 15 01:12 build.gradle
-rw-r--r--  1 jenkins jenkins    172 Feb 12 01:12 build.javacheck.xml
-rw-r--r--  1 jenkins jenkins 157302 Feb 15 01:12 build.xml
-rw-r--r--  1 jenkins jenkins   3345 Feb 15 01:12 .classpath
-rw-r--r--  1 jenkins jenkins   6325 Jan 18 01:12 doap_POI.rdf
-rw-r--r--  1 jenkins jenkins   2934 Jan  9 01:12 file-leak-detector.exclude
-rw-r--r--  1 jenkins jenkins   6229 Nov 12 01:13 forrest.properties
-rw-r--r--  1 jenkins jenkins     53 Nov 12 01:13 .gitattributes
drwxr-xr-x  3 jenkins jenkins   4096 Dec 21 01:12 .github
-rw-r--r--  1 jenkins jenkins    482 Dec 13 19:13 .gitignore
drwxr-xr-x  3 jenkins jenkins   4096 Nov 12 01:13 gradle
drwxr-xr-x  7 jenkins jenkins   4096 Jan 31 01:13 .gradle
-rwxr-xr-x  1 jenkins jenkins   5770 Jan 19 01:12 gradlew
-rw-r--r--  1 jenkins jenkins   3058 Jan 19 01:12 gradlew.bat
drwxr-xr-x  2 jenkins jenkins   4096 Jan  6 01:15 jenkins
-rw-r--r--  1 jenkins jenkins 167284 Nov 12 01:13 KEYS
drwxr-xr-x  2 jenkins jenkins   4096 Nov 12 01:13 legal
drwxr-xr-x  9 jenkins jenkins   4096 Nov 12 01:14 lib
drwxr-xr-x  2 jenkins jenkins   4096 Feb 15 01:12 maven
drwxr-xr-x  3 jenkins jenkins   4096 Feb 15 01:12 osgi
-rw-r--r--  1 jenkins jenkins   4813 Nov 12 01:13 patch.xml
-rw-r--r--  1 jenkins jenkins    426 Nov 12 01:13 .project
-rw-r--r--  1 jenkins jenkins   4278 Dec 13 19:13 README.rst
drwxr-xr-x  2 jenkins jenkins   4096 Nov 12 01:13 .settings
-rw-r--r--  1 jenkins jenkins    556 Nov 12 01:13 settings.gradle
drwxr-xr-x  9 jenkins jenkins   4096 Jan 14 01:12 sonar
drwxr-xr-x 16 jenkins jenkins   4096 Nov 12 01:14 src
drwxr-xr-x  4 jenkins jenkins   4096 Feb 15 01:12 .svn
drwxr-xr-x 15 jenkins jenkins   4096 Jan  6 01:15 test-data
-rw-r--r--  1 jenkins jenkins    419 Dec  8 01:12 .travis.yml
+ echo which ant
which ant
+ which ant
/usr/bin/ant
+ ant -version
Apache Ant(TM) version 1.10.5 compiled on March 28 2019
+ echo <project default="test"><target name="test"><echo>Java ${ant.java.version}/${java.version}</echo><exec executable="javac"><arg value="-version"/></exec></target></project>
+ ant -f build.javacheck.xml -v
Apache Ant(TM) version 1.10.5 compiled on March 28 2019
Buildfile: <https://ci-builds.apache.org/job/POI/job/POI-DSL-API-Check/ws/build.javacheck.xml>
Detected Java version: 1.8 in: /usr/local/asfpackages/java/oraclejdk-1.8.0-281/jre
Detected OS: Linux
parsing buildfile <https://ci-builds.apache.org/job/POI/job/POI-DSL-API-Check/ws/build.javacheck.xml> with URI = <https://ci-builds.apache.org/job/POI/job/POI-DSL-API-Check/ws/build.javacheck.xml>
Project base dir set to: <https://ci-builds.apache.org/job/POI/job/POI-DSL-API-Check/ws/>
Build sequence for target(s) `test' is [test]
Complete build sequence is [test, ]

test:
parsing buildfile jar:file:/usr/share/ant/lib/ant.jar!/org/apache/tools/ant/antlib.xml with URI = jar:file:/usr/share/ant/lib/ant.jar!/org/apache/tools/ant/antlib.xml from a zip file
     [echo] Java 1.8/1.8.0_281
     [exec] Current OS is Linux
     [exec] Executing 'javac' with arguments:
     [exec] '-version'
     [exec]
     [exec] The ' characters around the executable and arguments are
     [exec] not part of the command.
     [exec] javac 1.8.0_281

BUILD SUCCESSFUL
Total time: 0 seconds
+ exit 0
[Gradle] - Launching build.
[POI-DSL-API-Check] $ <https://ci-builds.apache.org/job/POI/job/POI-DSL-API-Check/ws/gradlew> japicmp
To honour the JVM settings for this build a single-use Daemon process will be forked. See https://docs.gradle.org/6.8/userguide/gradle_daemon.html#sec:disabling_the_daemon.
Daemon will be stopped at the end of the build

> Configure project :
Trying to override old definition of datatype junit

> Task :main:compileJava UP-TO-DATE
> Task :main:processResources UP-TO-DATE
> Task :main:classes UP-TO-DATE
> Task :main:jar UP-TO-DATE
> Task :ooxml:ant-check-jars
> Task :ooxml:ant-fetch-jars
> Task :ooxml:ant-check-ooxml-jars
> Task :ooxml:ant-fetch-ooxml-jars

> Task :ooxml:ant-init
[ant:echo] Using Ant: Apache Ant(TM) version 1.10.9 compiled on September 27 2020 from ${ant.home}, Ant detected Java 1.8 (may be different than actual Java sometimes...)
[ant:echo] Using Java: 1.8.0_281/1.8.0_281-b09/25.281-b09/Java HotSpot(TM) 64-Bit Server VM from Oracle Corporation on Linux: 4.15.0-58-generic
[ant:echo] Building Apache POI version 5.0.1-SNAPSHOT and RC: RC1

> Task :ooxml:ant-check-compiled-ooxml-xsds
> Task :ooxml:ant-compile-ooxml-xsds
> Task :scratchpad:compileJava UP-TO-DATE
> Task :scratchpad:processResources UP-TO-DATE
> Task :scratchpad:classes UP-TO-DATE
> Task :scratchpad:jar UP-TO-DATE

> Task :ooxml:compileJava
Note: Some input files use or override a deprecated API.
Note: Recompile with -Xlint:deprecation for details.
Note: <https://ci-builds.apache.org/job/POI/job/POI-DSL-API-Check/ws/src/ooxml/java/org/apache/poi/xslf/draw/SVGImageRenderer.java> uses unchecked or unsafe operations.
Note: Recompile with -Xlint:unchecked for details.

> Task :ooxml:processResources UP-TO-DATE
> Task :ooxml:classes
> Task :ooxml:jar
> Task :examples:compileJava
> Task :examples:processResources NO-SOURCE
> Task :examples:classes
> Task :examples:jar UP-TO-DATE
> Task :examples:japicmp SKIPPED
> Task :excelant:compileJava
> Task :excelant:processResources UP-TO-DATE
> Task :excelant:classes
> Task :excelant:jar UP-TO-DATE
> Task :excelant:japicmp FAILED

FAILURE: Build failed with an exception.

* What went wrong:
Execution failed for task ':excelant:japicmp'.
> Failed to load file from jar 'META-INF/versions/9/module-info.class' as class file: invalid constant type: 19 at 3.

* Try:
Run with --stacktrace option to get the stack trace. Run with --info or --debug option to get more log output. Run with --scan to get full insights.

* Get more help at https://help.gradle.org

Deprecated Gradle features were used in this build, making it incompatible with Gradle 7.0.
Use '--warning-mode all' to show the individual deprecation warnings.
See https://docs.gradle.org/6.8/userguide/command_line_interface.html#sec:command_line_warnings

BUILD FAILED in 35s
22 actionable tasks: 12 executed, 10 up-to-date
Build step 'Invoke Gradle script' changed build result to FAILURE
Build step 'Invoke Gradle script' marked build as failure
Archiving artifacts
[Fast Archiver] Compressed 29.34 MB of artifacts by 99.2% relative to #90

---------------------------------------------------------------------
To unsubscribe, e-mail: [hidden email]
For additional commands, e-mail: [hidden email]

Reply | Threaded
Open this post in threaded view
|

Build failed in Jenkins: POI » POI-DSL-API-Check #109

Apache Jenkins Server
See <https://ci-builds.apache.org/job/POI/job/POI-DSL-API-Check/109/display/redirect?page=changes>

Changes:

[PJ Fanning] allow subclassing of code to gen comments table

[PJ Fanning] add method to test for strict ooxml format

[Dominik Stadler] Do not fail test which compares two documents if the timestamp in the ZIP header field is different

[Dominik Stadler] Do not require NullPointerException to have a null-message on JDK < 16

It seems depending on the exact JDK some Exceptions have failure messages populated


------------------------------------------
[...truncated 1.12 KB...]
U         src/testcases/org/apache/poi/ss/usermodel/BaseTestBugzillaIssues.java
U         src/integrationtest/org/apache/poi/stress/TestAllFiles.java

<-- Got one external: forrest.properties, svn url: https://svn.apache.org/repos/asf/poi/site/forrest.properties -->
Fetching 'https://svn.apache.org/repos/asf/poi/site/forrest.properties' at -1 into '<https://ci-builds.apache.org/job/POI/job/POI-DSL-API-Check/ws/forrest.properties'>
At revision 1886560


<-- Got one external: documentation, svn url: https://svn.apache.org/repos/asf/poi/site/src/documentation -->
Fetching 'https://svn.apache.org/repos/asf/poi/site/src/documentation' at -1 into '<https://ci-builds.apache.org/job/POI/job/POI-DSL-API-Check/ws/src/documentation'>
At revision 1886560

At revision 1886560

No changes for https://svn.apache.org/repos/asf/poi/site/forrest.properties since the previous build
No changes for https://svn.apache.org/repos/asf/poi/site/src/documentation since the previous build
[POI-DSL-API-Check] $ /bin/sh -xe /tmp/jenkins6431454777476325745.sh
+ svn status
?       build.javacheck.xml
    X   forrest.properties
X       src/documentation

Performing status on external item at 'src/documentation':
+ echo Java-Home: /home/jenkins/tools/java/latest1.8
Java-Home: /home/jenkins/tools/java/latest1.8
+ ls -al /home/jenkins/tools/java/latest1.8/
total 25824
drwxr-xr-x  8 root root     4096 Jan 29 21:12 .
drwxr-xr-x 42 root root     4096 Feb  7 13:06 ..
drwxr-xr-x  2 root root     4096 Jan 29 21:12 bin
-r--r--r--  1 root root     3244 Dec  9 12:47 COPYRIGHT
drwxr-xr-x  3 root root     4096 Jan 29 21:12 include
-rw-r--r--  1 root root  5226870 Dec  9 10:15 javafx-src.zip
-rw-r--r--  1 root root      195 Dec  9 12:47 jmc.txt
drwxr-xr-x  6 root root     4096 Jan 29 21:12 jre
drwxr-xr-x  4 root root     4096 Jan 29 21:12 legal
drwxr-xr-x  4 root root     4096 Jan 29 21:12 lib
-r--r--r--  1 root root       44 Dec  9 12:47 LICENSE
drwxr-xr-x  4 root root     4096 Jan 29 21:12 man
-r--r--r--  1 root root      159 Dec  9 12:47 README.html
-rw-r--r--  1 root root      424 Dec  9 12:47 release
-rw-r--r--  1 root root 21147701 Dec  9 12:47 src.zip
-rw-r--r--  1 root root      190 Dec  9 10:15 THIRDPARTYLICENSEREADME-JAVAFX.txt
-r--r--r--  1 root root      190 Dec  9 12:47 THIRDPARTYLICENSEREADME.txt
+ ls -al /home/jenkins/tools/java/latest1.8/bin
total 836
drwxr-xr-x 2 root root   4096 Jan 29 21:12 .
drwxr-xr-x 8 root root   4096 Jan 29 21:12 ..
-rwxr-xr-x 1 root root   8840 Dec  9 12:47 appletviewer
lrwxrwxrwx 1 root root      8 Dec  9 12:47 ControlPanel -> jcontrol
-rwxr-xr-x 1 root root   8832 Dec  9 12:47 extcheck
-rwxr-xr-x 1 root root   8832 Dec  9 12:47 idlj
-rwxr-xr-x 1 root root   8832 Dec  9 12:47 jar
-rwxr-xr-x 1 root root   8832 Dec  9 12:47 jarsigner
-rwxr-xr-x 1 root root   8712 Dec  9 12:47 java
-rwxr-xr-x 1 root root   8832 Dec  9 12:47 javac
-rwxr-xr-x 1 root root   8832 Dec  9 12:47 javadoc
-rwxr-xr-x 1 root root   2293 Dec  9 10:15 javafxpackager
-rwxr-xr-x 1 root root   8832 Dec  9 12:47 javah
-rwxr-xr-x 1 root root   8832 Dec  9 12:47 javap
-rwxr-xr-x 1 root root   2293 Dec  9 10:15 javapackager
-rwxr-xr-x 1 root root   1809 Dec  9 12:47 java-rmi.cgi
-rwxr-xr-x 1 root root 148896 Dec  9 12:47 javaws
-rwxr-xr-x 1 root root   8832 Dec  9 12:47 jcmd
-rwxr-xr-x 1 root root   8856 Dec  9 12:47 jconsole
-rwxr-xr-x 1 root root   6264 Dec  9 12:47 jcontrol
-rwxr-xr-x 1 root root   8848 Dec  9 12:47 jdb
-rwxr-xr-x 1 root root   8832 Dec  9 12:47 jdeps
-rwxr-xr-x 1 root root   8832 Dec  9 12:47 jhat
-rwxr-xr-x 1 root root   8896 Dec  9 12:47 jinfo
-rwxr-xr-x 1 root root   8832 Dec  9 12:47 jjs
-rwxr-xr-x 1 root root   8896 Dec  9 12:47 jmap
-rwxr-xr-x 1 root root   8832 Dec  9 12:47 jps
-rwxr-xr-x 1 root root   8840 Dec  9 12:47 jrunscript
-rwxr-xr-x 1 root root   8848 Dec  9 12:47 jsadebugd
-rwxr-xr-x 1 root root   8896 Dec  9 12:47 jstack
-rwxr-xr-x 1 root root   8832 Dec  9 12:47 jstat
-rwxr-xr-x 1 root root   8832 Dec  9 12:47 jstatd
-rwxr-xr-x 1 root root   5110 Jan 14  2017 jvisualvm
-rwxr-xr-x 1 root root   8832 Dec  9 12:47 keytool
-rwxr-xr-x 1 root root   8840 Dec  9 12:47 native2ascii
-rwxr-xr-x 1 root root   8904 Dec  9 12:47 orbd
-rwxr-xr-x 1 root root   8832 Dec  9 12:47 pack200
-rwxr-xr-x 1 root root   8840 Dec  9 12:47 policytool
-rwxr-xr-x 1 root root   8832 Dec  9 12:47 rmic
-rwxr-xr-x 1 root root   8832 Dec  9 12:47 rmid
-rwxr-xr-x 1 root root   8840 Dec  9 12:47 rmiregistry
-rwxr-xr-x 1 root root   8832 Dec  9 12:47 schemagen
-rwxr-xr-x 1 root root   8832 Dec  9 12:47 serialver
-rwxr-xr-x 1 root root   8840 Dec  9 12:47 servertool
-rwxr-xr-x 1 root root   8904 Dec  9 12:47 tnameserv
-rwxr-xr-x 1 root root 186960 Dec  9 12:47 unpack200
-rwxr-xr-x 1 root root   8832 Dec  9 12:47 wsgen
-rwxr-xr-x 1 root root   8832 Dec  9 12:47 wsimport
-rwxr-xr-x 1 root root   8832 Dec  9 12:47 xjc
+ /home/jenkins/tools/java/latest1.8/bin/java -version
java version "1.8.0_281"
Java(TM) SE Runtime Environment (build 1.8.0_281-b09)
Java HotSpot(TM) 64-Bit Server VM (build 25.281-b09, mixed mode)
+ echo which java
which java
+ which java
/home/jenkins/tools/java/latest1.8/bin/java
+ java -version
java version "1.8.0_281"
Java(TM) SE Runtime Environment (build 1.8.0_281-b09)
Java HotSpot(TM) 64-Bit Server VM (build 25.281-b09, mixed mode)
+ echo which javac
which javac
+ which javac
/home/jenkins/tools/java/latest1.8/bin/javac
+ javac -version
javac 1.8.0_281
+ echo Ant-Home:
Ant-Home:
+ ls -al
total 476
drwxr-xr-x 16 jenkins jenkins   4096 Jan 19 01:12 .
drwxr-xr-x  4 jenkins jenkins   4096 Feb 11 14:18 ..
drwxr-xr-x 30 jenkins jenkins   4096 Nov 12 01:14 build
-rw-r--r--  1 jenkins jenkins  14850 Feb 15 01:12 build.gradle
-rw-r--r--  1 jenkins jenkins    172 Feb 15 01:12 build.javacheck.xml
-rw-r--r--  1 jenkins jenkins 157302 Feb 15 01:12 build.xml
-rw-r--r--  1 jenkins jenkins   3345 Feb 15 01:12 .classpath
-rw-r--r--  1 jenkins jenkins   6325 Jan 18 01:12 doap_POI.rdf
-rw-r--r--  1 jenkins jenkins   2934 Jan  9 01:12 file-leak-detector.exclude
-rw-r--r--  1 jenkins jenkins   6229 Nov 12 01:13 forrest.properties
-rw-r--r--  1 jenkins jenkins     53 Nov 12 01:13 .gitattributes
drwxr-xr-x  3 jenkins jenkins   4096 Dec 21 01:12 .github
-rw-r--r--  1 jenkins jenkins    482 Dec 13 19:13 .gitignore
drwxr-xr-x  3 jenkins jenkins   4096 Nov 12 01:13 gradle
drwxr-xr-x  7 jenkins jenkins   4096 Jan 31 01:13 .gradle
-rwxr-xr-x  1 jenkins jenkins   5770 Jan 19 01:12 gradlew
-rw-r--r--  1 jenkins jenkins   3058 Jan 19 01:12 gradlew.bat
drwxr-xr-x  2 jenkins jenkins   4096 Jan  6 01:15 jenkins
-rw-r--r--  1 jenkins jenkins 167284 Nov 12 01:13 KEYS
drwxr-xr-x  2 jenkins jenkins   4096 Nov 12 01:13 legal
drwxr-xr-x  9 jenkins jenkins   4096 Nov 12 01:14 lib
drwxr-xr-x  2 jenkins jenkins   4096 Feb 15 01:12 maven
drwxr-xr-x  3 jenkins jenkins   4096 Feb 15 01:12 osgi
-rw-r--r--  1 jenkins jenkins   4813 Nov 12 01:13 patch.xml
-rw-r--r--  1 jenkins jenkins    426 Nov 12 01:13 .project
-rw-r--r--  1 jenkins jenkins   4278 Dec 13 19:13 README.rst
drwxr-xr-x  2 jenkins jenkins   4096 Nov 12 01:13 .settings
-rw-r--r--  1 jenkins jenkins    556 Nov 12 01:13 settings.gradle
drwxr-xr-x  9 jenkins jenkins   4096 Jan 14 01:12 sonar
drwxr-xr-x 16 jenkins jenkins   4096 Nov 12 01:14 src
drwxr-xr-x  4 jenkins jenkins   4096 Feb 16 01:12 .svn
drwxr-xr-x 15 jenkins jenkins   4096 Jan  6 01:15 test-data
-rw-r--r--  1 jenkins jenkins    419 Dec  8 01:12 .travis.yml
+ echo which ant
which ant
+ which ant
/usr/bin/ant
+ ant -version
Apache Ant(TM) version 1.10.5 compiled on March 28 2019
+ echo <project default="test"><target name="test"><echo>Java ${ant.java.version}/${java.version}</echo><exec executable="javac"><arg value="-version"/></exec></target></project>
+ ant -f build.javacheck.xml -v
Apache Ant(TM) version 1.10.5 compiled on March 28 2019
Buildfile: <https://ci-builds.apache.org/job/POI/job/POI-DSL-API-Check/ws/build.javacheck.xml>
Detected Java version: 1.8 in: /usr/local/asfpackages/java/oraclejdk-1.8.0-281/jre
Detected OS: Linux
parsing buildfile <https://ci-builds.apache.org/job/POI/job/POI-DSL-API-Check/ws/build.javacheck.xml> with URI = <https://ci-builds.apache.org/job/POI/job/POI-DSL-API-Check/ws/build.javacheck.xml>
Project base dir set to: <https://ci-builds.apache.org/job/POI/job/POI-DSL-API-Check/ws/>
Build sequence for target(s) `test' is [test]
Complete build sequence is [test, ]

test:
parsing buildfile jar:file:/usr/share/ant/lib/ant.jar!/org/apache/tools/ant/antlib.xml with URI = jar:file:/usr/share/ant/lib/ant.jar!/org/apache/tools/ant/antlib.xml from a zip file
     [echo] Java 1.8/1.8.0_281
     [exec] Current OS is Linux
     [exec] Executing 'javac' with arguments:
     [exec] '-version'
     [exec]
     [exec] The ' characters around the executable and arguments are
     [exec] not part of the command.
     [exec] javac 1.8.0_281

BUILD SUCCESSFUL
Total time: 0 seconds
+ exit 0
[Gradle] - Launching build.
[POI-DSL-API-Check] $ <https://ci-builds.apache.org/job/POI/job/POI-DSL-API-Check/ws/gradlew> japicmp
To honour the JVM settings for this build a single-use Daemon process will be forked. See https://docs.gradle.org/6.8/userguide/gradle_daemon.html#sec:disabling_the_daemon.
Daemon will be stopped at the end of the build

> Configure project :
Trying to override old definition of datatype junit

> Task :main:compileJava UP-TO-DATE
> Task :main:processResources UP-TO-DATE
> Task :main:classes UP-TO-DATE
> Task :main:jar UP-TO-DATE
> Task :ooxml:ant-check-jars
> Task :ooxml:ant-fetch-jars
> Task :ooxml:ant-check-ooxml-jars
> Task :ooxml:ant-fetch-ooxml-jars

> Task :ooxml:ant-init
[ant:echo] Using Ant: Apache Ant(TM) version 1.10.9 compiled on September 27 2020 from ${ant.home}, Ant detected Java 1.8 (may be different than actual Java sometimes...)
[ant:echo] Using Java: 1.8.0_281/1.8.0_281-b09/25.281-b09/Java HotSpot(TM) 64-Bit Server VM from Oracle Corporation on Linux: 4.15.0-58-generic
[ant:echo] Building Apache POI version 5.0.1-SNAPSHOT and RC: RC1

> Task :ooxml:ant-check-compiled-ooxml-xsds
> Task :ooxml:ant-compile-ooxml-xsds
> Task :scratchpad:compileJava UP-TO-DATE
> Task :scratchpad:processResources UP-TO-DATE
> Task :scratchpad:classes UP-TO-DATE
> Task :scratchpad:jar UP-TO-DATE

> Task :ooxml:compileJava
Note: <https://ci-builds.apache.org/job/POI/job/POI-DSL-API-Check/ws/src/ooxml/java/org/apache/poi/xssf/usermodel/BaseXSSFEvaluationWorkbook.java> uses or overrides a deprecated API.
Note: Recompile with -Xlint:deprecation for details.

> Task :ooxml:processResources UP-TO-DATE
> Task :ooxml:classes
> Task :ooxml:jar
> Task :examples:compileJava
> Task :examples:processResources NO-SOURCE
> Task :examples:classes
> Task :examples:jar UP-TO-DATE
> Task :examples:japicmp SKIPPED
> Task :excelant:compileJava
> Task :excelant:processResources UP-TO-DATE
> Task :excelant:classes
> Task :excelant:jar UP-TO-DATE
> Task :excelant:japicmp FAILED

FAILURE: Build failed with an exception.

* What went wrong:
Execution failed for task ':excelant:japicmp'.
> Failed to load file from jar 'META-INF/versions/9/module-info.class' as class file: invalid constant type: 19 at 3.

* Try:
Run with --stacktrace option to get the stack trace. Run with --info or --debug option to get more log output. Run with --scan to get full insights.

* Get more help at https://help.gradle.org

Deprecated Gradle features were used in this build, making it incompatible with Gradle 7.0.
Use '--warning-mode all' to show the individual deprecation warnings.
See https://docs.gradle.org/6.8/userguide/command_line_interface.html#sec:command_line_warnings

BUILD FAILED in 26s
22 actionable tasks: 12 executed, 10 up-to-date
Build step 'Invoke Gradle script' changed build result to FAILURE
Build step 'Invoke Gradle script' marked build as failure
Archiving artifacts
[Fast Archiver] Compressed 29.34 MB of artifacts by 99.2% relative to #90

---------------------------------------------------------------------
To unsubscribe, e-mail: [hidden email]
For additional commands, e-mail: [hidden email]

Reply | Threaded
Open this post in threaded view
|

Build failed in Jenkins: POI » POI-DSL-API-Check #110

Apache Jenkins Server
See <https://ci-builds.apache.org/job/POI/job/POI-DSL-API-Check/110/display/redirect?page=changes>

Changes:

[Alain Béarez] [bug-63902] reference cloned sheet in cloned chart data series

[Alain Béarez] [bug-63902] reference cloned sheet in cloned chart data series


------------------------------------------
[...truncated 380.06 KB...]
At revision 1886607

No changes for https://svn.apache.org/repos/asf/poi/site/forrest.properties since the previous build
[POI-DSL-API-Check] $ /bin/sh -xe /tmp/jenkins3136407897680697968.sh
+ svn status
    X   forrest.properties
X       src/documentation

Performing status on external item at 'src/documentation':
+ echo Java-Home: /home/jenkins/tools/java/latest1.8
Java-Home: /home/jenkins/tools/java/latest1.8
+ ls -al /home/jenkins/tools/java/latest1.8/
total 25824
drwxr-xr-x  8 root root     4096 Jan 29 21:07 .
drwxr-xr-x 43 root root     4096 Feb 16 14:30 ..
drwxr-xr-x  2 root root     4096 Jan 29 21:07 bin
-r--r--r--  1 root root     3244 Dec  9 12:47 COPYRIGHT
drwxr-xr-x  3 root root     4096 Jan 29 21:07 include
-rw-r--r--  1 root root  5226870 Dec  9 10:15 javafx-src.zip
-rw-r--r--  1 root root      195 Dec  9 12:47 jmc.txt
drwxr-xr-x  6 root root     4096 Jan 29 21:07 jre
drwxr-xr-x  4 root root     4096 Jan 29 21:07 legal
drwxr-xr-x  4 root root     4096 Jan 29 21:07 lib
-r--r--r--  1 root root       44 Dec  9 12:47 LICENSE
drwxr-xr-x  4 root root     4096 Jan 29 21:07 man
-r--r--r--  1 root root      159 Dec  9 12:47 README.html
-rw-r--r--  1 root root      424 Dec  9 12:47 release
-rw-r--r--  1 root root 21147701 Dec  9 12:47 src.zip
-rw-r--r--  1 root root      190 Dec  9 10:15 THIRDPARTYLICENSEREADME-JAVAFX.txt
-r--r--r--  1 root root      190 Dec  9 12:47 THIRDPARTYLICENSEREADME.txt
+ ls -al /home/jenkins/tools/java/latest1.8/bin
total 836
drwxr-xr-x 2 root root   4096 Jan 29 21:07 .
drwxr-xr-x 8 root root   4096 Jan 29 21:07 ..
-rwxr-xr-x 1 root root   8840 Dec  9 12:47 appletviewer
lrwxrwxrwx 1 root root      8 Dec  9 12:47 ControlPanel -> jcontrol
-rwxr-xr-x 1 root root   8832 Dec  9 12:47 extcheck
-rwxr-xr-x 1 root root   8832 Dec  9 12:47 idlj
-rwxr-xr-x 1 root root   8832 Dec  9 12:47 jar
-rwxr-xr-x 1 root root   8832 Dec  9 12:47 jarsigner
-rwxr-xr-x 1 root root   8712 Dec  9 12:47 java
-rwxr-xr-x 1 root root   8832 Dec  9 12:47 javac
-rwxr-xr-x 1 root root   8832 Dec  9 12:47 javadoc
-rwxr-xr-x 1 root root   2293 Dec  9 10:15 javafxpackager
-rwxr-xr-x 1 root root   8832 Dec  9 12:47 javah
-rwxr-xr-x 1 root root   8832 Dec  9 12:47 javap
-rwxr-xr-x 1 root root   2293 Dec  9 10:15 javapackager
-rwxr-xr-x 1 root root   1809 Dec  9 12:47 java-rmi.cgi
-rwxr-xr-x 1 root root 148896 Dec  9 12:47 javaws
-rwxr-xr-x 1 root root   8832 Dec  9 12:47 jcmd
-rwxr-xr-x 1 root root   8856 Dec  9 12:47 jconsole
-rwxr-xr-x 1 root root   6264 Dec  9 12:47 jcontrol
-rwxr-xr-x 1 root root   8848 Dec  9 12:47 jdb
-rwxr-xr-x 1 root root   8832 Dec  9 12:47 jdeps
-rwxr-xr-x 1 root root   8832 Dec  9 12:47 jhat
-rwxr-xr-x 1 root root   8896 Dec  9 12:47 jinfo
-rwxr-xr-x 1 root root   8832 Dec  9 12:47 jjs
-rwxr-xr-x 1 root root   8896 Dec  9 12:47 jmap
-rwxr-xr-x 1 root root   8832 Dec  9 12:47 jps
-rwxr-xr-x 1 root root   8840 Dec  9 12:47 jrunscript
-rwxr-xr-x 1 root root   8848 Dec  9 12:47 jsadebugd
-rwxr-xr-x 1 root root   8896 Dec  9 12:47 jstack
-rwxr-xr-x 1 root root   8832 Dec  9 12:47 jstat
-rwxr-xr-x 1 root root   8832 Dec  9 12:47 jstatd
-rwxr-xr-x 1 root root   5110 Jan 14  2017 jvisualvm
-rwxr-xr-x 1 root root   8832 Dec  9 12:47 keytool
-rwxr-xr-x 1 root root   8840 Dec  9 12:47 native2ascii
-rwxr-xr-x 1 root root   8904 Dec  9 12:47 orbd
-rwxr-xr-x 1 root root   8832 Dec  9 12:47 pack200
-rwxr-xr-x 1 root root   8840 Dec  9 12:47 policytool
-rwxr-xr-x 1 root root   8832 Dec  9 12:47 rmic
-rwxr-xr-x 1 root root   8832 Dec  9 12:47 rmid
-rwxr-xr-x 1 root root   8840 Dec  9 12:47 rmiregistry
-rwxr-xr-x 1 root root   8832 Dec  9 12:47 schemagen
-rwxr-xr-x 1 root root   8832 Dec  9 12:47 serialver
-rwxr-xr-x 1 root root   8840 Dec  9 12:47 servertool
-rwxr-xr-x 1 root root   8904 Dec  9 12:47 tnameserv
-rwxr-xr-x 1 root root 186960 Dec  9 12:47 unpack200
-rwxr-xr-x 1 root root   8832 Dec  9 12:47 wsgen
-rwxr-xr-x 1 root root   8832 Dec  9 12:47 wsimport
-rwxr-xr-x 1 root root   8832 Dec  9 12:47 xjc
+ /home/jenkins/tools/java/latest1.8/bin/java -version
java version "1.8.0_281"
Java(TM) SE Runtime Environment (build 1.8.0_281-b09)
Java HotSpot(TM) 64-Bit Server VM (build 25.281-b09, mixed mode)
+ echo which java
which java
+ which java
/home/jenkins/tools/java/latest1.8/bin/java
+ java -version
java version "1.8.0_281"
Java(TM) SE Runtime Environment (build 1.8.0_281-b09)
Java HotSpot(TM) 64-Bit Server VM (build 25.281-b09, mixed mode)
+ echo which javac
which javac
+ which javac
/home/jenkins/tools/java/latest1.8/bin/javac
+ javac -version
javac 1.8.0_281
+ echo Ant-Home:
Ant-Home:
+ ls -al
total 460
drwxr-xr-x 13 jenkins jenkins   4096 Feb 17 01:12 .
drwxr-xr-x  8 jenkins jenkins   4096 Feb 17 01:12 ..
-rw-r--r--  1 jenkins jenkins  14850 Feb 17 01:12 build.gradle
-rw-r--r--  1 jenkins jenkins 157302 Feb 17 01:12 build.xml
-rw-r--r--  1 jenkins jenkins   3345 Feb 17 01:12 .classpath
-rw-r--r--  1 jenkins jenkins   6325 Feb 17 01:12 doap_POI.rdf
-rw-r--r--  1 jenkins jenkins   2934 Feb 17 01:12 file-leak-detector.exclude
-rw-r--r--  1 jenkins jenkins   6229 Feb 17 01:12 forrest.properties
-rw-r--r--  1 jenkins jenkins     53 Feb 17 01:12 .gitattributes
drwxr-xr-x  3 jenkins jenkins   4096 Feb 17 01:12 .github
-rw-r--r--  1 jenkins jenkins    482 Feb 17 01:12 .gitignore
drwxr-xr-x  3 jenkins jenkins   4096 Feb 17 01:12 gradle
-rwxr-xr-x  1 jenkins jenkins   5770 Feb 17 01:12 gradlew
-rw-r--r--  1 jenkins jenkins   3058 Feb 17 01:12 gradlew.bat
drwxr-xr-x  2 jenkins jenkins   4096 Feb 17 01:12 jenkins
-rw-r--r--  1 jenkins jenkins 167284 Feb 17 01:12 KEYS
drwxr-xr-x  2 jenkins jenkins   4096 Feb 17 01:12 legal
drwxr-xr-x  2 jenkins jenkins   4096 Feb 17 01:12 maven
drwxr-xr-x  3 jenkins jenkins   4096 Feb 17 01:12 osgi
-rw-r--r--  1 jenkins jenkins   4813 Feb 17 01:12 patch.xml
-rw-r--r--  1 jenkins jenkins    426 Feb 17 01:12 .project
-rw-r--r--  1 jenkins jenkins   4278 Feb 17 01:12 README.rst
drwxr-xr-x  2 jenkins jenkins   4096 Feb 17 01:12 .settings
-rw-r--r--  1 jenkins jenkins    556 Feb 17 01:12 settings.gradle
drwxr-xr-x  9 jenkins jenkins   4096 Feb 17 01:12 sonar
drwxr-xr-x 16 jenkins jenkins   4096 Feb 17 01:13 src
drwxr-xr-x  4 jenkins jenkins   4096 Feb 17 01:13 .svn
drwxr-xr-x 15 jenkins jenkins   4096 Feb 17 01:12 test-data
-rw-r--r--  1 jenkins jenkins    419 Feb 17 01:12 .travis.yml
+ echo which ant
which ant
+ which ant
/usr/bin/ant
+ ant -version
Apache Ant(TM) version 1.10.5 compiled on March 28 2019
+ echo <project default="test"><target name="test"><echo>Java ${ant.java.version}/${java.version}</echo><exec executable="javac"><arg value="-version"/></exec></target></project>
+ ant -f build.javacheck.xml -v
Apache Ant(TM) version 1.10.5 compiled on March 28 2019
Buildfile: <https://ci-builds.apache.org/job/POI/job/POI-DSL-API-Check/ws/build.javacheck.xml>
Detected Java version: 1.8 in: /usr/local/asfpackages/java/oraclejdk-1.8.0-281/jre
Detected OS: Linux
parsing buildfile <https://ci-builds.apache.org/job/POI/job/POI-DSL-API-Check/ws/build.javacheck.xml> with URI = <https://ci-builds.apache.org/job/POI/job/POI-DSL-API-Check/ws/build.javacheck.xml>
Project base dir set to: <https://ci-builds.apache.org/job/POI/job/POI-DSL-API-Check/ws/>
Build sequence for target(s) `test' is [test]
Complete build sequence is [test, ]

test:
parsing buildfile jar:file:/usr/share/ant/lib/ant.jar!/org/apache/tools/ant/antlib.xml with URI = jar:file:/usr/share/ant/lib/ant.jar!/org/apache/tools/ant/antlib.xml from a zip file
     [echo] Java 1.8/1.8.0_281
     [exec] Current OS is Linux
     [exec] Executing 'javac' with arguments:
     [exec] '-version'
     [exec]
     [exec] The ' characters around the executable and arguments are
     [exec] not part of the command.
     [exec] javac 1.8.0_281

BUILD SUCCESSFUL
Total time: 0 seconds
+ exit 0
[Gradle] - Launching build.
[POI-DSL-API-Check] $ <https://ci-builds.apache.org/job/POI/job/POI-DSL-API-Check/ws/gradlew> japicmp
Downloading https://services.gradle.org/distributions/gradle-6.8-bin.zip
..........10%..........20%..........30%...........40%..........50%..........60%..........70%...........80%..........90%..........100%
To honour the JVM settings for this build a single-use Daemon process will be forked. See https://docs.gradle.org/6.8/userguide/gradle_daemon.html#sec:disabling_the_daemon.
Daemon will be stopped at the end of the build

> Configure project :
Trying to override old definition of datatype junit

> Task :main:compileJava
Note: Some input files use or override a deprecated API.
Note: Recompile with -Xlint:deprecation for details.
Note: Some input files use unchecked or unsafe operations.
Note: Recompile with -Xlint:unchecked for details.

> Task :main:processResources
> Task :main:classes
> Task :main:jar
> Task :ooxml:ant-check-jars
> Task :ooxml:ant-fetch-jars
> Task :ooxml:ant-check-ooxml-jars
> Task :ooxml:ant-fetch-ooxml-jars

> Task :ooxml:ant-init
[ant:echo] Using Ant: Apache Ant(TM) version 1.10.9 compiled on September 27 2020 from ${ant.home}, Ant detected Java 1.8 (may be different than actual Java sometimes...)
[ant:echo] Using Java: 1.8.0_281/1.8.0_281-b09/25.281-b09/Java HotSpot(TM) 64-Bit Server VM from Oracle Corporation on Linux: 4.15.0-74-generic
[ant:echo] Building Apache POI version 5.0.1-SNAPSHOT and RC: RC1

> Task :ooxml:ant-check-compiled-ooxml-xsds

> Task :ooxml:ant-compile-ooxml-xsds
SchemaCompiler  Metadata LOAD:org/apache/xmlbeans/metadata GEN:org/apache/poi/schemas/ooxml
Time to build schema type system: 2.165 seconds
Time to generate code: 5.068 seconds

> Task :scratchpad:compileJava
Note: Some input files use or override a deprecated API.
Note: Recompile with -Xlint:deprecation for details.
Note: Some input files use unchecked or unsafe operations.
Note: Recompile with -Xlint:unchecked for details.

> Task :scratchpad:processResources
> Task :scratchpad:classes
> Task :scratchpad:jar

> Task :ooxml:compileJava
Note: Some input files use or override a deprecated API.
Note: Recompile with -Xlint:deprecation for details.
Note: Some input files use unchecked or unsafe operations.
Note: Recompile with -Xlint:unchecked for details.

> Task :ooxml:processResources
> Task :ooxml:classes
> Task :ooxml:jar
> Task :examples:compileJava
> Task :examples:processResources NO-SOURCE
> Task :examples:classes
> Task :examples:jar
> Task :examples:japicmp SKIPPED
> Task :excelant:compileJava
> Task :excelant:processResources
> Task :excelant:classes
> Task :excelant:jar
> Task :excelant:japicmp FAILED

FAILURE: Build failed with an exception.

* What went wrong:
Execution failed for task ':excelant:japicmp'.
> Failed to load file from jar 'META-INF/versions/9/module-info.class' as class file: invalid constant type: 19 at 3.

* Try:
Run with --stacktrace option to get the stack trace. Run with --info or --debug option to get more log output. Run with --scan to get full insights.

* Get more help at https://help.gradle.org

Deprecated Gradle features were used in this build, making it incompatible with Gradle 7.0.
Use '--warning-mode all' to show the individual deprecation warnings.
See https://docs.gradle.org/6.8/userguide/command_line_interface.html#sec:command_line_warnings

BUILD FAILED in 2m 19s
22 actionable tasks: 22 executed
Build step 'Invoke Gradle script' changed build result to FAILURE
Build step 'Invoke Gradle script' marked build as failure
Archiving artifacts

---------------------------------------------------------------------
To unsubscribe, e-mail: [hidden email]
For additional commands, e-mail: [hidden email]

Reply | Threaded
Open this post in threaded view
|

Build failed in Jenkins: POI » POI-DSL-API-Check #111

Apache Jenkins Server
See <https://ci-builds.apache.org/job/POI/job/POI-DSL-API-Check/111/display/redirect?page=changes>

Changes:

[PJ Fanning] update release notes

[Dominik Stadler] FinanceLib: Simplify code and add a few more tests

[Alain Béarez] Manipulate individual data point properties

[Alain Béarez] [bug-54470] clone sheet with chart

[Alain Béarez] Manipulate individual data point properties

[Marius Volkhart] Code cleanup AbstractEscherHolderRecord

[Marius Volkhart] Documentation for some EscherRecordTypes

[Marius Volkhart] Add documentation for DrawingGroupRecord

Documentation adapted from [MS-XLS].pdf v20190618.


------------------------------------------
[...truncated 380.14 KB...]
At revision 1886707

No changes for https://svn.apache.org/repos/asf/poi/site/forrest.properties since the previous build
[POI-DSL-API-Check] $ /bin/sh -xe /tmp/jenkins8833644968678592623.sh
+ svn status
    X   forrest.properties
X       src/documentation

Performing status on external item at 'src/documentation':
+ echo Java-Home: /home/jenkins/tools/java/latest1.8
Java-Home: /home/jenkins/tools/java/latest1.8
+ ls -al /home/jenkins/tools/java/latest1.8/
total 25824
drwxr-xr-x  8 root root     4096 Jan 29 21:28 .
drwxr-xr-x 43 root root     4096 Feb 16 14:45 ..
drwxr-xr-x  2 root root     4096 Jan 29 21:28 bin
-r--r--r--  1 root root     3244 Dec  9 12:47 COPYRIGHT
drwxr-xr-x  3 root root     4096 Jan 29 21:28 include
-rw-r--r--  1 root root  5226870 Dec  9 10:15 javafx-src.zip
-rw-r--r--  1 root root      195 Dec  9 12:47 jmc.txt
drwxr-xr-x  6 root root     4096 Jan 29 21:28 jre
drwxr-xr-x  4 root root     4096 Jan 29 21:28 legal
drwxr-xr-x  4 root root     4096 Jan 29 21:28 lib
-r--r--r--  1 root root       44 Dec  9 12:47 LICENSE
drwxr-xr-x  4 root root     4096 Jan 29 21:28 man
-r--r--r--  1 root root      159 Dec  9 12:47 README.html
-rw-r--r--  1 root root      424 Dec  9 12:47 release
-rw-r--r--  1 root root 21147701 Dec  9 12:47 src.zip
-rw-r--r--  1 root root      190 Dec  9 10:15 THIRDPARTYLICENSEREADME-JAVAFX.txt
-r--r--r--  1 root root      190 Dec  9 12:47 THIRDPARTYLICENSEREADME.txt
+ ls -al /home/jenkins/tools/java/latest1.8/bin
total 836
drwxr-xr-x 2 root root   4096 Jan 29 21:28 .
drwxr-xr-x 8 root root   4096 Jan 29 21:28 ..
-rwxr-xr-x 1 root root   8840 Dec  9 12:47 appletviewer
lrwxrwxrwx 1 root root      8 Dec  9 12:47 ControlPanel -> jcontrol
-rwxr-xr-x 1 root root   8832 Dec  9 12:47 extcheck
-rwxr-xr-x 1 root root   8832 Dec  9 12:47 idlj
-rwxr-xr-x 1 root root   8832 Dec  9 12:47 jar
-rwxr-xr-x 1 root root   8832 Dec  9 12:47 jarsigner
-rwxr-xr-x 1 root root   8712 Dec  9 12:47 java
-rwxr-xr-x 1 root root   8832 Dec  9 12:47 javac
-rwxr-xr-x 1 root root   8832 Dec  9 12:47 javadoc
-rwxr-xr-x 1 root root   2293 Dec  9 10:15 javafxpackager
-rwxr-xr-x 1 root root   8832 Dec  9 12:47 javah
-rwxr-xr-x 1 root root   8832 Dec  9 12:47 javap
-rwxr-xr-x 1 root root   2293 Dec  9 10:15 javapackager
-rwxr-xr-x 1 root root   1809 Dec  9 12:47 java-rmi.cgi
-rwxr-xr-x 1 root root 148896 Dec  9 12:47 javaws
-rwxr-xr-x 1 root root   8832 Dec  9 12:47 jcmd
-rwxr-xr-x 1 root root   8856 Dec  9 12:47 jconsole
-rwxr-xr-x 1 root root   6264 Dec  9 12:47 jcontrol
-rwxr-xr-x 1 root root   8848 Dec  9 12:47 jdb
-rwxr-xr-x 1 root root   8832 Dec  9 12:47 jdeps
-rwxr-xr-x 1 root root   8832 Dec  9 12:47 jhat
-rwxr-xr-x 1 root root   8896 Dec  9 12:47 jinfo
-rwxr-xr-x 1 root root   8832 Dec  9 12:47 jjs
-rwxr-xr-x 1 root root   8896 Dec  9 12:47 jmap
-rwxr-xr-x 1 root root   8832 Dec  9 12:47 jps
-rwxr-xr-x 1 root root   8840 Dec  9 12:47 jrunscript
-rwxr-xr-x 1 root root   8848 Dec  9 12:47 jsadebugd
-rwxr-xr-x 1 root root   8896 Dec  9 12:47 jstack
-rwxr-xr-x 1 root root   8832 Dec  9 12:47 jstat
-rwxr-xr-x 1 root root   8832 Dec  9 12:47 jstatd
-rwxr-xr-x 1 root root   5110 Jan 14  2017 jvisualvm
-rwxr-xr-x 1 root root   8832 Dec  9 12:47 keytool
-rwxr-xr-x 1 root root   8840 Dec  9 12:47 native2ascii
-rwxr-xr-x 1 root root   8904 Dec  9 12:47 orbd
-rwxr-xr-x 1 root root   8832 Dec  9 12:47 pack200
-rwxr-xr-x 1 root root   8840 Dec  9 12:47 policytool
-rwxr-xr-x 1 root root   8832 Dec  9 12:47 rmic
-rwxr-xr-x 1 root root   8832 Dec  9 12:47 rmid
-rwxr-xr-x 1 root root   8840 Dec  9 12:47 rmiregistry
-rwxr-xr-x 1 root root   8832 Dec  9 12:47 schemagen
-rwxr-xr-x 1 root root   8832 Dec  9 12:47 serialver
-rwxr-xr-x 1 root root   8840 Dec  9 12:47 servertool
-rwxr-xr-x 1 root root   8904 Dec  9 12:47 tnameserv
-rwxr-xr-x 1 root root 186960 Dec  9 12:47 unpack200
-rwxr-xr-x 1 root root   8832 Dec  9 12:47 wsgen
-rwxr-xr-x 1 root root   8832 Dec  9 12:47 wsimport
-rwxr-xr-x 1 root root   8832 Dec  9 12:47 xjc
+ /home/jenkins/tools/java/latest1.8/bin/java -version
java version "1.8.0_281"
Java(TM) SE Runtime Environment (build 1.8.0_281-b09)
Java HotSpot(TM) 64-Bit Server VM (build 25.281-b09, mixed mode)
+ echo which java
which java
+ which java
/home/jenkins/tools/java/latest1.8/bin/java
+ java -version
java version "1.8.0_281"
Java(TM) SE Runtime Environment (build 1.8.0_281-b09)
Java HotSpot(TM) 64-Bit Server VM (build 25.281-b09, mixed mode)
+ echo which javac
which javac
+ which javac
/home/jenkins/tools/java/latest1.8/bin/javac
+ javac -version
javac 1.8.0_281
+ echo Ant-Home:
Ant-Home:
+ ls -al
total 460
drwxr-xr-x 13 jenkins jenkins   4096 Feb 20 06:06 .
drwxr-xr-x  5 jenkins jenkins   4096 Feb 20 06:06 ..
-rw-r--r--  1 jenkins jenkins  14850 Feb 20 06:06 build.gradle
-rw-r--r--  1 jenkins jenkins 157302 Feb 20 06:06 build.xml
-rw-r--r--  1 jenkins jenkins   3345 Feb 20 06:06 .classpath
-rw-r--r--  1 jenkins jenkins   6325 Feb 20 06:06 doap_POI.rdf
-rw-r--r--  1 jenkins jenkins   2934 Feb 20 06:06 file-leak-detector.exclude
-rw-r--r--  1 jenkins jenkins   6229 Feb 20 06:06 forrest.properties
-rw-r--r--  1 jenkins jenkins     53 Feb 20 06:06 .gitattributes
drwxr-xr-x  3 jenkins jenkins   4096 Feb 20 06:06 .github
-rw-r--r--  1 jenkins jenkins    482 Feb 20 06:06 .gitignore
drwxr-xr-x  3 jenkins jenkins   4096 Feb 20 06:06 gradle
-rwxr-xr-x  1 jenkins jenkins   5770 Feb 20 06:06 gradlew
-rw-r--r--  1 jenkins jenkins   3058 Feb 20 06:06 gradlew.bat
drwxr-xr-x  2 jenkins jenkins   4096 Feb 20 06:06 jenkins
-rw-r--r--  1 jenkins jenkins 167284 Feb 20 06:06 KEYS
drwxr-xr-x  2 jenkins jenkins   4096 Feb 20 06:06 legal
drwxr-xr-x  2 jenkins jenkins   4096 Feb 20 06:06 maven
drwxr-xr-x  3 jenkins jenkins   4096 Feb 20 06:06 osgi
-rw-r--r--  1 jenkins jenkins   4813 Feb 20 06:06 patch.xml
-rw-r--r--  1 jenkins jenkins    426 Feb 20 06:06 .project
-rw-r--r--  1 jenkins jenkins   4278 Feb 20 06:06 README.rst
drwxr-xr-x  2 jenkins jenkins   4096 Feb 20 06:06 .settings
-rw-r--r--  1 jenkins jenkins    556 Feb 20 06:06 settings.gradle
drwxr-xr-x  9 jenkins jenkins   4096 Feb 20 06:06 sonar
drwxr-xr-x 16 jenkins jenkins   4096 Feb 20 06:06 src
drwxr-xr-x  4 jenkins jenkins   4096 Feb 20 06:07 .svn
drwxr-xr-x 15 jenkins jenkins   4096 Feb 20 06:06 test-data
-rw-r--r--  1 jenkins jenkins    419 Feb 20 06:06 .travis.yml
+ echo which ant
which ant
+ which ant
/usr/bin/ant
+ ant -version
Apache Ant(TM) version 1.10.5 compiled on March 28 2019
+ echo <project default="test"><target name="test"><echo>Java ${ant.java.version}/${java.version}</echo><exec executable="javac"><arg value="-version"/></exec></target></project>
+ ant -f build.javacheck.xml -v
Apache Ant(TM) version 1.10.5 compiled on March 28 2019
Buildfile: <https://ci-builds.apache.org/job/POI/job/POI-DSL-API-Check/ws/build.javacheck.xml>
Detected Java version: 1.8 in: /usr/local/asfpackages/java/oraclejdk-1.8.0-281/jre
Detected OS: Linux
parsing buildfile <https://ci-builds.apache.org/job/POI/job/POI-DSL-API-Check/ws/build.javacheck.xml> with URI = <https://ci-builds.apache.org/job/POI/job/POI-DSL-API-Check/ws/build.javacheck.xml>
Project base dir set to: <https://ci-builds.apache.org/job/POI/job/POI-DSL-API-Check/ws/>
Build sequence for target(s) `test' is [test]
Complete build sequence is [test, ]

test:
parsing buildfile jar:file:/usr/share/ant/lib/ant.jar!/org/apache/tools/ant/antlib.xml with URI = jar:file:/usr/share/ant/lib/ant.jar!/org/apache/tools/ant/antlib.xml from a zip file
     [echo] Java 1.8/1.8.0_281
     [exec] Current OS is Linux
     [exec] Executing 'javac' with arguments:
     [exec] '-version'
     [exec]
     [exec] The ' characters around the executable and arguments are
     [exec] not part of the command.
     [exec] javac 1.8.0_281

BUILD SUCCESSFUL
Total time: 1 second
+ exit 0
[Gradle] - Launching build.
[POI-DSL-API-Check] $ <https://ci-builds.apache.org/job/POI/job/POI-DSL-API-Check/ws/gradlew> japicmp
Downloading https://services.gradle.org/distributions/gradle-6.8-bin.zip
..........10%..........20%..........30%...........40%..........50%..........60%..........70%...........80%..........90%..........100%
To honour the JVM settings for this build a single-use Daemon process will be forked. See https://docs.gradle.org/6.8/userguide/gradle_daemon.html#sec:disabling_the_daemon.
Daemon will be stopped at the end of the build

> Configure project :
Trying to override old definition of datatype junit

> Task :main:compileJava
Note: Some input files use or override a deprecated API.
Note: Recompile with -Xlint:deprecation for details.
Note: Some input files use unchecked or unsafe operations.
Note: Recompile with -Xlint:unchecked for details.

> Task :main:processResources
> Task :main:classes
> Task :main:jar
> Task :ooxml:ant-check-jars
> Task :ooxml:ant-fetch-jars
> Task :ooxml:ant-check-ooxml-jars
> Task :ooxml:ant-fetch-ooxml-jars

> Task :ooxml:ant-init
[ant:echo] Using Ant: Apache Ant(TM) version 1.10.9 compiled on September 27 2020 from ${ant.home}, Ant detected Java 1.8 (may be different than actual Java sometimes...)
[ant:echo] Using Java: 1.8.0_281/1.8.0_281-b09/25.281-b09/Java HotSpot(TM) 64-Bit Server VM from Oracle Corporation on Linux: 4.15.0-66-generic
[ant:echo] Building Apache POI version 5.0.1-SNAPSHOT and RC: RC1

> Task :ooxml:ant-check-compiled-ooxml-xsds

> Task :ooxml:ant-compile-ooxml-xsds
SchemaCompiler  Metadata LOAD:org/apache/xmlbeans/metadata GEN:org/apache/poi/schemas/ooxml
Time to build schema type system: 2.175 seconds
Time to generate code: 5.567 seconds

> Task :scratchpad:compileJava
Note: Some input files use or override a deprecated API.
Note: Recompile with -Xlint:deprecation for details.
Note: Some input files use unchecked or unsafe operations.
Note: Recompile with -Xlint:unchecked for details.

> Task :scratchpad:processResources
> Task :scratchpad:classes
> Task :scratchpad:jar

> Task :ooxml:compileJava
Note: Some input files use or override a deprecated API.
Note: Recompile with -Xlint:deprecation for details.
Note: Some input files use unchecked or unsafe operations.
Note: Recompile with -Xlint:unchecked for details.

> Task :ooxml:processResources
> Task :ooxml:classes
> Task :ooxml:jar
> Task :examples:compileJava
> Task :examples:processResources NO-SOURCE
> Task :examples:classes
> Task :examples:jar
> Task :examples:japicmp SKIPPED
> Task :excelant:compileJava
> Task :excelant:processResources
> Task :excelant:classes
> Task :excelant:jar
> Task :excelant:japicmp FAILED

FAILURE: Build failed with an exception.

* What went wrong:
Execution failed for task ':excelant:japicmp'.
> Failed to load file from jar 'META-INF/versions/9/module-info.class' as class file: invalid constant type: 19 at 3.

* Try:
Run with --stacktrace option to get the stack trace. Run with --info or --debug option to get more log output. Run with --scan to get full insights.

* Get more help at https://help.gradle.org

Deprecated Gradle features were used in this build, making it incompatible with Gradle 7.0.
Use '--warning-mode all' to show the individual deprecation warnings.
See https://docs.gradle.org/6.8/userguide/command_line_interface.html#sec:command_line_warnings

BUILD FAILED in 2m 8s
22 actionable tasks: 22 executed
Build step 'Invoke Gradle script' changed build result to FAILURE
Build step 'Invoke Gradle script' marked build as failure
Archiving artifacts

---------------------------------------------------------------------
To unsubscribe, e-mail: [hidden email]
For additional commands, e-mail: [hidden email]

12