Build failed in Jenkins: POI » POI-DSL-API-Check #28

classic Classic list List threaded Threaded
4 messages Options
Reply | Threaded
Open this post in threaded view
|

Build failed in Jenkins: POI » POI-DSL-API-Check #28

Apache Jenkins Server
See <https://ci-builds.apache.org/job/POI/job/POI-DSL-API-Check/28/display/redirect?page=changes>

Changes:

[PJ Fanning] disable broken test

[PJ Fanning] use xmlbeans official 4.0.0 release


------------------------------------------
[...truncated 3.55 KB...]

At revision 1882593

No changes for https://svn.apache.org/repos/asf/poi/site/forrest.properties since the previous build
No changes for https://svn.apache.org/repos/asf/poi/site/src/documentation since the previous build
[POI-DSL-API-Check] $ /bin/sh -xe /tmp/jenkins4097867330170531115.sh
+ svn status
?       build.javacheck.xml
    X   forrest.properties
X       src/documentation

Performing status on external item at 'src/documentation':
+ echo Java-Home: /home/jenkins/tools/java/latest1.8
Java-Home: /home/jenkins/tools/java/latest1.8
+ ls -al /home/jenkins/tools/java/latest1.8/
total 51232
drwxrwxr-x  9 root root     4096 Jul  2 22:09 .
drwxr-xr-x 31 root root     4096 Oct  3 09:54 ..
-r--r--r--  1 root root     1522 Apr  6  2020 ASSEMBLY_EXCEPTION
drwxrwxr-x  2 root root     4096 Jul  2 22:09 bin
drwxrwxr-x 10 root root     4096 Jul  2 22:09 demo
drwxrwxr-x  3 root root     4096 Jul  2 22:09 include
drwxrwxr-x  4 root root     4096 Jul  2 22:09 jre
drwxrwxr-x  3 root root     4096 Jul  2 22:09 lib
-r--r--r--  1 root root    19274 Apr  6  2020 LICENSE
drwxrwxr-x  4 root root     4096 Jul  2 22:09 man
-rw-rw-r--  1 root root      238 Apr  6  2020 release
drwxrwxr-x 10 root root     4096 Jul  2 22:09 sample
-rw-rw-r--  1 root root 52236869 Apr  6  2020 src.zip
-r--r--r--  1 root root   153250 Apr  6  2020 THIRD_PARTY_README
+ ls -al /home/jenkins/tools/java/latest1.8/bin
total 748
drwxrwxr-x 2 root root   4096 Jul  2 22:09 .
drwxrwxr-x 9 root root   4096 Jul  2 22:09 ..
-rwxr-xr-x 1 root root   9065 Apr  6  2020 appletviewer
-rwxr-xr-x 1 root root   9073 Apr  6  2020 clhsdb
-rwxr-xr-x 1 root root   9065 Apr  6  2020 extcheck
-rwxr-xr-x 1 root root   9065 Apr  6  2020 hsdb
-rwxr-xr-x 1 root root   9057 Apr  6  2020 idlj
-rwxr-xr-x 1 root root   9057 Apr  6  2020 jar
-rwxr-xr-x 1 root root   9065 Apr  6  2020 jarsigner
-rwxr-xr-x 1 root root   8930 Apr  6  2020 java
-rwxr-xr-x 1 root root   9057 Apr  6  2020 javac
-rwxr-xr-x 1 root root   9065 Apr  6  2020 javadoc
-rwxr-xr-x 1 root root   9057 Apr  6  2020 javah
-rwxr-xr-x 1 root root   9057 Apr  6  2020 javap
-rwxrwxr-x 1 root root   2806 Apr  6  2020 java-rmi.cgi
-rwxr-xr-x 1 root root   9057 Apr  6  2020 jcmd
-rwxr-xr-x 1 root root   9089 Apr  6  2020 jconsole
-rwxr-xr-x 1 root root   9065 Apr  6  2020 jdb
-rwxr-xr-x 1 root root   9057 Apr  6  2020 jdeps
-rwxr-xr-x 1 root root   9057 Apr  6  2020 jhat
-rwxr-xr-x 1 root root   9097 Apr  6  2020 jinfo
-rwxr-xr-x 1 root root   9057 Apr  6  2020 jjs
-rwxr-xr-x 1 root root   9097 Apr  6  2020 jmap
-rwxr-xr-x 1 root root   9057 Apr  6  2020 jps
-rwxr-xr-x 1 root root   9065 Apr  6  2020 jrunscript
-rwxr-xr-x 1 root root   9073 Apr  6  2020 jsadebugd
-rwxr-xr-x 1 root root   9105 Apr  6  2020 jstack
-rwxr-xr-x 1 root root   9057 Apr  6  2020 jstat
-rwxr-xr-x 1 root root   9065 Apr  6  2020 jstatd
-rwxr-xr-x 1 root root   9065 Apr  6  2020 keytool
-rwxr-xr-x 1 root root   9065 Apr  6  2020 native2ascii
-rwxr-xr-x 1 root root   9105 Apr  6  2020 orbd
-rwxr-xr-x 1 root root   9065 Apr  6  2020 pack200
-rwxr-xr-x 1 root root   9065 Apr  6  2020 policytool
-rwxr-xr-x 1 root root   9057 Apr  6  2020 rmic
-rwxr-xr-x 1 root root   9057 Apr  6  2020 rmid
-rwxr-xr-x 1 root root   9065 Apr  6  2020 rmiregistry
-rwxr-xr-x 1 root root   9065 Apr  6  2020 schemagen
-rwxr-xr-x 1 root root   9065 Apr  6  2020 serialver
-rwxr-xr-x 1 root root   9065 Apr  6  2020 servertool
-rwxr-xr-x 1 root root   9113 Apr  6  2020 tnameserv
-rwxr-xr-x 1 root root 245802 Apr  6  2020 unpack200
-rwxr-xr-x 1 root root   9057 Apr  6  2020 wsgen
-rwxr-xr-x 1 root root   9065 Apr  6  2020 wsimport
-rwxr-xr-x 1 root root   9057 Apr  6  2020 xjc
+ /home/jenkins/tools/java/latest1.8/bin/java -version
openjdk version "1.8.0_252"
OpenJDK Runtime Environment (build 1.8.0_252-b09)
OpenJDK 64-Bit Server VM (build 25.252-b09, mixed mode)
+ echo which java
which java
+ which java
/home/jenkins/tools/java/latest1.8/bin/java
+ java -version
openjdk version "1.8.0_252"
OpenJDK Runtime Environment (build 1.8.0_252-b09)
OpenJDK 64-Bit Server VM (build 25.252-b09, mixed mode)
+ echo which javac
which javac
+ which javac
/home/jenkins/tools/java/latest1.8/bin/javac
+ javac -version
javac 1.8.0_252
+ echo Ant-Home:
Ant-Home:
+ ls -al
total 464
drwxr-xr-x 15 jenkins jenkins   4096 Sep 26 06:07 .
drwxr-xr-x  8 jenkins jenkins   4096 Oct 10 09:19 ..
drwxr-xr-x 31 jenkins jenkins   4096 Sep 26 06:08 build
-rw-r--r--  1 jenkins jenkins  13889 Oct 17 01:12 build.gradle
-rw-r--r--  1 jenkins jenkins    172 Sep 27 07:53 build.javacheck.xml
-rw-r--r--  1 jenkins jenkins 148892 Oct 17 01:12 build.xml
-rw-r--r--  1 jenkins jenkins   3341 Sep 26 06:07 .classpath
-rw-r--r--  1 jenkins jenkins   6160 Sep 26 06:07 doap_POI.rdf
-rw-r--r--  1 jenkins jenkins   2847 Sep 26 06:07 file-leak-detector.exclude
-rw-r--r--  1 jenkins jenkins   6229 Sep 26 06:07 forrest.properties
-rw-r--r--  1 jenkins jenkins     53 Sep 26 06:07 .gitattributes
-rw-r--r--  1 jenkins jenkins    493 Sep 26 06:07 .gitignore
drwxr-xr-x  3 jenkins jenkins   4096 Sep 26 06:07 gradle
drwxr-xr-x  6 jenkins jenkins   4096 Sep 26 06:07 .gradle
-rwxr-xr-x  1 jenkins jenkins   5917 Sep 26 06:07 gradlew
-rw-r--r--  1 jenkins jenkins   2842 Sep 26 06:07 gradlew.bat
drwxr-xr-x  2 jenkins jenkins   4096 Sep 26 06:07 jenkins
-rw-r--r--  1 jenkins jenkins 167284 Sep 26 06:07 KEYS
drwxr-xr-x  2 jenkins jenkins   4096 Sep 26 06:07 legal
drwxr-xr-x  9 jenkins jenkins   4096 Sep 26 06:07 lib
drwxr-xr-x  2 jenkins jenkins   4096 Sep 26 06:07 maven
drwxr-xr-x  3 jenkins jenkins   4096 Sep 26 06:07 osgi
-rw-r--r--  1 jenkins jenkins   4813 Sep 26 06:07 patch.xml
-rw-r--r--  1 jenkins jenkins    426 Sep 26 06:07 .project
-rw-r--r--  1 jenkins jenkins   4266 Sep 26 06:07 README.rst
drwxr-xr-x  2 jenkins jenkins   4096 Sep 26 06:07 .settings
-rw-r--r--  1 jenkins jenkins    556 Sep 26 06:07 settings.gradle
drwxr-xr-x 11 jenkins jenkins   4096 Sep 26 06:07 sonar
drwxr-xr-x 16 jenkins jenkins   4096 Sep 26 06:07 src
drwxr-xr-x  4 jenkins jenkins   4096 Oct 17 01:12 .svn
drwxr-xr-x 14 jenkins jenkins   4096 Sep 26 06:07 test-data
-rw-r--r--  1 jenkins jenkins    136 Sep 26 06:07 .travis.yml
+ echo which ant
which ant
+ which ant
/usr/bin/ant
+ ant -version
Apache Ant(TM) version 1.10.5 compiled on March 28 2019
+ echo <project default="test"><target name="test"><echo>Java ${ant.java.version}/${java.version}</echo><exec executable="javac"><arg value="-version"/></exec></target></project>
+ ant -f build.javacheck.xml -v
Apache Ant(TM) version 1.10.5 compiled on March 28 2019
Buildfile: <https://ci-builds.apache.org/job/POI/job/POI-DSL-API-Check/ws/build.javacheck.xml>
Detected Java version: 1.8 in: /usr/local/asfpackages/java/openjdk-8u252-b09/jre
Detected OS: Linux
parsing buildfile <https://ci-builds.apache.org/job/POI/job/POI-DSL-API-Check/ws/build.javacheck.xml> with URI = <https://ci-builds.apache.org/job/POI/job/POI-DSL-API-Check/ws/build.javacheck.xml>
Project base dir set to: <https://ci-builds.apache.org/job/POI/job/POI-DSL-API-Check/ws/>
Build sequence for target(s) `test' is [test]
Complete build sequence is [test, ]

test:
parsing buildfile jar:file:/usr/share/ant/lib/ant.jar!/org/apache/tools/ant/antlib.xml with URI = jar:file:/usr/share/ant/lib/ant.jar!/org/apache/tools/ant/antlib.xml from a zip file
     [echo] Java 1.8/1.8.0_252
     [exec] Current OS is Linux
     [exec] Executing 'javac' with arguments:
     [exec] '-version'
     [exec]
     [exec] The ' characters around the executable and arguments are
     [exec] not part of the command.
     [exec] javac 1.8.0_252

BUILD SUCCESSFUL
Total time: 0 seconds
+ exit 0
[Gradle] - Launching build.
[POI-DSL-API-Check] $ <https://ci-builds.apache.org/job/POI/job/POI-DSL-API-Check/ws/gradlew> japicmp
To honour the JVM settings for this build a new JVM will be forked. Please consider using the daemon: https://docs.gradle.org/6.5/userguide/gradle_daemon.html.
Daemon will be stopped at the end of the build stopping after processing

> Configure project :
Trying to override old definition of datatype junit
[ant:javac] : warning: 'includeantruntime' was not set, defaulting to build.sysclasspath=last; set to false for repeatable builds

> Task :main:compileJava
> Task :main:processResources UP-TO-DATE
> Task :main:classes
> Task :main:jar
> Task :ooxml:ant-check-jars
> Task :ooxml:ant-fetch-jars
> Task :ooxml:ant-check-ooxml-jars
> Task :ooxml:ant-fetch-ooxml-jars

> Task :ooxml:ant-init
[ant:echo] Using Ant: Apache Ant(TM) version 1.10.7 compiled on September 1 2019 from ${ant.home}, Ant detected Java 1.8 (may be different than actual Java sometimes...)
[ant:echo] Using Java: 1.8.0_252/1.8.0_252-b09/25.252-b09/OpenJDK 64-Bit Server VM from Oracle Corporation on Linux: 4.15.0-58-generic
[ant:echo] Building Apache POI version 5.0.0-SNAPSHOT and RC: RC1

> Task :ooxml:ant-check-compiled-ooxml-xsds
> Task :ooxml:ant-compile-ooxml-xsds
> Task :scratchpad:compileJava UP-TO-DATE
> Task :scratchpad:processResources UP-TO-DATE
> Task :scratchpad:classes UP-TO-DATE
> Task :scratchpad:jar UP-TO-DATE

> Task :ooxml:compileJava
<https://ci-builds.apache.org/job/POI/job/POI-DSL-API-Check/ws/src/ooxml/java/org/apache/poi/xssf/usermodel/XSSFVMLDrawing.java>:52: error: package org.apache.poi.schemas.vmldrawing does not exist
import org.apache.poi.schemas.vmldrawing.XmlDocument;
                                        ^
<https://ci-builds.apache.org/job/POI/job/POI-DSL-API-Check/ws/src/ooxml/java/org/apache/poi/xssf/usermodel/XSSFVMLDrawing.java>:99: error: cannot find symbol
    private XmlDocument root;
            ^
  symbol:   class XmlDocument
  location: class XSSFVMLDrawing
<https://ci-builds.apache.org/job/POI/job/POI-DSL-API-Check/ws/src/ooxml/java/org/apache/poi/xssf/usermodel/XSSFVMLDrawing.java>:126: error: cannot find symbol
    public XmlDocument getDocument() {
           ^
  symbol:   class XmlDocument
  location: class XSSFVMLDrawing
<https://ci-builds.apache.org/job/POI/job/POI-DSL-API-Check/ws/src/ooxml/java/org/apache/poi/xssf/usermodel/XSSFSignatureLine.java>:39: error: package org.apache.poi.schemas.vmldrawing does not exist
import org.apache.poi.schemas.vmldrawing.CTXML;
                                        ^
<https://ci-builds.apache.org/job/POI/job/POI-DSL-API-Check/ws/src/ooxml/java/org/apache/poi/xssf/usermodel/XSSFVMLDrawing.java>:148: error: package XmlDocument does not exist
        root = XmlDocument.Factory.parse(doc, xopt);
                          ^
<https://ci-builds.apache.org/job/POI/job/POI-DSL-API-Check/ws/src/ooxml/java/org/apache/poi/xssf/usermodel/XSSFVMLDrawing.java>:205: error: package XmlDocument does not exist
        root = XmlDocument.Factory.newInstance();
                          ^
<https://ci-builds.apache.org/job/POI/job/POI-DSL-API-Check/ws/src/ooxml/java/org/apache/poi/xssf/usermodel/XSSFSignatureLine.java>:63: error: cannot find symbol
        CTXML root = vml.getDocument().getXml();
        ^
  symbol:   class CTXML
  location: class XSSFSignatureLine
Note: Some input files use or override a deprecated API.
Note: Recompile with -Xlint:deprecation for details.
Note: <https://ci-builds.apache.org/job/POI/job/POI-DSL-API-Check/ws/src/ooxml/java/org/apache/poi/xslf/draw/SVGImageRenderer.java> uses unchecked or unsafe operations.
Note: Recompile with -Xlint:unchecked for details.
7 errors

> Task :ooxml:compileJava FAILED

FAILURE: Build failed with an exception.

* What went wrong:
Execution failed for task ':ooxml:compileJava'.
> Compilation failed; see the compiler error output for details.

* Try:
Run with --stacktrace option to get the stack trace. Run with --info or --debug option to get more log output. Run with --scan to get full insights.

* Get more help at https://help.gradle.org

Deprecated Gradle features were used in this build, making it incompatible with Gradle 7.0.
Use '--warning-mode all' to show the individual deprecation warnings.
See https://docs.gradle.org/6.5/userguide/command_line_interface.html#sec:command_line_warnings

BUILD FAILED in 30s
14 actionable tasks: 10 executed, 4 up-to-date
Build step 'Invoke Gradle script' changed build result to FAILURE
Build step 'Invoke Gradle script' marked build as failure
Archiving artifacts
[Fast Archiver] Compressed 29.34 MB of artifacts by 99.7% relative to #27

---------------------------------------------------------------------
To unsubscribe, e-mail: [hidden email]
For additional commands, e-mail: [hidden email]

Reply | Threaded
Open this post in threaded view
|

Build failed in Jenkins: POI » POI-DSL-API-Check #29

Apache Jenkins Server
See <https://ci-builds.apache.org/job/POI/job/POI-DSL-API-Check/29/display/redirect?page=changes>

Changes:

[Andreas Beeker] #64817 - Fix issue in testXLSXinPPT


------------------------------------------
[...truncated 376.56 KB...]
AU        src/documentation/resources/images/logoKarmokar1s.png
AU        src/documentation/resources/images/POIFSRootPropertyPreWrite.gif
AU        src/documentation/resources/images/logoWendyWise.png
AU        src/documentation/resources/images/POIFSPropertyTablePreWrite.gif
AU        src/documentation/resources/images/logoKarmokar5s.png
AU        src/documentation/resources/images/ss-features.png
AU        src/documentation/resources/images/businessplan.jpg
AU        src/documentation/resources/images/logoJanssen1.png
AU        src/documentation/resources/images/logoJanssen2.png
AU        src/documentation/resources/images/calendar.jpg
AU        src/documentation/resources/images/loancalc.jpg
AU        src/documentation/resources/images/usermodel.gif
AU        src/documentation/resources/images/logoLoicLefevre.png
AU        src/documentation/resources/images/simple-xls-with-function.jpg
AU        src/documentation/resources/images/logoRaPiGmbH1.png
AU        src/documentation/resources/images/PropertySet.jpg
AU        src/documentation/resources/images/logoRaPiGmbH2.png
AU        src/documentation/resources/images/vba-example.jpg
AU        src/documentation/resources/images/logoKarmokar2s.png
AU        src/documentation/resources/images/logoRaPiGmbH5.png
AU        src/documentation/resources/images/logoRaPiGmbH6.png
AU        src/documentation/resources/images/logoKarmokar6s.png
AU        src/documentation/resources/images/logoRaPiGmbH7.png
AU        src/documentation/resources/images/logoRaPiGmbH8.png
AU        src/documentation/resources/images/logoRaPiGmbH9.png
AU        src/documentation/resources/images/logoDanielFernandez.png
AU        src/documentation/resources/images/logoAndrewClements2.png
AU        src/documentation/resources/images/hslf_shapes.gif
AU        src/documentation/resources/images/logoWendyWise2.png
AU        src/documentation/resources/images/POIFSLifeCycle.gif
AU        src/documentation/resources/images/logoAdria1.png
AU        src/documentation/resources/images/logoAdria2.png
AU        src/documentation/resources/images/logoAdria3.png
AU        src/documentation/resources/images/remove.jpg
AU        src/documentation/resources/images/logoKarmokar3s.png
AU        src/documentation/resources/images/logoGlenStampoutlzis.png
AU        src/documentation/resources/images/logoKarmokar1.png
AU        src/documentation/resources/images/POIFSInitialization.gif
AU        src/documentation/resources/images/logoKarmokar2.png
AU        src/documentation/resources/images/logoRaPiGmbH10.png
AU        src/documentation/resources/images/logoKarmokar3.png
AU        src/documentation/resources/images/logoRaPiGmbH11.png
AU        src/documentation/resources/images/logoMichaelMosmann.png
AU        src/documentation/resources/images/logoKarmokar4.png
AU        src/documentation/resources/images/logoRaPiGmbH12.png
AU        src/documentation/resources/images/logoKarmokar5.png
AU        src/documentation/resources/images/logoKarmokar6.png
AU        src/documentation/resources/images/ApacheConEu08.jpg
AU        src/documentation/resources/images/BlockClassDiagram.gif
AU        src/documentation/resources/images/calculatePayment.jpg
AU        src/documentation/resources/images/PropertyTableClassDiagram.gif
AU        src/documentation/resources/images/logoRussellBeattie1.png
AU        src/documentation/resources/images/logoRussellBeattie2.png
AU        src/documentation/resources/images/logoRussellBeattie3.png
A         src/documentation/sitemap.xmap
AU        src/documentation/skinconf.xml
A         src/documentation/cli.xconf
AU        src/documentation/RELEASE-NOTES.txt
AU        src/documentation/README.txt
A         src/documentation/classes
A         src/documentation/classes/CatalogManager.properties
At revision 1882624

At revision 1882624

No changes for https://svn.apache.org/repos/asf/poi/site/forrest.properties since the previous build
[POI-DSL-API-Check] $ /bin/sh -xe /tmp/jenkins7323174639200133143.sh
+ svn status
    X   forrest.properties
X       src/documentation

Performing status on external item at 'src/documentation':
+ echo Java-Home: /home/jenkins/tools/java/latest1.8
Java-Home: /home/jenkins/tools/java/latest1.8
+ ls -al /home/jenkins/tools/java/latest1.8/
total 51232
drwxrwxr-x  9 root root     4096 Jul  2 22:13 .
drwxr-xr-x 31 root root     4096 Oct  3 10:14 ..
-r--r--r--  1 root root     1522 Apr  6  2020 ASSEMBLY_EXCEPTION
drwxrwxr-x  2 root root     4096 Jul  2 22:13 bin
drwxrwxr-x 10 root root     4096 Jul  2 22:13 demo
drwxrwxr-x  3 root root     4096 Jul  2 22:13 include
drwxrwxr-x  4 root root     4096 Jul  2 22:13 jre
drwxrwxr-x  3 root root     4096 Jul  2 22:13 lib
-r--r--r--  1 root root    19274 Apr  6  2020 LICENSE
drwxrwxr-x  4 root root     4096 Jul  2 22:13 man
-rw-rw-r--  1 root root      238 Apr  6  2020 release
drwxrwxr-x 10 root root     4096 Jul  2 22:13 sample
-rw-rw-r--  1 root root 52236869 Apr  6  2020 src.zip
-r--r--r--  1 root root   153250 Apr  6  2020 THIRD_PARTY_README
+ ls -al /home/jenkins/tools/java/latest1.8/bin
total 748
drwxrwxr-x 2 root root   4096 Jul  2 22:13 .
drwxrwxr-x 9 root root   4096 Jul  2 22:13 ..
-rwxr-xr-x 1 root root   9065 Apr  6  2020 appletviewer
-rwxr-xr-x 1 root root   9073 Apr  6  2020 clhsdb
-rwxr-xr-x 1 root root   9065 Apr  6  2020 extcheck
-rwxr-xr-x 1 root root   9065 Apr  6  2020 hsdb
-rwxr-xr-x 1 root root   9057 Apr  6  2020 idlj
-rwxr-xr-x 1 root root   9057 Apr  6  2020 jar
-rwxr-xr-x 1 root root   9065 Apr  6  2020 jarsigner
-rwxr-xr-x 1 root root   8930 Apr  6  2020 java
-rwxr-xr-x 1 root root   9057 Apr  6  2020 javac
-rwxr-xr-x 1 root root   9065 Apr  6  2020 javadoc
-rwxr-xr-x 1 root root   9057 Apr  6  2020 javah
-rwxr-xr-x 1 root root   9057 Apr  6  2020 javap
-rwxrwxr-x 1 root root   2806 Apr  6  2020 java-rmi.cgi
-rwxr-xr-x 1 root root   9057 Apr  6  2020 jcmd
-rwxr-xr-x 1 root root   9089 Apr  6  2020 jconsole
-rwxr-xr-x 1 root root   9065 Apr  6  2020 jdb
-rwxr-xr-x 1 root root   9057 Apr  6  2020 jdeps
-rwxr-xr-x 1 root root   9057 Apr  6  2020 jhat
-rwxr-xr-x 1 root root   9097 Apr  6  2020 jinfo
-rwxr-xr-x 1 root root   9057 Apr  6  2020 jjs
-rwxr-xr-x 1 root root   9097 Apr  6  2020 jmap
-rwxr-xr-x 1 root root   9057 Apr  6  2020 jps
-rwxr-xr-x 1 root root   9065 Apr  6  2020 jrunscript
-rwxr-xr-x 1 root root   9073 Apr  6  2020 jsadebugd
-rwxr-xr-x 1 root root   9105 Apr  6  2020 jstack
-rwxr-xr-x 1 root root   9057 Apr  6  2020 jstat
-rwxr-xr-x 1 root root   9065 Apr  6  2020 jstatd
-rwxr-xr-x 1 root root   9065 Apr  6  2020 keytool
-rwxr-xr-x 1 root root   9065 Apr  6  2020 native2ascii
-rwxr-xr-x 1 root root   9105 Apr  6  2020 orbd
-rwxr-xr-x 1 root root   9065 Apr  6  2020 pack200
-rwxr-xr-x 1 root root   9065 Apr  6  2020 policytool
-rwxr-xr-x 1 root root   9057 Apr  6  2020 rmic
-rwxr-xr-x 1 root root   9057 Apr  6  2020 rmid
-rwxr-xr-x 1 root root   9065 Apr  6  2020 rmiregistry
-rwxr-xr-x 1 root root   9065 Apr  6  2020 schemagen
-rwxr-xr-x 1 root root   9065 Apr  6  2020 serialver
-rwxr-xr-x 1 root root   9065 Apr  6  2020 servertool
-rwxr-xr-x 1 root root   9113 Apr  6  2020 tnameserv
-rwxr-xr-x 1 root root 245802 Apr  6  2020 unpack200
-rwxr-xr-x 1 root root   9057 Apr  6  2020 wsgen
-rwxr-xr-x 1 root root   9065 Apr  6  2020 wsimport
-rwxr-xr-x 1 root root   9057 Apr  6  2020 xjc
+ /home/jenkins/tools/java/latest1.8/bin/java -version
openjdk version "1.8.0_252"
OpenJDK Runtime Environment (build 1.8.0_252-b09)
OpenJDK 64-Bit Server VM (build 25.252-b09, mixed mode)
+ echo which java
which java
+ which java
/home/jenkins/tools/java/latest1.8/bin/java
+ java -version
openjdk version "1.8.0_252"
OpenJDK Runtime Environment (build 1.8.0_252-b09)
OpenJDK 64-Bit Server VM (build 25.252-b09, mixed mode)
+ echo which javac
which javac
+ which javac
/home/jenkins/tools/java/latest1.8/bin/javac
+ javac -version
javac 1.8.0_252
+ echo Ant-Home:
Ant-Home:
+ ls -al
total 448
drwxr-xr-x 12 jenkins jenkins   4096 Oct 19 01:13 .
drwxr-xr-x  3 jenkins jenkins   4096 Oct 19 01:12 ..
-rw-r--r--  1 jenkins jenkins  13889 Oct 19 01:13 build.gradle
-rw-r--r--  1 jenkins jenkins 148892 Oct 19 01:13 build.xml
-rw-r--r--  1 jenkins jenkins   3341 Oct 19 01:13 .classpath
-rw-r--r--  1 jenkins jenkins   6160 Oct 19 01:13 doap_POI.rdf
-rw-r--r--  1 jenkins jenkins   2847 Oct 19 01:13 file-leak-detector.exclude
-rw-r--r--  1 jenkins jenkins   6229 Oct 19 01:13 forrest.properties
-rw-r--r--  1 jenkins jenkins     53 Oct 19 01:13 .gitattributes
-rw-r--r--  1 jenkins jenkins    493 Oct 19 01:13 .gitignore
drwxr-xr-x  3 jenkins jenkins   4096 Oct 19 01:13 gradle
-rwxr-xr-x  1 jenkins jenkins   5917 Oct 19 01:13 gradlew
-rw-r--r--  1 jenkins jenkins   2842 Oct 19 01:13 gradlew.bat
drwxr-xr-x  2 jenkins jenkins   4096 Oct 19 01:13 jenkins
-rw-r--r--  1 jenkins jenkins 167284 Oct 19 01:13 KEYS
drwxr-xr-x  2 jenkins jenkins   4096 Oct 19 01:13 legal
drwxr-xr-x  2 jenkins jenkins   4096 Oct 19 01:13 maven
drwxr-xr-x  3 jenkins jenkins   4096 Oct 19 01:13 osgi
-rw-r--r--  1 jenkins jenkins   4813 Oct 19 01:13 patch.xml
-rw-r--r--  1 jenkins jenkins    426 Oct 19 01:13 .project
-rw-r--r--  1 jenkins jenkins   4266 Oct 19 01:13 README.rst
drwxr-xr-x  2 jenkins jenkins   4096 Oct 19 01:13 .settings
-rw-r--r--  1 jenkins jenkins    556 Oct 19 01:13 settings.gradle
drwxr-xr-x 11 jenkins jenkins   4096 Oct 19 01:13 sonar
drwxr-xr-x 16 jenkins jenkins   4096 Oct 19 01:13 src
drwxr-xr-x  4 jenkins jenkins   4096 Oct 19 01:13 .svn
drwxr-xr-x 14 jenkins jenkins   4096 Oct 19 01:13 test-data
-rw-r--r--  1 jenkins jenkins    136 Oct 19 01:13 .travis.yml
+ echo which ant
which ant
+ which ant
/usr/bin/ant
+ ant -version
Apache Ant(TM) version 1.10.5 compiled on March 28 2019
+ echo <project default="test"><target name="test"><echo>Java ${ant.java.version}/${java.version}</echo><exec executable="javac"><arg value="-version"/></exec></target></project>
+ ant -f build.javacheck.xml -v
Apache Ant(TM) version 1.10.5 compiled on March 28 2019
Buildfile: <https://ci-builds.apache.org/job/POI/job/POI-DSL-API-Check/ws/build.javacheck.xml>
Detected Java version: 1.8 in: /usr/local/asfpackages/java/openjdk-8u252-b09/jre
Detected OS: Linux
parsing buildfile <https://ci-builds.apache.org/job/POI/job/POI-DSL-API-Check/ws/build.javacheck.xml> with URI = <https://ci-builds.apache.org/job/POI/job/POI-DSL-API-Check/ws/build.javacheck.xml>
Project base dir set to: <https://ci-builds.apache.org/job/POI/job/POI-DSL-API-Check/ws/>
Build sequence for target(s) `test' is [test]
Complete build sequence is [test, ]

test:
parsing buildfile jar:file:/usr/share/ant/lib/ant.jar!/org/apache/tools/ant/antlib.xml with URI = jar:file:/usr/share/ant/lib/ant.jar!/org/apache/tools/ant/antlib.xml from a zip file
     [echo] Java 1.8/1.8.0_252
     [exec] Current OS is Linux
     [exec] Executing 'javac' with arguments:
     [exec] '-version'
     [exec]
     [exec] The ' characters around the executable and arguments are
     [exec] not part of the command.
     [exec] javac 1.8.0_252

BUILD SUCCESSFUL
Total time: 0 seconds
+ exit 0
[Gradle] - Launching build.
[POI-DSL-API-Check] $ <https://ci-builds.apache.org/job/POI/job/POI-DSL-API-Check/ws/gradlew> japicmp
To honour the JVM settings for this build a new JVM will be forked. Please consider using the daemon: https://docs.gradle.org/6.5/userguide/gradle_daemon.html.
Daemon will be stopped at the end of the build stopping after processing

> Configure project :
Trying to override old definition of datatype junit
[ant:javac] : warning: 'includeantruntime' was not set, defaulting to build.sysclasspath=last; set to false for repeatable builds

FAILURE: Build failed with an exception.

* Where:
Build file '<https://ci-builds.apache.org/job/POI/job/POI-DSL-API-Check/ws/build.gradle'> line: 77

* What went wrong:
A problem occurred evaluating root project 'poi'.
> https://ci-builds.apache.org/job/POI/job/POI-XMLBeans-DSL-1.8/lastSuccessfulBuild/artifact/build/xmlbeans-4.0.0.jar

* Try:
Run with --stacktrace option to get the stack trace. Run with --info or --debug option to get more log output. Run with --scan to get full insights.

* Get more help at https://help.gradle.org

Deprecated Gradle features were used in this build, making it incompatible with Gradle 7.0.
Use '--warning-mode all' to show the individual deprecation warnings.
See https://docs.gradle.org/6.5/userguide/command_line_interface.html#sec:command_line_warnings

BUILD FAILED in 21s
Build step 'Invoke Gradle script' changed build result to FAILURE
Build step 'Invoke Gradle script' marked build as failure
Archiving artifacts

---------------------------------------------------------------------
To unsubscribe, e-mail: [hidden email]
For additional commands, e-mail: [hidden email]

Reply | Threaded
Open this post in threaded view
|

Build failed in Jenkins: POI » POI-DSL-API-Check #30

Apache Jenkins Server
See <https://ci-builds.apache.org/job/POI/job/POI-DSL-API-Check/30/display/redirect?page=changes>

Changes:

[Andreas Beeker] update ant/maven values, builds@ decided to rename those

[Andreas Beeker] update jdk values, remove jdk 1.6

[Andreas Beeker] Ignore test on no-scratchpad run


------------------------------------------
Started by an SCM change
Running as SYSTEM
[EnvInject] - Loading node environment variables.
[EnvInject] - Preparing an environment for the build.
[EnvInject] - Keeping Jenkins system variables.
[EnvInject] - Keeping Jenkins build variables.
[EnvInject] - Injecting as environment variables the properties content
LANG=en_US.UTF-8
FORREST_HOME=/home/jenkins/tools/forrest/latest

[EnvInject] - Variables injected successfully.
[EnvInject] - Injecting contributions.
Building remotely on H33 (ubuntu) in workspace <https://ci-builds.apache.org/job/POI/job/POI-DSL-API-Check/ws/>
[WS-CLEANUP] Deleting project workspace...
[WS-CLEANUP] Done
Updating https://svn.apache.org/repos/asf/poi/trunk at revision '2020-10-20T01:13:18.950 +0000'
U         jenkins/create_jobs.groovy
U         src/ooxml/testcases/org/apache/poi/xssf/usermodel/TestXSSFBugs.java

<-- Got one external: forrest.properties, svn url: https://svn.apache.org/repos/asf/poi/site/forrest.properties -->
Fetching 'https://svn.apache.org/repos/asf/poi/site/forrest.properties' at -1 into '<https://ci-builds.apache.org/job/POI/job/POI-DSL-API-Check/ws/forrest.properties'>
At revision 1882672


<-- Got one external: documentation, svn url: https://svn.apache.org/repos/asf/poi/site/src/documentation -->
Fetching 'https://svn.apache.org/repos/asf/poi/site/src/documentation' at -1 into '<https://ci-builds.apache.org/job/POI/job/POI-DSL-API-Check/ws/src/documentation'>
At revision 1882672

At revision 1882672

No changes for https://svn.apache.org/repos/asf/poi/site/forrest.properties since the previous build
No changes for https://svn.apache.org/repos/asf/poi/site/src/documentation since the previous build
[POI-DSL-API-Check] $ /bin/sh -xe /tmp/jenkins7855812633514917920.sh
+ svn status
?       build.javacheck.xml
    X   forrest.properties
X       src/documentation

Performing status on external item at 'src/documentation':
+ echo Java-Home: /home/jenkins/tools/java/latest1.8
Java-Home: /home/jenkins/tools/java/latest1.8
+ ls -al /home/jenkins/tools/java/latest1.8/
total 51232
drwxrwxr-x  9 root root     4096 Jul  2 22:13 .
drwxr-xr-x 31 root root     4096 Oct  3 10:14 ..
-r--r--r--  1 root root     1522 Apr  6  2020 ASSEMBLY_EXCEPTION
drwxrwxr-x  2 root root     4096 Jul  2 22:13 bin
drwxrwxr-x 10 root root     4096 Jul  2 22:13 demo
drwxrwxr-x  3 root root     4096 Jul  2 22:13 include
drwxrwxr-x  4 root root     4096 Jul  2 22:13 jre
drwxrwxr-x  3 root root     4096 Jul  2 22:13 lib
-r--r--r--  1 root root    19274 Apr  6  2020 LICENSE
drwxrwxr-x  4 root root     4096 Jul  2 22:13 man
-rw-rw-r--  1 root root      238 Apr  6  2020 release
drwxrwxr-x 10 root root     4096 Jul  2 22:13 sample
-rw-rw-r--  1 root root 52236869 Apr  6  2020 src.zip
-r--r--r--  1 root root   153250 Apr  6  2020 THIRD_PARTY_README
+ ls -al /home/jenkins/tools/java/latest1.8/bin
total 748
drwxrwxr-x 2 root root   4096 Jul  2 22:13 .
drwxrwxr-x 9 root root   4096 Jul  2 22:13 ..
-rwxr-xr-x 1 root root   9065 Apr  6  2020 appletviewer
-rwxr-xr-x 1 root root   9073 Apr  6  2020 clhsdb
-rwxr-xr-x 1 root root   9065 Apr  6  2020 extcheck
-rwxr-xr-x 1 root root   9065 Apr  6  2020 hsdb
-rwxr-xr-x 1 root root   9057 Apr  6  2020 idlj
-rwxr-xr-x 1 root root   9057 Apr  6  2020 jar
-rwxr-xr-x 1 root root   9065 Apr  6  2020 jarsigner
-rwxr-xr-x 1 root root   8930 Apr  6  2020 java
-rwxr-xr-x 1 root root   9057 Apr  6  2020 javac
-rwxr-xr-x 1 root root   9065 Apr  6  2020 javadoc
-rwxr-xr-x 1 root root   9057 Apr  6  2020 javah
-rwxr-xr-x 1 root root   9057 Apr  6  2020 javap
-rwxrwxr-x 1 root root   2806 Apr  6  2020 java-rmi.cgi
-rwxr-xr-x 1 root root   9057 Apr  6  2020 jcmd
-rwxr-xr-x 1 root root   9089 Apr  6  2020 jconsole
-rwxr-xr-x 1 root root   9065 Apr  6  2020 jdb
-rwxr-xr-x 1 root root   9057 Apr  6  2020 jdeps
-rwxr-xr-x 1 root root   9057 Apr  6  2020 jhat
-rwxr-xr-x 1 root root   9097 Apr  6  2020 jinfo
-rwxr-xr-x 1 root root   9057 Apr  6  2020 jjs
-rwxr-xr-x 1 root root   9097 Apr  6  2020 jmap
-rwxr-xr-x 1 root root   9057 Apr  6  2020 jps
-rwxr-xr-x 1 root root   9065 Apr  6  2020 jrunscript
-rwxr-xr-x 1 root root   9073 Apr  6  2020 jsadebugd
-rwxr-xr-x 1 root root   9105 Apr  6  2020 jstack
-rwxr-xr-x 1 root root   9057 Apr  6  2020 jstat
-rwxr-xr-x 1 root root   9065 Apr  6  2020 jstatd
-rwxr-xr-x 1 root root   9065 Apr  6  2020 keytool
-rwxr-xr-x 1 root root   9065 Apr  6  2020 native2ascii
-rwxr-xr-x 1 root root   9105 Apr  6  2020 orbd
-rwxr-xr-x 1 root root   9065 Apr  6  2020 pack200
-rwxr-xr-x 1 root root   9065 Apr  6  2020 policytool
-rwxr-xr-x 1 root root   9057 Apr  6  2020 rmic
-rwxr-xr-x 1 root root   9057 Apr  6  2020 rmid
-rwxr-xr-x 1 root root   9065 Apr  6  2020 rmiregistry
-rwxr-xr-x 1 root root   9065 Apr  6  2020 schemagen
-rwxr-xr-x 1 root root   9065 Apr  6  2020 serialver
-rwxr-xr-x 1 root root   9065 Apr  6  2020 servertool
-rwxr-xr-x 1 root root   9113 Apr  6  2020 tnameserv
-rwxr-xr-x 1 root root 245802 Apr  6  2020 unpack200
-rwxr-xr-x 1 root root   9057 Apr  6  2020 wsgen
-rwxr-xr-x 1 root root   9065 Apr  6  2020 wsimport
-rwxr-xr-x 1 root root   9057 Apr  6  2020 xjc
+ /home/jenkins/tools/java/latest1.8/bin/java -version
openjdk version "1.8.0_252"
OpenJDK Runtime Environment (build 1.8.0_252-b09)
OpenJDK 64-Bit Server VM (build 25.252-b09, mixed mode)
+ echo which java
which java
+ which java
/home/jenkins/tools/java/latest1.8/bin/java
+ java -version
openjdk version "1.8.0_252"
OpenJDK Runtime Environment (build 1.8.0_252-b09)
OpenJDK 64-Bit Server VM (build 25.252-b09, mixed mode)
+ echo which javac
which javac
+ which javac
/home/jenkins/tools/java/latest1.8/bin/javac
+ javac -version
javac 1.8.0_252
+ echo Ant-Home:
Ant-Home:
+ ls -al
total 460
drwxr-xr-x 14 jenkins jenkins   4096 Oct 19 01:14 .
drwxr-xr-x  3 jenkins jenkins   4096 Oct 19 01:12 ..
drwxr-xr-x 10 jenkins jenkins   4096 Oct 19 01:14 build
-rw-r--r--  1 jenkins jenkins  13889 Oct 19 01:13 build.gradle
-rw-r--r--  1 jenkins jenkins    172 Oct 19 01:13 build.javacheck.xml
-rw-r--r--  1 jenkins jenkins 148892 Oct 19 01:13 build.xml
-rw-r--r--  1 jenkins jenkins   3341 Oct 19 01:13 .classpath
-rw-r--r--  1 jenkins jenkins   6160 Oct 19 01:13 doap_POI.rdf
-rw-r--r--  1 jenkins jenkins   2847 Oct 19 01:13 file-leak-detector.exclude
-rw-r--r--  1 jenkins jenkins   6229 Oct 19 01:13 forrest.properties
-rw-r--r--  1 jenkins jenkins     53 Oct 19 01:13 .gitattributes
-rw-r--r--  1 jenkins jenkins    493 Oct 19 01:13 .gitignore
drwxr-xr-x  3 jenkins jenkins   4096 Oct 19 01:13 gradle
drwxr-xr-x  6 jenkins jenkins   4096 Oct 19 01:14 .gradle
-rwxr-xr-x  1 jenkins jenkins   5917 Oct 19 01:13 gradlew
-rw-r--r--  1 jenkins jenkins   2842 Oct 19 01:13 gradlew.bat
drwxr-xr-x  2 jenkins jenkins   4096 Oct 20 01:16 jenkins
-rw-r--r--  1 jenkins jenkins 167284 Oct 19 01:13 KEYS
drwxr-xr-x  2 jenkins jenkins   4096 Oct 19 01:13 legal
drwxr-xr-x  2 jenkins jenkins   4096 Oct 19 01:13 maven
drwxr-xr-x  3 jenkins jenkins   4096 Oct 19 01:13 osgi
-rw-r--r--  1 jenkins jenkins   4813 Oct 19 01:13 patch.xml
-rw-r--r--  1 jenkins jenkins    426 Oct 19 01:13 .project
-rw-r--r--  1 jenkins jenkins   4266 Oct 19 01:13 README.rst
drwxr-xr-x  2 jenkins jenkins   4096 Oct 19 01:13 .settings
-rw-r--r--  1 jenkins jenkins    556 Oct 19 01:13 settings.gradle
drwxr-xr-x 11 jenkins jenkins   4096 Oct 19 01:13 sonar
drwxr-xr-x 16 jenkins jenkins   4096 Oct 19 01:13 src
drwxr-xr-x  4 jenkins jenkins   4096 Oct 20 01:17 .svn
drwxr-xr-x 14 jenkins jenkins   4096 Oct 19 01:13 test-data
-rw-r--r--  1 jenkins jenkins    136 Oct 19 01:13 .travis.yml
+ echo which ant
which ant
+ which ant
/usr/bin/ant
+ ant -version
Apache Ant(TM) version 1.10.5 compiled on March 28 2019
+ echo <project default="test"><target name="test"><echo>Java ${ant.java.version}/${java.version}</echo><exec executable="javac"><arg value="-version"/></exec></target></project>
+ ant -f build.javacheck.xml -v
Apache Ant(TM) version 1.10.5 compiled on March 28 2019
Buildfile: <https://ci-builds.apache.org/job/POI/job/POI-DSL-API-Check/ws/build.javacheck.xml>
Detected Java version: 1.8 in: /usr/local/asfpackages/java/openjdk-8u252-b09/jre
Detected OS: Linux
parsing buildfile <https://ci-builds.apache.org/job/POI/job/POI-DSL-API-Check/ws/build.javacheck.xml> with URI = <https://ci-builds.apache.org/job/POI/job/POI-DSL-API-Check/ws/build.javacheck.xml>
Project base dir set to: <https://ci-builds.apache.org/job/POI/job/POI-DSL-API-Check/ws/>
Build sequence for target(s) `test' is [test]
Complete build sequence is [test, ]

test:
parsing buildfile jar:file:/usr/share/ant/lib/ant.jar!/org/apache/tools/ant/antlib.xml with URI = jar:file:/usr/share/ant/lib/ant.jar!/org/apache/tools/ant/antlib.xml from a zip file
     [echo] Java 1.8/1.8.0_252
     [exec] Current OS is Linux
     [exec] Executing 'javac' with arguments:
     [exec] '-version'
     [exec]
     [exec] The ' characters around the executable and arguments are
     [exec] not part of the command.
     [exec] javac 1.8.0_252

BUILD SUCCESSFUL
Total time: 0 seconds
+ exit 0
[Gradle] - Launching build.
[POI-DSL-API-Check] $ <https://ci-builds.apache.org/job/POI/job/POI-DSL-API-Check/ws/gradlew> japicmp
To honour the JVM settings for this build a new JVM will be forked. Please consider using the daemon: https://docs.gradle.org/6.5/userguide/gradle_daemon.html.
Daemon will be stopped at the end of the build stopping after processing

> Configure project :
Trying to override old definition of datatype junit
[ant:javac] : warning: 'includeantruntime' was not set, defaulting to build.sysclasspath=last; set to false for repeatable builds

FAILURE: Build failed with an exception.

* Where:
Build file '<https://ci-builds.apache.org/job/POI/job/POI-DSL-API-Check/ws/build.gradle'> line: 77

* What went wrong:
A problem occurred evaluating root project 'poi'.
> https://ci-builds.apache.org/job/POI/job/POI-XMLBeans-DSL-1.8/lastSuccessfulBuild/artifact/build/xmlbeans-4.0.0.jar

* Try:
Run with --stacktrace option to get the stack trace. Run with --info or --debug option to get more log output. Run with --scan to get full insights.

* Get more help at https://help.gradle.org

Deprecated Gradle features were used in this build, making it incompatible with Gradle 7.0.
Use '--warning-mode all' to show the individual deprecation warnings.
See https://docs.gradle.org/6.5/userguide/command_line_interface.html#sec:command_line_warnings

BUILD FAILED in 13s
Build step 'Invoke Gradle script' changed build result to FAILURE
Build step 'Invoke Gradle script' marked build as failure
Archiving artifacts

---------------------------------------------------------------------
To unsubscribe, e-mail: [hidden email]
For additional commands, e-mail: [hidden email]

Reply | Threaded
Open this post in threaded view
|

Jenkins build is back to normal : POI » POI-DSL-API-Check #31

Apache Jenkins Server
See <https://ci-builds.apache.org/job/POI/job/POI-DSL-API-Check/31/display/redirect?page=changes>


---------------------------------------------------------------------
To unsubscribe, e-mail: [hidden email]
For additional commands, e-mail: [hidden email]