Build failed in Jenkins: POI » POI-DSL-1.8 #36

classic Classic list List threaded Threaded
4 messages Options
Reply | Threaded
Open this post in threaded view
|

Build failed in Jenkins: POI » POI-DSL-1.8 #36

Apache Jenkins Server
See <https://ci-builds.apache.org/job/POI/job/POI-DSL-1.8/36/display/redirect?page=changes>

Changes:

[Nick Burch] Test PPT file containing a XLSX via an OLE2 intermediate layer, from Apache Tika

[Nick Burch] Add unit test for XLSX embedded in PPT and WorkbookFactory, was already fixed


------------------------------------------
[...truncated 127.94 KB...]
    [junit] Running org.apache.poi.poifs.crypt.dsig.TestSignatureInfo
    [junit] Tests run: 15, Failures: 0, Errors: 0, Skipped: 1, Time elapsed: 10.411 sec
    [junit] Running org.apache.poi.poifs.crypt.tests.TestAgileEncryptionParameters
    [junit] Tests run: 60, Failures: 0, Errors: 0, Skipped: 0, Time elapsed: 18.295 sec
    [junit] Running org.apache.poi.poifs.crypt.tests.TestDecryptor
    [junit] Tests run: 7, Failures: 0, Errors: 0, Skipped: 0, Time elapsed: 0.585 sec
    [junit] Running org.apache.poi.poifs.crypt.tests.TestEncryptionInfo
    [junit] Tests run: 2, Failures: 0, Errors: 0, Skipped: 0, Time elapsed: 0.007 sec
    [junit] Running org.apache.poi.poifs.crypt.tests.TestEncryptor
    [junit] Tests run: 8, Failures: 0, Errors: 0, Skipped: 1, Time elapsed: 24.985 sec
    [junit] Running org.apache.poi.poifs.crypt.tests.TestHxxFEncryption
    [junit] Tests run: 20, Failures: 0, Errors: 0, Skipped: 0, Time elapsed: 1.118 sec
    [junit] Running org.apache.poi.poifs.crypt.tests.TestSecureTempZip
    [junit] Tests run: 2, Failures: 0, Errors: 0, Skipped: 0, Time elapsed: 0.335 sec
    [junit] Running org.apache.poi.sl.tests.TestFonts
    [junit] Tests run: 2, Failures: 0, Errors: 0, Skipped: 0, Time elapsed: 0.395 sec
    [junit] Running org.apache.poi.sl.tests.TestHeadersFooters
    [junit] Tests run: 1, Failures: 0, Errors: 0, Skipped: 0, Time elapsed: 0.041 sec
    [junit] Running org.apache.poi.sl.tests.TestOleShape
    [junit] Tests run: 6, Failures: 0, Errors: 0, Skipped: 0, Time elapsed: 0.442 sec
    [junit] Running org.apache.poi.sl.tests.TestSlide
    [junit] Tests run: 2, Failures: 0, Errors: 0, Skipped: 0, Time elapsed: 0.11 sec
    [junit] Running org.apache.poi.sl.tests.TestTable
    [junit] Tests run: 4, Failures: 0, Errors: 0, Skipped: 0, Time elapsed: 0.271 sec
    [junit] Running org.apache.poi.sl.tests.draw.TestDrawPictureShape
    [junit] Tests run: 2, Failures: 0, Errors: 0, Skipped: 0, Time elapsed: 0.105 sec
    [junit] Running org.apache.poi.ss.tests.TestWorkbookFactory
    [junit] Tests run: 12, Failures: 0, Errors: 0, Skipped: 0, Time elapsed: 1.279 sec
    [junit] Running org.apache.poi.ss.tests.extractor.TestEmbeddedExtractor
    [junit] Tests run: 3, Failures: 0, Errors: 0, Skipped: 0, Time elapsed: 0.372 sec
    [junit] Running org.apache.poi.ss.tests.format.TestCellFormatPart
    [junit] Tests run: 7, Failures: 0, Errors: 0, Skipped: 0, Time elapsed: 0.796 sec
    [junit] Running org.apache.poi.ss.tests.formula.TestFormulaParser
    [junit] Tests run: 9, Failures: 0, Errors: 0, Skipped: 0, Time elapsed: 0.185 sec
    [junit] Running org.apache.poi.ss.tests.formula.TestStructuredReferences
    [junit] Tests run: 2, Failures: 0, Errors: 0, Skipped: 0, Time elapsed: 0.306 sec
    [junit] Running org.apache.poi.ss.tests.formula.eval.TestXSSFCircularReferences
    [junit] Tests run: 4, Failures: 0, Errors: 0, Skipped: 0, Time elapsed: 0.046 sec
    [junit] Running org.apache.poi.ss.tests.formula.functions.TestProper
    [junit] Tests run: 4, Failures: 0, Errors: 0, Skipped: 0, Time elapsed: 2.22 sec
    [junit] Running org.apache.poi.ss.tests.formula.functions.TestSumifsXSSF
    [junit] Tests run: 1, Failures: 0, Errors: 0, Skipped: 0, Time elapsed: 0.031 sec
    [junit] Running org.apache.poi.ss.tests.formula.functions.TestVlookup
    [junit] Tests run: 6, Failures: 0, Errors: 0, Skipped: 0, Time elapsed: 65.522 sec
    [junit] Running org.apache.poi.ss.tests.usermodel.TestEmbedOLEPackage
    [junit] Tests run: 3, Failures: 0, Errors: 0, Skipped: 0, Time elapsed: 0.221 sec
    [junit] Running org.apache.poi.ss.tests.usermodel.TestXSSFBorderStyle
    [junit] Tests run: 1, Failures: 0, Errors: 0, Skipped: 0, Time elapsed: 0.018 sec
    [junit] Running org.apache.poi.ss.tests.usermodel.TestXSSFRangeCopier
    [junit] Tests run: 9, Failures: 0, Errors: 0, Skipped: 0, Time elapsed: 0.166 sec
    [junit] Running org.apache.poi.ss.tests.util.TestSXSSFCellUtil
    [junit] Tests run: 14, Failures: 0, Errors: 0, Skipped: 0, Time elapsed: 0.159 sec
    [junit] Running org.apache.poi.ss.tests.util.TestXSSFCellUtil
    [junit] Tests run: 14, Failures: 0, Errors: 0, Skipped: 0, Time elapsed: 0.102 sec
    [junit] Running org.apache.poi.ss.tests.util.TestXSSFPropertyTemplate
    [junit] Tests run: 2, Failures: 0, Errors: 0, Skipped: 0, Time elapsed: 0.056 sec
    [junit] Running org.apache.poi.util.tests.TestIdentifierManager
    [junit] Tests run: 5, Failures: 0, Errors: 0, Skipped: 0, Time elapsed: 0.004 sec
    [junit] Running org.apache.poi.util.tests.TestTempFileThreaded
    [junit] Tests run: 1, Failures: 0, Errors: 0, Skipped: 0, Time elapsed: 6.307 sec
    [junit] Running org.apache.poi.xddf.usermodel.TestNecessaryOOXMLClasses
    [junit] Tests run: 1, Failures: 0, Errors: 0, Skipped: 0, Time elapsed: 0.227 sec
    [junit] Running org.apache.poi.xddf.usermodel.TestXDDFColor
    [junit] Tests run: 5, Failures: 0, Errors: 0, Skipped: 0, Time elapsed: 0.105 sec
    [junit] Running org.apache.poi.xddf.usermodel.chart.TestXDDFChart
    [junit] Tests run: 2, Failures: 0, Errors: 0, Skipped: 0, Time elapsed: 0.025 sec
    [junit] Running org.apache.poi.xddf.usermodel.chart.TestXDDFChartExtensionList
    [junit] Tests run: 1, Failures: 0, Errors: 0, Skipped: 0, Time elapsed: 0.005 sec
    [junit] Running org.apache.poi.xddf.usermodel.chart.TestXDDFChartRemoveSeries
    [junit] Tests run: 4, Failures: 0, Errors: 0, Skipped: 0, Time elapsed: 0.165 sec
    [junit] Running org.apache.poi.xddf.usermodel.chart.TestXDDFDataSourcesFactory
    [junit] Tests run: 6, Failures: 0, Errors: 0, Skipped: 0, Time elapsed: 0.02 sec
    [junit] Running org.apache.poi.xddf.usermodel.text.TestXDDFTextBodyProperties
    [junit] Tests run: 1, Failures: 0, Errors: 0, Skipped: 0, Time elapsed: 0.016 sec
    [junit] Running org.apache.poi.xddf.usermodel.text.TestXDDFTextRun
    [junit] Tests run: 3, Failures: 0, Errors: 0, Skipped: 0, Time elapsed: 0.118 sec
    [junit] Running org.apache.poi.xdgf.extractor.TestXDGFVisioExtractor
    [junit] Tests run: 3, Failures: 0, Errors: 0, Skipped: 0, Time elapsed: 0.367 sec
    [junit] Running org.apache.poi.xslf.TestNecessaryOOXMLClasses
    [junit] Tests run: 1, Failures: 0, Errors: 0, Skipped: 0, Time elapsed: 0.009 sec
    [junit] Running org.apache.poi.xslf.TestXSLFBugs
    [junit] Tests run: 31, Failures: 0, Errors: 0, Skipped: 2, Time elapsed: 3.29 sec
    [junit] Running org.apache.poi.xslf.TestXSLFSlideShow
    [junit] Tests run: 5, Failures: 0, Errors: 0, Skipped: 0, Time elapsed: 0.141 sec
    [junit] Running org.apache.poi.xslf.extractor.TestXSLFPowerPointExtractor
    [junit] Tests run: 8, Failures: 0, Errors: 0, Skipped: 0, Time elapsed: 0.894 sec
    [junit] Running org.apache.poi.xslf.usermodel.TestPPTX2PNG
    [junit] Tests run: 20, Failures: 0, Errors: 0, Skipped: 0, Time elapsed: 37.527 sec
    [junit] Running org.apache.poi.xslf.usermodel.TestXMLSlideShow
    [junit] Tests run: 12, Failures: 0, Errors: 0, Skipped: 0, Time elapsed: 0.661 sec
    [junit] Running org.apache.poi.xslf.usermodel.TestXSLFAutoShape
    [junit] Tests run: 4, Failures: 0, Errors: 0, Skipped: 0, Time elapsed: 0.148 sec
    [junit] Running org.apache.poi.xslf.usermodel.TestXSLFBackground
    [junit] Tests run: 4, Failures: 0, Errors: 0, Skipped: 0, Time elapsed: 0.277 sec
    [junit] Running org.apache.poi.xslf.usermodel.TestXSLFChart
    [junit] Tests run: 5, Failures: 0, Errors: 0, Skipped: 0, Time elapsed: 0.363 sec
    [junit] Running org.apache.poi.xslf.usermodel.TestXSLFColor
    [junit] Tests run: 6, Failures: 0, Errors: 0, Skipped: 0, Time elapsed: 0.06 sec
    [junit] Running org.apache.poi.xslf.usermodel.TestXSLFConnectorShape
    [junit] Tests run: 2, Failures: 0, Errors: 0, Skipped: 0, Time elapsed: 0.074 sec
    [junit] Running org.apache.poi.xslf.usermodel.TestXSLFFreeformShape
    [junit] Tests run: 2, Failures: 0, Errors: 0, Skipped: 0, Time elapsed: 0.1 sec
    [junit] Running org.apache.poi.xslf.usermodel.TestXSLFGroupShape
    [junit] Tests run: 2, Failures: 0, Errors: 0, Skipped: 0, Time elapsed: 0.06 sec
    [junit] Running org.apache.poi.xslf.usermodel.TestXSLFHyperlink
    [junit] Tests run: 3, Failures: 0, Errors: 0, Skipped: 0, Time elapsed: 0.137 sec
    [junit] Running org.apache.poi.xslf.usermodel.TestXSLFNotes
    [junit] Tests run: 3, Failures: 0, Errors: 0, Skipped: 0, Time elapsed: 0.116 sec
    [junit] Running org.apache.poi.xslf.usermodel.TestXSLFPictureShape
    [junit] Tests run: 7, Failures: 0, Errors: 0, Skipped: 0, Time elapsed: 1.879 sec
    [junit] Running org.apache.poi.xslf.usermodel.TestXSLFShape
    [junit] Tests run: 3, Failures: 0, Errors: 0, Skipped: 0, Time elapsed: 0.121 sec
    [junit] Running org.apache.poi.xslf.usermodel.TestXSLFShapeContainer
    [junit] Tests run: 1, Failures: 0, Errors: 0, Skipped: 0, Time elapsed: 0.03 sec
    [junit] Running org.apache.poi.xslf.usermodel.TestXSLFSheet
    [junit] Tests run: 1, Failures: 0, Errors: 0, Skipped: 0, Time elapsed: 0.091 sec
    [junit] Running org.apache.poi.xslf.usermodel.TestXSLFSimpleShape
    [junit] Tests run: 7, Failures: 0, Errors: 0, Skipped: 0, Time elapsed: 2.655 sec
    [junit] Running org.apache.poi.xslf.usermodel.TestXSLFSlide
    [junit] Tests run: 5, Failures: 0, Errors: 0, Skipped: 0, Time elapsed: 0.845 sec
    [junit] Running org.apache.poi.xslf.usermodel.TestXSLFSlideShow
    [junit] Tests run: 6, Failures: 0, Errors: 0, Skipped: 0, Time elapsed: 0.261 sec
    [junit] Running org.apache.poi.xslf.usermodel.TestXSLFSlideShowFactory
    [junit] Tests run: 6, Failures: 0, Errors: 0, Skipped: 0, Time elapsed: 0.74 sec
    [junit] Running org.apache.poi.xslf.usermodel.TestXSLFTable
    [junit] Tests run: 6, Failures: 0, Errors: 0, Skipped: 0, Time elapsed: 2.779 sec
    [junit] Running org.apache.poi.xslf.usermodel.TestXSLFTableRow
    [junit] Tests run: 8, Failures: 0, Errors: 0, Skipped: 0, Time elapsed: 0.281 sec
    [junit] Running org.apache.poi.xslf.usermodel.TestXSLFTableStyles
    [junit] Tests run: 1, Failures: 0, Errors: 0, Skipped: 0, Time elapsed: 0.026 sec
    [junit] Running org.apache.poi.xslf.usermodel.TestXSLFTextBox
    [junit] Tests run: 2, Failures: 0, Errors: 0, Skipped: 0, Time elapsed: 0.055 sec
    [junit] Running org.apache.poi.xslf.usermodel.TestXSLFTextParagraph
    [junit] Tests run: 5, Failures: 0, Errors: 0, Skipped: 1, Time elapsed: 0.119 sec
    [junit] Running org.apache.poi.xslf.usermodel.TestXSLFTextRun
    [junit] Tests run: 4, Failures: 0, Errors: 0, Skipped: 0, Time elapsed: 0.116 sec
    [junit] Running org.apache.poi.xslf.usermodel.TestXSLFTextShape
    [junit] Tests run: 4, Failures: 0, Errors: 0, Skipped: 0, Time elapsed: 0.127 sec
    [junit] Running org.apache.poi.xslf.usermodel.TestXSLFTheme
    [junit] Tests run: 1, Failures: 0, Errors: 0, Skipped: 0, Time elapsed: 0.2 sec
    [junit] Running org.apache.poi.xssf.TestNecessaryOOXMLClasses
    [junit] Tests run: 1, Failures: 0, Errors: 0, Skipped: 0, Time elapsed: 0.005 sec
    [junit] Running org.apache.poi.xssf.TestSheetProtection
    [junit] Tests run: 17, Failures: 0, Errors: 0, Skipped: 0, Time elapsed: 0.163 sec
    [junit] Running org.apache.poi.xssf.TestWorkbookProtection
    [junit] Tests run: 8, Failures: 0, Errors: 0, Skipped: 0, Time elapsed: 0.66 sec
    [junit] Running org.apache.poi.xssf.TestXSSFCloneSheet
    [junit] Tests run: 8, Failures: 0, Errors: 0, Skipped: 0, Time elapsed: 0.223 sec
    [junit] Running org.apache.poi.xssf.TestXSSFOffset
    [junit] Tests run: 1, Failures: 0, Errors: 0, Skipped: 0, Time elapsed: 0.011 sec
    [junit] Running org.apache.poi.xssf.binary.TestXSSFBSharedStringsTable
    [junit] Tests run: 1, Failures: 0, Errors: 0, Skipped: 0, Time elapsed: 0.007 sec
    [junit] Running org.apache.poi.xssf.binary.TestXSSFBSheetHyperlinkManager
    [junit] Tests run: 1, Failures: 0, Errors: 0, Skipped: 0, Time elapsed: 0.012 sec
    [junit] Running org.apache.poi.xssf.eventusermodel.TestReadOnlySharedStringsTable
    [junit] Tests run: 4, Failures: 0, Errors: 0, Skipped: 0, Time elapsed: 0.017 sec
    [junit] Running org.apache.poi.xssf.eventusermodel.TestXSSFBReader
    [junit] Tests run: 4, Failures: 0, Errors: 0, Skipped: 0, Time elapsed: 0.04 sec
    [junit] Running org.apache.poi.xssf.eventusermodel.TestXSSFReader
    [junit] Tests run: 14, Failures: 0, Errors: 0, Skipped: 1, Time elapsed: 0.092 sec
    [junit] Running org.apache.poi.xssf.extractor.TestXSSFBEventBasedExcelExtractor
    [junit] Tests run: 4, Failures: 0, Errors: 0, Skipped: 0, Time elapsed: 0.068 sec
    [junit] Running org.apache.poi.xssf.extractor.TestXSSFEventBasedExcelExtractor
    [junit] Tests run: 12, Failures: 0, Errors: 0, Skipped: 0, Time elapsed: 0.356 sec
    [junit] Running org.apache.poi.xssf.extractor.TestXSSFEventBasedExcelExtractorUsingFactory
    [junit] Tests run: 12, Failures: 0, Errors: 0, Skipped: 0, Time elapsed: 0.324 sec
    [junit] Running org.apache.poi.xssf.extractor.TestXSSFExcelExtractor
    [junit] Tests run: 8, Failures: 0, Errors: 0, Skipped: 0, Time elapsed: 0.499 sec
    [junit] Running org.apache.poi.xssf.extractor.TestXSSFExcelExtractorUsingFactory
    [junit] Tests run: 8, Failures: 0, Errors: 0, Skipped: 0, Time elapsed: 0.41 sec
    [junit] Running org.apache.poi.xssf.extractor.TestXSSFExportToXML
    [junit] Tests run: 18, Failures: 0, Errors: 0, Skipped: 1, Time elapsed: 0.476 sec
    [junit] Running org.apache.poi.xssf.extractor.TestXSSFImportFromXML
    [junit] Tests run: 5, Failures: 0, Errors: 0, Skipped: 0, Time elapsed: 8.074 sec
    [junit] Running org.apache.poi.xssf.io.TestLoadSaveXSSF
    [junit] Tests run: 3, Failures: 0, Errors: 0, Skipped: 0, Time elapsed: 0.041 sec
    [junit] Running org.apache.poi.xssf.model.TestCalculationChain
    [junit] Tests run: 1, Failures: 0, Errors: 0, Skipped: 0, Time elapsed: 0.322 sec
    [junit] Running org.apache.poi.xssf.model.TestCommentsTable
    [junit] Tests run: 7, Failures: 0, Errors: 0, Skipped: 0, Time elapsed: 0.146 sec
    [junit] Running org.apache.poi.xssf.model.TestExternalLinksTable
    [junit] Tests run: 4, Failures: 0, Errors: 0, Skipped: 0, Time elapsed: 0.079 sec
    [junit] Running org.apache.poi.xssf.model.TestMapInfo
    [junit] Tests run: 1, Failures: 0, Errors: 0, Skipped: 0, Time elapsed: 0.011 sec
    [junit] Running org.apache.poi.xssf.model.TestSharedStringsTable
    [junit] Tests run: 4, Failures: 0, Errors: 0, Skipped: 0, Time elapsed: 0.106 sec
    [junit] Running org.apache.poi.xssf.model.TestStylesTable
    [junit] Tests run: 13, Failures: 0, Errors: 0, Skipped: 0, Time elapsed: 0.277 sec
    [junit] Running org.apache.poi.xssf.model.TestThemesTable
    [junit] Tests run: 3, Failures: 0, Errors: 0, Skipped: 0, Time elapsed: 0.115 sec
    [junit] Running org.apache.poi.xssf.streaming.TestAutoSizeColumnTracker
    [junit] Tests run: 8, Failures: 0, Errors: 0, Skipped: 0, Time elapsed: 0.057 sec
    [junit] Running org.apache.poi.xssf.streaming.TestDeferredSXSSFWorkbook
    [junit] Tests run: 31, Failures: 0, Errors: 0, Skipped: 3, Time elapsed: 0.776 sec
    [junit] Running org.apache.poi.xssf.streaming.TestOutlining
    [junit] Tests run: 6, Failures: 0, Errors: 0, Skipped: 0, Time elapsed: 0.029 sec
    [junit] Running org.apache.poi.xssf.streaming.TestSXSSFCell
    [junit] Tests run: 60, Failures: 0, Errors: 0, Skipped: 4, Time elapsed: 2.229 sec
    [junit] Running org.apache.poi.xssf.streaming.TestSXSSFDataValidation
    [junit] Tests run: 2, Failures: 0, Errors: 0, Skipped: 0, Time elapsed: 0.13 sec
    [junit] Running org.apache.poi.xssf.streaming.TestSXSSFEvaluationSheet
    [junit] Tests run: 1, Failures: 0, Errors: 0, Skipped: 0, Time elapsed: 0.007 sec
    [junit] Running org.apache.poi.xssf.streaming.TestSXSSFFormulaEvaluation
    [junit] Tests run: 29, Failures: 0, Errors: 0, Skipped: 1, Time elapsed: 1.213 sec
    [junit] Running org.apache.poi.xssf.streaming.TestSXSSFHyperlink
    [junit] Tests run: 2, Failures: 0, Errors: 0, Skipped: 0, Time elapsed: 0.025 sec
    [junit] Running org.apache.poi.xssf.streaming.TestSXSSFRow
    [junit] Tests run: 14, Failures: 0, Errors: 0, Skipped: 2, Time elapsed: 0.254 sec
    [junit] Running org.apache.poi.xssf.streaming.TestSXSSFSheet
    [junit] Tests run: 50, Failures: 0, Errors: 0, Skipped: 0, Time elapsed: 0.923 sec
    [junit] Running org.apache.poi.xssf.streaming.TestSXSSFSheetAutoSizeColumn
    [junit] Tests run: 26, Failures: 0, Errors: 0, Skipped: 0, Time elapsed: 0.137 sec
    [junit] Running org.apache.poi.xssf.streaming.TestSXSSFUnicodeSurrogates
    [junit] Tests run: 1, Failures: 0, Errors: 0, Skipped: 0, Time elapsed: 0.026 sec
    [junit] Running org.apache.poi.xssf.streaming.TestSXSSFWorkbook
    [junit] Tests run: 37, Failures: 0, Errors: 0, Skipped: 4, Time elapsed: 1.077 sec
    [junit] Running org.apache.poi.xssf.streaming.TestSXSSFWorkbookWithCustomZipEntrySource
    [junit] Tests run: 3, Failures: 0, Errors: 0, Skipped: 0, Time elapsed: 0.102 sec
    [junit] Running org.apache.poi.xssf.streaming.TestSheetDataWriter
    [junit] Tests run: 3, Failures: 0, Errors: 0, Skipped: 0, Time elapsed: 0.004 sec
    [junit] Running org.apache.poi.xssf.usermodel.TestFormulaEvaluatorOnXSSF
    [junit] Tests run: 369, Failures: 0, Errors: 0, Skipped: 90, Time elapsed: 0.528 sec
    [junit] Running org.apache.poi.xssf.usermodel.TestMatrixFormulasFromXMLSpreadsheet
    [junit] Tests run: 34, Failures: 0, Errors: 0, Skipped: 0, Time elapsed: 0.178 sec
    [junit] Running org.apache.poi.xssf.usermodel.TestMissingWorkbookOnXSSF
    [junit] Tests run: 3, Failures: 0, Errors: 0, Skipped: 0, Time elapsed: 0.041 sec
    [junit] Running org.apache.poi.xssf.usermodel.TestMultiSheetFormulaEvaluatorOnXSSF
    [junit] Tests run: 2, Failures: 0, Errors: 0, Skipped: 0, Time elapsed: 0.005 sec
    [junit] Running org.apache.poi.xssf.usermodel.TestSXSSFBugs
    [junit] Tests run: 43, Failures: 0, Errors: 0, Skipped: 9, Time elapsed: 8.314 sec
    [junit] Running org.apache.poi.xssf.usermodel.TestSheetHiding
    [junit] Tests run: 5, Failures: 0, Errors: 0, Skipped: 0, Time elapsed: 0.116 sec
    [junit] Running org.apache.poi.xssf.usermodel.TestTableStyles
    [junit] Tests run: 2, Failures: 0, Errors: 0, Skipped: 0, Time elapsed: 0.447 sec
    [junit] Running org.apache.poi.xssf.usermodel.TestXSSFBugs
    [junit] Tests run: 157, Failures: 0, Errors: 1, Skipped: 8, Time elapsed: 21.3 sec

BUILD FAILED
<https://ci-builds.apache.org/job/POI/job/POI-DSL-1.8/ws/build.xml>:1570: The following error occurred while executing this line:
<https://ci-builds.apache.org/job/POI/job/POI-DSL-1.8/ws/build.xml>:1538: The following error occurred while executing this line:
<https://ci-builds.apache.org/job/POI/job/POI-DSL-1.8/ws/build.xml>:1166: Tests failed

Total time: 14 minutes 3 seconds
Build step 'Invoke Ant' marked build as failure
[SpotBugs] Skipping execution of recorder since overall result is 'FAILURE'
Archiving artifacts
[Fast Archiver] Compressed 3.09 MB of artifacts by 99.2% relative to #35
Skipping publisher since build result is FAILURE
Recording test results

---------------------------------------------------------------------
To unsubscribe, e-mail: [hidden email]
For additional commands, e-mail: [hidden email]

Reply | Threaded
Open this post in threaded view
|

Build failed in Jenkins: POI » POI-DSL-1.8 #37

Apache Jenkins Server
See <https://ci-builds.apache.org/job/POI/job/POI-DSL-1.8/37/display/redirect?page=changes>

Changes:

[PJ Fanning] doc build fails if context has more than one value

[PJ Fanning] fix xslf urls


------------------------------------------
[...truncated 135.76 KB...]
    [junit] Running org.apache.poi.poifs.crypt.dsig.TestSignatureInfo
    [junit] Tests run: 15, Failures: 0, Errors: 0, Skipped: 1, Time elapsed: 8.311 sec
    [junit] Running org.apache.poi.poifs.crypt.tests.TestAgileEncryptionParameters
    [junit] Tests run: 60, Failures: 0, Errors: 0, Skipped: 0, Time elapsed: 10.376 sec
    [junit] Running org.apache.poi.poifs.crypt.tests.TestDecryptor
    [junit] Tests run: 7, Failures: 0, Errors: 0, Skipped: 0, Time elapsed: 0.492 sec
    [junit] Running org.apache.poi.poifs.crypt.tests.TestEncryptionInfo
    [junit] Tests run: 2, Failures: 0, Errors: 0, Skipped: 0, Time elapsed: 0.003 sec
    [junit] Running org.apache.poi.poifs.crypt.tests.TestEncryptor
    [junit] Tests run: 8, Failures: 0, Errors: 0, Skipped: 1, Time elapsed: 13.049 sec
    [junit] Running org.apache.poi.poifs.crypt.tests.TestHxxFEncryption
    [junit] Tests run: 20, Failures: 0, Errors: 0, Skipped: 0, Time elapsed: 0.713 sec
    [junit] Running org.apache.poi.poifs.crypt.tests.TestSecureTempZip
    [junit] Tests run: 2, Failures: 0, Errors: 0, Skipped: 0, Time elapsed: 0.229 sec
    [junit] Running org.apache.poi.sl.tests.TestFonts
    [junit] Tests run: 2, Failures: 0, Errors: 0, Skipped: 0, Time elapsed: 0.246 sec
    [junit] Running org.apache.poi.sl.tests.TestHeadersFooters
    [junit] Tests run: 1, Failures: 0, Errors: 0, Skipped: 0, Time elapsed: 0.046 sec
    [junit] Running org.apache.poi.sl.tests.TestOleShape
    [junit] Tests run: 6, Failures: 0, Errors: 0, Skipped: 0, Time elapsed: 0.271 sec
    [junit] Running org.apache.poi.sl.tests.TestSlide
    [junit] Tests run: 2, Failures: 0, Errors: 0, Skipped: 0, Time elapsed: 0.064 sec
    [junit] Running org.apache.poi.sl.tests.TestTable
    [junit] Tests run: 4, Failures: 0, Errors: 0, Skipped: 0, Time elapsed: 0.193 sec
    [junit] Running org.apache.poi.sl.tests.draw.TestDrawPictureShape
    [junit] Tests run: 2, Failures: 0, Errors: 0, Skipped: 0, Time elapsed: 0.088 sec
    [junit] Running org.apache.poi.ss.tests.TestWorkbookFactory
    [junit] Tests run: 12, Failures: 0, Errors: 0, Skipped: 0, Time elapsed: 0.929 sec
    [junit] Running org.apache.poi.ss.tests.extractor.TestEmbeddedExtractor
    [junit] Tests run: 3, Failures: 0, Errors: 0, Skipped: 0, Time elapsed: 0.237 sec
    [junit] Running org.apache.poi.ss.tests.format.TestCellFormatPart
    [junit] Tests run: 7, Failures: 0, Errors: 0, Skipped: 0, Time elapsed: 0.732 sec
    [junit] Running org.apache.poi.ss.tests.formula.TestFormulaParser
    [junit] Tests run: 9, Failures: 0, Errors: 0, Skipped: 0, Time elapsed: 0.142 sec
    [junit] Running org.apache.poi.ss.tests.formula.TestStructuredReferences
    [junit] Tests run: 2, Failures: 0, Errors: 0, Skipped: 0, Time elapsed: 0.194 sec
    [junit] Running org.apache.poi.ss.tests.formula.eval.TestXSSFCircularReferences
    [junit] Tests run: 4, Failures: 0, Errors: 0, Skipped: 0, Time elapsed: 0.027 sec
    [junit] Running org.apache.poi.ss.tests.formula.functions.TestProper
    [junit] Tests run: 4, Failures: 0, Errors: 0, Skipped: 0, Time elapsed: 1.531 sec
    [junit] Running org.apache.poi.ss.tests.formula.functions.TestSumifsXSSF
    [junit] Tests run: 1, Failures: 0, Errors: 0, Skipped: 0, Time elapsed: 0.039 sec
    [junit] Running org.apache.poi.ss.tests.formula.functions.TestVlookup
    [junit] Tests run: 6, Failures: 0, Errors: 0, Skipped: 0, Time elapsed: 31.518 sec
    [junit] Running org.apache.poi.ss.tests.usermodel.TestEmbedOLEPackage
    [junit] Tests run: 3, Failures: 0, Errors: 0, Skipped: 0, Time elapsed: 0.136 sec
    [junit] Running org.apache.poi.ss.tests.usermodel.TestXSSFBorderStyle
    [junit] Tests run: 1, Failures: 0, Errors: 0, Skipped: 0, Time elapsed: 0.01 sec
    [junit] Running org.apache.poi.ss.tests.usermodel.TestXSSFRangeCopier
    [junit] Tests run: 9, Failures: 0, Errors: 0, Skipped: 0, Time elapsed: 0.095 sec
    [junit] Running org.apache.poi.ss.tests.util.TestSXSSFCellUtil
    [junit] Tests run: 14, Failures: 0, Errors: 0, Skipped: 0, Time elapsed: 0.085 sec
    [junit] Running org.apache.poi.ss.tests.util.TestXSSFCellUtil
    [junit] Tests run: 14, Failures: 0, Errors: 0, Skipped: 0, Time elapsed: 0.059 sec
    [junit] Running org.apache.poi.ss.tests.util.TestXSSFPropertyTemplate
    [junit] Tests run: 2, Failures: 0, Errors: 0, Skipped: 0, Time elapsed: 0.03 sec
    [junit] Running org.apache.poi.util.tests.TestIdentifierManager
    [junit] Tests run: 5, Failures: 0, Errors: 0, Skipped: 0, Time elapsed: 0.003 sec
    [junit] Running org.apache.poi.util.tests.TestTempFileThreaded
    [junit] Tests run: 1, Failures: 0, Errors: 0, Skipped: 0, Time elapsed: 4.412 sec
    [junit] Running org.apache.poi.xddf.usermodel.TestNecessaryOOXMLClasses
    [junit] Tests run: 1, Failures: 0, Errors: 0, Skipped: 0, Time elapsed: 0.131 sec
    [junit] Running org.apache.poi.xddf.usermodel.TestXDDFColor
    [junit] Tests run: 5, Failures: 0, Errors: 0, Skipped: 0, Time elapsed: 0.063 sec
    [junit] Running org.apache.poi.xddf.usermodel.chart.TestXDDFChart
    [junit] Tests run: 2, Failures: 0, Errors: 0, Skipped: 0, Time elapsed: 0.014 sec
    [junit] Running org.apache.poi.xddf.usermodel.chart.TestXDDFChartExtensionList
    [junit] Tests run: 1, Failures: 0, Errors: 0, Skipped: 0, Time elapsed: 0.004 sec
    [junit] Running org.apache.poi.xddf.usermodel.chart.TestXDDFChartRemoveSeries
    [junit] Tests run: 4, Failures: 0, Errors: 0, Skipped: 0, Time elapsed: 0.09 sec
    [junit] Running org.apache.poi.xddf.usermodel.chart.TestXDDFDataSourcesFactory
    [junit] Tests run: 6, Failures: 0, Errors: 0, Skipped: 0, Time elapsed: 0.012 sec
    [junit] Running org.apache.poi.xddf.usermodel.text.TestXDDFTextBodyProperties
    [junit] Tests run: 1, Failures: 0, Errors: 0, Skipped: 0, Time elapsed: 0.01 sec
    [junit] Running org.apache.poi.xddf.usermodel.text.TestXDDFTextRun
    [junit] Tests run: 3, Failures: 0, Errors: 0, Skipped: 0, Time elapsed: 0.099 sec
    [junit] Running org.apache.poi.xdgf.extractor.TestXDGFVisioExtractor
    [junit] Tests run: 3, Failures: 0, Errors: 0, Skipped: 0, Time elapsed: 0.298 sec
    [junit] Running org.apache.poi.xslf.TestNecessaryOOXMLClasses
    [junit] Tests run: 1, Failures: 0, Errors: 0, Skipped: 0, Time elapsed: 0.005 sec
    [junit] Running org.apache.poi.xslf.TestXSLFBugs
    [junit] Tests run: 31, Failures: 0, Errors: 0, Skipped: 2, Time elapsed: 2.167 sec
    [junit] Running org.apache.poi.xslf.TestXSLFSlideShow
    [junit] Tests run: 5, Failures: 0, Errors: 0, Skipped: 0, Time elapsed: 0.107 sec
    [junit] Running org.apache.poi.xslf.extractor.TestXSLFPowerPointExtractor
    [junit] Tests run: 8, Failures: 0, Errors: 0, Skipped: 0, Time elapsed: 0.711 sec
    [junit] Running org.apache.poi.xslf.usermodel.TestPPTX2PNG
    [junit] Tests run: 20, Failures: 0, Errors: 0, Skipped: 0, Time elapsed: 20.389 sec
    [junit] Running org.apache.poi.xslf.usermodel.TestXMLSlideShow
    [junit] Tests run: 12, Failures: 0, Errors: 0, Skipped: 0, Time elapsed: 0.305 sec
    [junit] Running org.apache.poi.xslf.usermodel.TestXSLFAutoShape
    [junit] Tests run: 4, Failures: 0, Errors: 0, Skipped: 0, Time elapsed: 0.073 sec
    [junit] Running org.apache.poi.xslf.usermodel.TestXSLFBackground
    [junit] Tests run: 4, Failures: 0, Errors: 0, Skipped: 0, Time elapsed: 0.141 sec
    [junit] Running org.apache.poi.xslf.usermodel.TestXSLFChart
    [junit] Tests run: 5, Failures: 0, Errors: 0, Skipped: 0, Time elapsed: 0.214 sec
    [junit] Running org.apache.poi.xslf.usermodel.TestXSLFColor
    [junit] Tests run: 6, Failures: 0, Errors: 0, Skipped: 0, Time elapsed: 0.031 sec
    [junit] Running org.apache.poi.xslf.usermodel.TestXSLFConnectorShape
    [junit] Tests run: 2, Failures: 0, Errors: 0, Skipped: 0, Time elapsed: 0.036 sec
    [junit] Running org.apache.poi.xslf.usermodel.TestXSLFFreeformShape
    [junit] Tests run: 2, Failures: 0, Errors: 0, Skipped: 0, Time elapsed: 0.066 sec
    [junit] Running org.apache.poi.xslf.usermodel.TestXSLFGroupShape
    [junit] Tests run: 2, Failures: 0, Errors: 0, Skipped: 0, Time elapsed: 0.033 sec
    [junit] Running org.apache.poi.xslf.usermodel.TestXSLFHyperlink
    [junit] Tests run: 3, Failures: 0, Errors: 0, Skipped: 0, Time elapsed: 0.076 sec
    [junit] Running org.apache.poi.xslf.usermodel.TestXSLFNotes
    [junit] Tests run: 3, Failures: 0, Errors: 0, Skipped: 0, Time elapsed: 0.056 sec
    [junit] Running org.apache.poi.xslf.usermodel.TestXSLFPictureShape
    [junit] Tests run: 7, Failures: 0, Errors: 0, Skipped: 0, Time elapsed: 1.202 sec
    [junit] Running org.apache.poi.xslf.usermodel.TestXSLFShape
    [junit] Tests run: 3, Failures: 0, Errors: 0, Skipped: 0, Time elapsed: 0.105 sec
    [junit] Running org.apache.poi.xslf.usermodel.TestXSLFShapeContainer
    [junit] Tests run: 1, Failures: 0, Errors: 0, Skipped: 0, Time elapsed: 0.023 sec
    [junit] Running org.apache.poi.xslf.usermodel.TestXSLFSheet
    [junit] Tests run: 1, Failures: 0, Errors: 0, Skipped: 0, Time elapsed: 0.056 sec
    [junit] Running org.apache.poi.xslf.usermodel.TestXSLFSimpleShape
    [junit] Tests run: 7, Failures: 0, Errors: 0, Skipped: 0, Time elapsed: 1.63 sec
    [junit] Running org.apache.poi.xslf.usermodel.TestXSLFSlide
    [junit] Tests run: 5, Failures: 0, Errors: 0, Skipped: 0, Time elapsed: 0.468 sec
    [junit] Running org.apache.poi.xslf.usermodel.TestXSLFSlideShow
    [junit] Tests run: 6, Failures: 0, Errors: 0, Skipped: 0, Time elapsed: 0.156 sec
    [junit] Running org.apache.poi.xslf.usermodel.TestXSLFSlideShowFactory
    [junit] Tests run: 6, Failures: 0, Errors: 0, Skipped: 0, Time elapsed: 0.398 sec
    [junit] Running org.apache.poi.xslf.usermodel.TestXSLFTable
    [junit] Tests run: 6, Failures: 0, Errors: 0, Skipped: 0, Time elapsed: 1.495 sec
    [junit] Running org.apache.poi.xslf.usermodel.TestXSLFTableRow
    [junit] Tests run: 8, Failures: 0, Errors: 0, Skipped: 0, Time elapsed: 0.153 sec
    [junit] Running org.apache.poi.xslf.usermodel.TestXSLFTableStyles
    [junit] Tests run: 1, Failures: 0, Errors: 0, Skipped: 0, Time elapsed: 0.013 sec
    [junit] Running org.apache.poi.xslf.usermodel.TestXSLFTextBox
    [junit] Tests run: 2, Failures: 0, Errors: 0, Skipped: 0, Time elapsed: 0.028 sec
    [junit] Running org.apache.poi.xslf.usermodel.TestXSLFTextParagraph
    [junit] Tests run: 5, Failures: 0, Errors: 0, Skipped: 1, Time elapsed: 0.063 sec
    [junit] Running org.apache.poi.xslf.usermodel.TestXSLFTextRun
    [junit] Tests run: 4, Failures: 0, Errors: 0, Skipped: 0, Time elapsed: 0.076 sec
    [junit] Running org.apache.poi.xslf.usermodel.TestXSLFTextShape
    [junit] Tests run: 4, Failures: 0, Errors: 0, Skipped: 0, Time elapsed: 0.071 sec
    [junit] Running org.apache.poi.xslf.usermodel.TestXSLFTheme
    [junit] Tests run: 1, Failures: 0, Errors: 0, Skipped: 0, Time elapsed: 0.094 sec
    [junit] Running org.apache.poi.xssf.TestNecessaryOOXMLClasses
    [junit] Tests run: 1, Failures: 0, Errors: 0, Skipped: 0, Time elapsed: 0.003 sec
    [junit] Running org.apache.poi.xssf.TestSheetProtection
    [junit] Tests run: 17, Failures: 0, Errors: 0, Skipped: 0, Time elapsed: 0.089 sec
    [junit] Running org.apache.poi.xssf.TestWorkbookProtection
    [junit] Tests run: 8, Failures: 0, Errors: 0, Skipped: 0, Time elapsed: 0.412 sec
    [junit] Running org.apache.poi.xssf.TestXSSFCloneSheet
    [junit] Tests run: 8, Failures: 0, Errors: 0, Skipped: 0, Time elapsed: 0.136 sec
    [junit] Running org.apache.poi.xssf.TestXSSFOffset
    [junit] Tests run: 1, Failures: 0, Errors: 0, Skipped: 0, Time elapsed: 0.007 sec
    [junit] Running org.apache.poi.xssf.binary.TestXSSFBSharedStringsTable
    [junit] Tests run: 1, Failures: 0, Errors: 0, Skipped: 0, Time elapsed: 0.014 sec
    [junit] Running org.apache.poi.xssf.binary.TestXSSFBSheetHyperlinkManager
    [junit] Tests run: 1, Failures: 0, Errors: 0, Skipped: 0, Time elapsed: 0.009 sec
    [junit] Running org.apache.poi.xssf.eventusermodel.TestReadOnlySharedStringsTable
    [junit] Tests run: 4, Failures: 0, Errors: 0, Skipped: 0, Time elapsed: 0.013 sec
    [junit] Running org.apache.poi.xssf.eventusermodel.TestXSSFBReader
    [junit] Tests run: 4, Failures: 0, Errors: 0, Skipped: 0, Time elapsed: 0.043 sec
    [junit] Running org.apache.poi.xssf.eventusermodel.TestXSSFReader
    [junit] Tests run: 14, Failures: 0, Errors: 0, Skipped: 1, Time elapsed: 0.124 sec
    [junit] Running org.apache.poi.xssf.extractor.TestXSSFBEventBasedExcelExtractor
    [junit] Tests run: 4, Failures: 0, Errors: 0, Skipped: 0, Time elapsed: 0.078 sec
    [junit] Running org.apache.poi.xssf.extractor.TestXSSFEventBasedExcelExtractor
    [junit] Tests run: 12, Failures: 0, Errors: 0, Skipped: 0, Time elapsed: 0.284 sec
    [junit] Running org.apache.poi.xssf.extractor.TestXSSFEventBasedExcelExtractorUsingFactory
    [junit] Tests run: 12, Failures: 0, Errors: 0, Skipped: 0, Time elapsed: 0.228 sec
    [junit] Running org.apache.poi.xssf.extractor.TestXSSFExcelExtractor
    [junit] Tests run: 8, Failures: 0, Errors: 0, Skipped: 0, Time elapsed: 0.326 sec
    [junit] Running org.apache.poi.xssf.extractor.TestXSSFExcelExtractorUsingFactory
    [junit] Tests run: 8, Failures: 0, Errors: 0, Skipped: 0, Time elapsed: 0.232 sec
    [junit] Running org.apache.poi.xssf.extractor.TestXSSFExportToXML
    [junit] Tests run: 18, Failures: 0, Errors: 0, Skipped: 1, Time elapsed: 0.343 sec
    [junit] Running org.apache.poi.xssf.extractor.TestXSSFImportFromXML
    [junit] Tests run: 5, Failures: 0, Errors: 0, Skipped: 0, Time elapsed: 4.781 sec
    [junit] Running org.apache.poi.xssf.io.TestLoadSaveXSSF
    [junit] Tests run: 3, Failures: 0, Errors: 0, Skipped: 0, Time elapsed: 0.05 sec
    [junit] Running org.apache.poi.xssf.model.TestCalculationChain
    [junit] Tests run: 1, Failures: 0, Errors: 0, Skipped: 0, Time elapsed: 0.244 sec
    [junit] Running org.apache.poi.xssf.model.TestCommentsTable
    [junit] Tests run: 7, Failures: 0, Errors: 0, Skipped: 0, Time elapsed: 0.105 sec
    [junit] Running org.apache.poi.xssf.model.TestExternalLinksTable
    [junit] Tests run: 4, Failures: 0, Errors: 0, Skipped: 0, Time elapsed: 0.049 sec
    [junit] Running org.apache.poi.xssf.model.TestMapInfo
    [junit] Tests run: 1, Failures: 0, Errors: 0, Skipped: 0, Time elapsed: 0.009 sec
    [junit] Running org.apache.poi.xssf.model.TestSharedStringsTable
    [junit] Tests run: 4, Failures: 0, Errors: 0, Skipped: 0, Time elapsed: 0.067 sec
    [junit] Running org.apache.poi.xssf.model.TestStylesTable
    [junit] Tests run: 13, Failures: 0, Errors: 0, Skipped: 0, Time elapsed: 0.2 sec
    [junit] Running org.apache.poi.xssf.model.TestThemesTable
    [junit] Tests run: 3, Failures: 0, Errors: 0, Skipped: 0, Time elapsed: 0.075 sec
    [junit] Running org.apache.poi.xssf.streaming.TestAutoSizeColumnTracker
    [junit] Tests run: 8, Failures: 0, Errors: 0, Skipped: 0, Time elapsed: 0.031 sec
    [junit] Running org.apache.poi.xssf.streaming.TestDeferredSXSSFWorkbook
    [junit] Tests run: 31, Failures: 0, Errors: 0, Skipped: 3, Time elapsed: 0.535 sec
    [junit] Running org.apache.poi.xssf.streaming.TestOutlining
    [junit] Tests run: 6, Failures: 0, Errors: 0, Skipped: 0, Time elapsed: 0.019 sec
    [junit] Running org.apache.poi.xssf.streaming.TestSXSSFCell
    [junit] Tests run: 60, Failures: 0, Errors: 0, Skipped: 4, Time elapsed: 1.511 sec
    [junit] Running org.apache.poi.xssf.streaming.TestSXSSFDataValidation
    [junit] Tests run: 2, Failures: 0, Errors: 0, Skipped: 0, Time elapsed: 0.102 sec
    [junit] Running org.apache.poi.xssf.streaming.TestSXSSFEvaluationSheet
    [junit] Tests run: 1, Failures: 0, Errors: 0, Skipped: 0, Time elapsed: 0.006 sec
    [junit] Running org.apache.poi.xssf.streaming.TestSXSSFFormulaEvaluation
    [junit] Tests run: 29, Failures: 0, Errors: 0, Skipped: 1, Time elapsed: 0.733 sec
    [junit] Running org.apache.poi.xssf.streaming.TestSXSSFHyperlink
    [junit] Tests run: 2, Failures: 0, Errors: 0, Skipped: 0, Time elapsed: 0.017 sec
    [junit] Running org.apache.poi.xssf.streaming.TestSXSSFRow
    [junit] Tests run: 14, Failures: 0, Errors: 0, Skipped: 2, Time elapsed: 0.165 sec
    [junit] Running org.apache.poi.xssf.streaming.TestSXSSFSheet
    [junit] Tests run: 50, Failures: 0, Errors: 0, Skipped: 0, Time elapsed: 0.578 sec
    [junit] Running org.apache.poi.xssf.streaming.TestSXSSFSheetAutoSizeColumn
    [junit] Tests run: 26, Failures: 0, Errors: 0, Skipped: 0, Time elapsed: 0.085 sec
    [junit] Running org.apache.poi.xssf.streaming.TestSXSSFUnicodeSurrogates
    [junit] Tests run: 1, Failures: 0, Errors: 0, Skipped: 0, Time elapsed: 0.011 sec
    [junit] Running org.apache.poi.xssf.streaming.TestSXSSFWorkbook
    [junit] Tests run: 37, Failures: 0, Errors: 0, Skipped: 4, Time elapsed: 0.58 sec
    [junit] Running org.apache.poi.xssf.streaming.TestSXSSFWorkbookWithCustomZipEntrySource
    [junit] Tests run: 3, Failures: 0, Errors: 0, Skipped: 0, Time elapsed: 0.042 sec
    [junit] Running org.apache.poi.xssf.streaming.TestSheetDataWriter
    [junit] Tests run: 3, Failures: 0, Errors: 0, Skipped: 0, Time elapsed: 0.001 sec
    [junit] Running org.apache.poi.xssf.usermodel.TestFormulaEvaluatorOnXSSF
    [junit] Tests run: 369, Failures: 0, Errors: 0, Skipped: 90, Time elapsed: 0.336 sec
    [junit] Running org.apache.poi.xssf.usermodel.TestMatrixFormulasFromXMLSpreadsheet
    [junit] Tests run: 34, Failures: 0, Errors: 0, Skipped: 0, Time elapsed: 0.105 sec
    [junit] Running org.apache.poi.xssf.usermodel.TestMissingWorkbookOnXSSF
    [junit] Tests run: 3, Failures: 0, Errors: 0, Skipped: 0, Time elapsed: 0.026 sec
    [junit] Running org.apache.poi.xssf.usermodel.TestMultiSheetFormulaEvaluatorOnXSSF
    [junit] Tests run: 2, Failures: 0, Errors: 0, Skipped: 0, Time elapsed: 0.003 sec
    [junit] Running org.apache.poi.xssf.usermodel.TestSXSSFBugs
    [junit] Tests run: 43, Failures: 0, Errors: 0, Skipped: 9, Time elapsed: 4.316 sec
    [junit] Running org.apache.poi.xssf.usermodel.TestSheetHiding
    [junit] Tests run: 5, Failures: 0, Errors: 0, Skipped: 0, Time elapsed: 0.075 sec
    [junit] Running org.apache.poi.xssf.usermodel.TestTableStyles
    [junit] Tests run: 2, Failures: 0, Errors: 0, Skipped: 0, Time elapsed: 0.327 sec
    [junit] Running org.apache.poi.xssf.usermodel.TestXSSFBugs
    [junit] Tests run: 157, Failures: 0, Errors: 1, Skipped: 8, Time elapsed: 12.606 sec

BUILD FAILED
<https://ci-builds.apache.org/job/POI/job/POI-DSL-1.8/ws/build.xml>:1570: The following error occurred while executing this line:
<https://ci-builds.apache.org/job/POI/job/POI-DSL-1.8/ws/build.xml>:1538: The following error occurred while executing this line:
<https://ci-builds.apache.org/job/POI/job/POI-DSL-1.8/ws/build.xml>:1166: Tests failed

Total time: 9 minutes 12 seconds
Build step 'Invoke Ant' marked build as failure
[SpotBugs] Skipping execution of recorder since overall result is 'FAILURE'
Archiving artifacts
[Fast Archiver] Compressed 3.09 MB of artifacts by 99.2% relative to #35
Skipping publisher since build result is FAILURE
Recording test results

---------------------------------------------------------------------
To unsubscribe, e-mail: [hidden email]
For additional commands, e-mail: [hidden email]

Reply | Threaded
Open this post in threaded view
|

Build failed in Jenkins: POI » POI-DSL-1.8 #38

Apache Jenkins Server
See <https://ci-builds.apache.org/job/POI/job/POI-DSL-1.8/38/display/redirect?page=changes>

Changes:

[PJ Fanning] use xmlbeans official 4.0.0 release


------------------------------------------
[...truncated 128.22 KB...]
    [junit] Running org.apache.poi.poifs.crypt.dsig.TestSignatureInfo
    [junit] Tests run: 15, Failures: 0, Errors: 0, Skipped: 1, Time elapsed: 11.203 sec
    [junit] Running org.apache.poi.poifs.crypt.tests.TestAgileEncryptionParameters
    [junit] Tests run: 60, Failures: 0, Errors: 0, Skipped: 0, Time elapsed: 18.517 sec
    [junit] Running org.apache.poi.poifs.crypt.tests.TestDecryptor
    [junit] Tests run: 7, Failures: 0, Errors: 0, Skipped: 0, Time elapsed: 0.623 sec
    [junit] Running org.apache.poi.poifs.crypt.tests.TestEncryptionInfo
    [junit] Tests run: 2, Failures: 0, Errors: 0, Skipped: 0, Time elapsed: 0.005 sec
    [junit] Running org.apache.poi.poifs.crypt.tests.TestEncryptor
    [junit] Tests run: 8, Failures: 0, Errors: 0, Skipped: 1, Time elapsed: 22.919 sec
    [junit] Running org.apache.poi.poifs.crypt.tests.TestHxxFEncryption
    [junit] Tests run: 20, Failures: 0, Errors: 0, Skipped: 0, Time elapsed: 1.207 sec
    [junit] Running org.apache.poi.poifs.crypt.tests.TestSecureTempZip
    [junit] Tests run: 2, Failures: 0, Errors: 0, Skipped: 0, Time elapsed: 0.394 sec
    [junit] Running org.apache.poi.sl.tests.TestFonts
    [junit] Tests run: 2, Failures: 0, Errors: 0, Skipped: 0, Time elapsed: 0.469 sec
    [junit] Running org.apache.poi.sl.tests.TestHeadersFooters
    [junit] Tests run: 1, Failures: 0, Errors: 0, Skipped: 0, Time elapsed: 0.05 sec
    [junit] Running org.apache.poi.sl.tests.TestOleShape
    [junit] Tests run: 6, Failures: 0, Errors: 0, Skipped: 0, Time elapsed: 0.432 sec
    [junit] Running org.apache.poi.sl.tests.TestSlide
    [junit] Tests run: 2, Failures: 0, Errors: 0, Skipped: 0, Time elapsed: 0.093 sec
    [junit] Running org.apache.poi.sl.tests.TestTable
    [junit] Tests run: 4, Failures: 0, Errors: 0, Skipped: 0, Time elapsed: 0.257 sec
    [junit] Running org.apache.poi.sl.tests.draw.TestDrawPictureShape
    [junit] Tests run: 2, Failures: 0, Errors: 0, Skipped: 0, Time elapsed: 0.095 sec
    [junit] Running org.apache.poi.ss.tests.TestWorkbookFactory
    [junit] Tests run: 12, Failures: 0, Errors: 0, Skipped: 0, Time elapsed: 1.289 sec
    [junit] Running org.apache.poi.ss.tests.extractor.TestEmbeddedExtractor
    [junit] Tests run: 3, Failures: 0, Errors: 0, Skipped: 0, Time elapsed: 0.378 sec
    [junit] Running org.apache.poi.ss.tests.format.TestCellFormatPart
    [junit] Tests run: 7, Failures: 0, Errors: 0, Skipped: 0, Time elapsed: 0.912 sec
    [junit] Running org.apache.poi.ss.tests.formula.TestFormulaParser
    [junit] Tests run: 9, Failures: 0, Errors: 0, Skipped: 0, Time elapsed: 0.17 sec
    [junit] Running org.apache.poi.ss.tests.formula.TestStructuredReferences
    [junit] Tests run: 2, Failures: 0, Errors: 0, Skipped: 0, Time elapsed: 0.383 sec
    [junit] Running org.apache.poi.ss.tests.formula.eval.TestXSSFCircularReferences
    [junit] Tests run: 4, Failures: 0, Errors: 0, Skipped: 0, Time elapsed: 0.044 sec
    [junit] Running org.apache.poi.ss.tests.formula.functions.TestProper
    [junit] Tests run: 4, Failures: 0, Errors: 0, Skipped: 0, Time elapsed: 2.412 sec
    [junit] Running org.apache.poi.ss.tests.formula.functions.TestSumifsXSSF
    [junit] Tests run: 1, Failures: 0, Errors: 0, Skipped: 0, Time elapsed: 0.109 sec
    [junit] Running org.apache.poi.ss.tests.formula.functions.TestVlookup
    [junit] Tests run: 6, Failures: 0, Errors: 0, Skipped: 0, Time elapsed: 59.107 sec
    [junit] Running org.apache.poi.ss.tests.usermodel.TestEmbedOLEPackage
    [junit] Tests run: 3, Failures: 0, Errors: 0, Skipped: 0, Time elapsed: 0.237 sec
    [junit] Running org.apache.poi.ss.tests.usermodel.TestXSSFBorderStyle
    [junit] Tests run: 1, Failures: 0, Errors: 0, Skipped: 0, Time elapsed: 0.02 sec
    [junit] Running org.apache.poi.ss.tests.usermodel.TestXSSFRangeCopier
    [junit] Tests run: 9, Failures: 0, Errors: 0, Skipped: 0, Time elapsed: 0.192 sec
    [junit] Running org.apache.poi.ss.tests.util.TestSXSSFCellUtil
    [junit] Tests run: 14, Failures: 0, Errors: 0, Skipped: 0, Time elapsed: 0.175 sec
    [junit] Running org.apache.poi.ss.tests.util.TestXSSFCellUtil
    [junit] Tests run: 14, Failures: 0, Errors: 0, Skipped: 0, Time elapsed: 0.121 sec
    [junit] Running org.apache.poi.ss.tests.util.TestXSSFPropertyTemplate
    [junit] Tests run: 2, Failures: 0, Errors: 0, Skipped: 0, Time elapsed: 0.05 sec
    [junit] Running org.apache.poi.util.tests.TestIdentifierManager
    [junit] Tests run: 5, Failures: 0, Errors: 0, Skipped: 0, Time elapsed: 0.005 sec
    [junit] Running org.apache.poi.util.tests.TestTempFileThreaded
    [junit] Tests run: 1, Failures: 0, Errors: 0, Skipped: 0, Time elapsed: 6.064 sec
    [junit] Running org.apache.poi.xddf.usermodel.TestNecessaryOOXMLClasses
    [junit] Tests run: 1, Failures: 0, Errors: 0, Skipped: 0, Time elapsed: 0.23 sec
    [junit] Running org.apache.poi.xddf.usermodel.TestXDDFColor
    [junit] Tests run: 5, Failures: 0, Errors: 0, Skipped: 0, Time elapsed: 0.1 sec
    [junit] Running org.apache.poi.xddf.usermodel.chart.TestXDDFChart
    [junit] Tests run: 2, Failures: 0, Errors: 0, Skipped: 0, Time elapsed: 0.022 sec
    [junit] Running org.apache.poi.xddf.usermodel.chart.TestXDDFChartExtensionList
    [junit] Tests run: 1, Failures: 0, Errors: 0, Skipped: 0, Time elapsed: 0.006 sec
    [junit] Running org.apache.poi.xddf.usermodel.chart.TestXDDFChartRemoveSeries
    [junit] Tests run: 4, Failures: 0, Errors: 0, Skipped: 0, Time elapsed: 0.164 sec
    [junit] Running org.apache.poi.xddf.usermodel.chart.TestXDDFDataSourcesFactory
    [junit] Tests run: 6, Failures: 0, Errors: 0, Skipped: 0, Time elapsed: 0.023 sec
    [junit] Running org.apache.poi.xddf.usermodel.text.TestXDDFTextBodyProperties
    [junit] Tests run: 1, Failures: 0, Errors: 0, Skipped: 0, Time elapsed: 0.014 sec
    [junit] Running org.apache.poi.xddf.usermodel.text.TestXDDFTextRun
    [junit] Tests run: 3, Failures: 0, Errors: 0, Skipped: 0, Time elapsed: 0.167 sec
    [junit] Running org.apache.poi.xdgf.extractor.TestXDGFVisioExtractor
    [junit] Tests run: 3, Failures: 0, Errors: 0, Skipped: 0, Time elapsed: 0.475 sec
    [junit] Running org.apache.poi.xslf.TestNecessaryOOXMLClasses
    [junit] Tests run: 1, Failures: 0, Errors: 0, Skipped: 0, Time elapsed: 0.009 sec
    [junit] Running org.apache.poi.xslf.TestXSLFBugs
    [junit] Tests run: 31, Failures: 0, Errors: 0, Skipped: 2, Time elapsed: 3.524 sec
    [junit] Running org.apache.poi.xslf.TestXSLFSlideShow
    [junit] Tests run: 5, Failures: 0, Errors: 0, Skipped: 0, Time elapsed: 0.157 sec
    [junit] Running org.apache.poi.xslf.extractor.TestXSLFPowerPointExtractor
    [junit] Tests run: 8, Failures: 0, Errors: 0, Skipped: 0, Time elapsed: 0.934 sec
    [junit] Running org.apache.poi.xslf.usermodel.TestPPTX2PNG
    [junit] Tests run: 20, Failures: 0, Errors: 0, Skipped: 0, Time elapsed: 38.621 sec
    [junit] Running org.apache.poi.xslf.usermodel.TestXMLSlideShow
    [junit] Tests run: 12, Failures: 0, Errors: 0, Skipped: 0, Time elapsed: 0.637 sec
    [junit] Running org.apache.poi.xslf.usermodel.TestXSLFAutoShape
    [junit] Tests run: 4, Failures: 0, Errors: 0, Skipped: 0, Time elapsed: 0.126 sec
    [junit] Running org.apache.poi.xslf.usermodel.TestXSLFBackground
    [junit] Tests run: 4, Failures: 0, Errors: 0, Skipped: 0, Time elapsed: 0.267 sec
    [junit] Running org.apache.poi.xslf.usermodel.TestXSLFChart
    [junit] Tests run: 5, Failures: 0, Errors: 0, Skipped: 0, Time elapsed: 0.373 sec
    [junit] Running org.apache.poi.xslf.usermodel.TestXSLFColor
    [junit] Tests run: 6, Failures: 0, Errors: 0, Skipped: 0, Time elapsed: 0.061 sec
    [junit] Running org.apache.poi.xslf.usermodel.TestXSLFConnectorShape
    [junit] Tests run: 2, Failures: 0, Errors: 0, Skipped: 0, Time elapsed: 0.078 sec
    [junit] Running org.apache.poi.xslf.usermodel.TestXSLFFreeformShape
    [junit] Tests run: 2, Failures: 0, Errors: 0, Skipped: 0, Time elapsed: 0.096 sec
    [junit] Running org.apache.poi.xslf.usermodel.TestXSLFGroupShape
    [junit] Tests run: 2, Failures: 0, Errors: 0, Skipped: 0, Time elapsed: 0.091 sec
    [junit] Running org.apache.poi.xslf.usermodel.TestXSLFHyperlink
    [junit] Tests run: 3, Failures: 0, Errors: 0, Skipped: 0, Time elapsed: 0.154 sec
    [junit] Running org.apache.poi.xslf.usermodel.TestXSLFNotes
    [junit] Tests run: 3, Failures: 0, Errors: 0, Skipped: 0, Time elapsed: 0.115 sec
    [junit] Running org.apache.poi.xslf.usermodel.TestXSLFPictureShape
    [junit] Tests run: 7, Failures: 0, Errors: 0, Skipped: 0, Time elapsed: 2.038 sec
    [junit] Running org.apache.poi.xslf.usermodel.TestXSLFShape
    [junit] Tests run: 3, Failures: 0, Errors: 0, Skipped: 0, Time elapsed: 0.131 sec
    [junit] Running org.apache.poi.xslf.usermodel.TestXSLFShapeContainer
    [junit] Tests run: 1, Failures: 0, Errors: 0, Skipped: 0, Time elapsed: 0.032 sec
    [junit] Running org.apache.poi.xslf.usermodel.TestXSLFSheet
    [junit] Tests run: 1, Failures: 0, Errors: 0, Skipped: 0, Time elapsed: 0.074 sec
    [junit] Running org.apache.poi.xslf.usermodel.TestXSLFSimpleShape
    [junit] Tests run: 7, Failures: 0, Errors: 0, Skipped: 0, Time elapsed: 3.04 sec
    [junit] Running org.apache.poi.xslf.usermodel.TestXSLFSlide
    [junit] Tests run: 5, Failures: 0, Errors: 0, Skipped: 0, Time elapsed: 0.864 sec
    [junit] Running org.apache.poi.xslf.usermodel.TestXSLFSlideShow
    [junit] Tests run: 6, Failures: 0, Errors: 0, Skipped: 0, Time elapsed: 0.255 sec
    [junit] Running org.apache.poi.xslf.usermodel.TestXSLFSlideShowFactory
    [junit] Tests run: 6, Failures: 0, Errors: 0, Skipped: 0, Time elapsed: 0.732 sec
    [junit] Running org.apache.poi.xslf.usermodel.TestXSLFTable
    [junit] Tests run: 6, Failures: 0, Errors: 0, Skipped: 0, Time elapsed: 3.008 sec
    [junit] Running org.apache.poi.xslf.usermodel.TestXSLFTableRow
    [junit] Tests run: 8, Failures: 0, Errors: 0, Skipped: 0, Time elapsed: 0.279 sec
    [junit] Running org.apache.poi.xslf.usermodel.TestXSLFTableStyles
    [junit] Tests run: 1, Failures: 0, Errors: 0, Skipped: 0, Time elapsed: 0.026 sec
    [junit] Running org.apache.poi.xslf.usermodel.TestXSLFTextBox
    [junit] Tests run: 2, Failures: 0, Errors: 0, Skipped: 0, Time elapsed: 0.045 sec
    [junit] Running org.apache.poi.xslf.usermodel.TestXSLFTextParagraph
    [junit] Tests run: 5, Failures: 0, Errors: 0, Skipped: 1, Time elapsed: 0.108 sec
    [junit] Running org.apache.poi.xslf.usermodel.TestXSLFTextRun
    [junit] Tests run: 4, Failures: 0, Errors: 0, Skipped: 0, Time elapsed: 0.135 sec
    [junit] Running org.apache.poi.xslf.usermodel.TestXSLFTextShape
    [junit] Tests run: 4, Failures: 0, Errors: 0, Skipped: 0, Time elapsed: 0.125 sec
    [junit] Running org.apache.poi.xslf.usermodel.TestXSLFTheme
    [junit] Tests run: 1, Failures: 0, Errors: 0, Skipped: 0, Time elapsed: 0.192 sec
    [junit] Running org.apache.poi.xssf.TestNecessaryOOXMLClasses
    [junit] Tests run: 1, Failures: 0, Errors: 0, Skipped: 0, Time elapsed: 0.007 sec
    [junit] Running org.apache.poi.xssf.TestSheetProtection
    [junit] Tests run: 17, Failures: 0, Errors: 0, Skipped: 0, Time elapsed: 0.193 sec
    [junit] Running org.apache.poi.xssf.TestWorkbookProtection
    [junit] Tests run: 8, Failures: 0, Errors: 0, Skipped: 0, Time elapsed: 0.753 sec
    [junit] Running org.apache.poi.xssf.TestXSSFCloneSheet
    [junit] Tests run: 8, Failures: 0, Errors: 0, Skipped: 0, Time elapsed: 0.37 sec
    [junit] Running org.apache.poi.xssf.TestXSSFOffset
    [junit] Tests run: 1, Failures: 0, Errors: 0, Skipped: 0, Time elapsed: 0.014 sec
    [junit] Running org.apache.poi.xssf.binary.TestXSSFBSharedStringsTable
    [junit] Tests run: 1, Failures: 0, Errors: 0, Skipped: 0, Time elapsed: 0.015 sec
    [junit] Running org.apache.poi.xssf.binary.TestXSSFBSheetHyperlinkManager
    [junit] Tests run: 1, Failures: 0, Errors: 0, Skipped: 0, Time elapsed: 0.018 sec
    [junit] Running org.apache.poi.xssf.eventusermodel.TestReadOnlySharedStringsTable
    [junit] Tests run: 4, Failures: 0, Errors: 0, Skipped: 0, Time elapsed: 0.032 sec
    [junit] Running org.apache.poi.xssf.eventusermodel.TestXSSFBReader
    [junit] Tests run: 4, Failures: 0, Errors: 0, Skipped: 0, Time elapsed: 0.036 sec
    [junit] Running org.apache.poi.xssf.eventusermodel.TestXSSFReader
    [junit] Tests run: 14, Failures: 0, Errors: 0, Skipped: 1, Time elapsed: 0.121 sec
    [junit] Running org.apache.poi.xssf.extractor.TestXSSFBEventBasedExcelExtractor
    [junit] Tests run: 4, Failures: 0, Errors: 0, Skipped: 0, Time elapsed: 0.141 sec
    [junit] Running org.apache.poi.xssf.extractor.TestXSSFEventBasedExcelExtractor
    [junit] Tests run: 12, Failures: 0, Errors: 0, Skipped: 0, Time elapsed: 0.53 sec
    [junit] Running org.apache.poi.xssf.extractor.TestXSSFEventBasedExcelExtractorUsingFactory
    [junit] Tests run: 12, Failures: 0, Errors: 0, Skipped: 0, Time elapsed: 0.465 sec
    [junit] Running org.apache.poi.xssf.extractor.TestXSSFExcelExtractor
    [junit] Tests run: 8, Failures: 0, Errors: 0, Skipped: 0, Time elapsed: 0.618 sec
    [junit] Running org.apache.poi.xssf.extractor.TestXSSFExcelExtractorUsingFactory
    [junit] Tests run: 8, Failures: 0, Errors: 0, Skipped: 0, Time elapsed: 0.524 sec
    [junit] Running org.apache.poi.xssf.extractor.TestXSSFExportToXML
    [junit] Tests run: 18, Failures: 0, Errors: 0, Skipped: 1, Time elapsed: 0.624 sec
    [junit] Running org.apache.poi.xssf.extractor.TestXSSFImportFromXML
    [junit] Tests run: 5, Failures: 0, Errors: 0, Skipped: 0, Time elapsed: 7.525 sec
    [junit] Running org.apache.poi.xssf.io.TestLoadSaveXSSF
    [junit] Tests run: 3, Failures: 0, Errors: 0, Skipped: 0, Time elapsed: 0.062 sec
    [junit] Running org.apache.poi.xssf.model.TestCalculationChain
    [junit] Tests run: 1, Failures: 0, Errors: 0, Skipped: 0, Time elapsed: 0.328 sec
    [junit] Running org.apache.poi.xssf.model.TestCommentsTable
    [junit] Tests run: 7, Failures: 0, Errors: 0, Skipped: 0, Time elapsed: 0.142 sec
    [junit] Running org.apache.poi.xssf.model.TestExternalLinksTable
    [junit] Tests run: 4, Failures: 0, Errors: 0, Skipped: 0, Time elapsed: 0.09 sec
    [junit] Running org.apache.poi.xssf.model.TestMapInfo
    [junit] Tests run: 1, Failures: 0, Errors: 0, Skipped: 0, Time elapsed: 0.014 sec
    [junit] Running org.apache.poi.xssf.model.TestSharedStringsTable
    [junit] Tests run: 4, Failures: 0, Errors: 0, Skipped: 0, Time elapsed: 0.123 sec
    [junit] Running org.apache.poi.xssf.model.TestStylesTable
    [junit] Tests run: 13, Failures: 0, Errors: 0, Skipped: 0, Time elapsed: 0.257 sec
    [junit] Running org.apache.poi.xssf.model.TestThemesTable
    [junit] Tests run: 3, Failures: 0, Errors: 0, Skipped: 0, Time elapsed: 0.12 sec
    [junit] Running org.apache.poi.xssf.streaming.TestAutoSizeColumnTracker
    [junit] Tests run: 8, Failures: 0, Errors: 0, Skipped: 0, Time elapsed: 0.05 sec
    [junit] Running org.apache.poi.xssf.streaming.TestDeferredSXSSFWorkbook
    [junit] Tests run: 31, Failures: 0, Errors: 0, Skipped: 3, Time elapsed: 1.058 sec
    [junit] Running org.apache.poi.xssf.streaming.TestOutlining
    [junit] Tests run: 6, Failures: 0, Errors: 0, Skipped: 0, Time elapsed: 0.112 sec
    [junit] Running org.apache.poi.xssf.streaming.TestSXSSFCell
    [junit] Tests run: 60, Failures: 0, Errors: 0, Skipped: 4, Time elapsed: 2.264 sec
    [junit] Running org.apache.poi.xssf.streaming.TestSXSSFDataValidation
    [junit] Tests run: 2, Failures: 0, Errors: 0, Skipped: 0, Time elapsed: 0.169 sec
    [junit] Running org.apache.poi.xssf.streaming.TestSXSSFEvaluationSheet
    [junit] Tests run: 1, Failures: 0, Errors: 0, Skipped: 0, Time elapsed: 0.006 sec
    [junit] Running org.apache.poi.xssf.streaming.TestSXSSFFormulaEvaluation
    [junit] Tests run: 29, Failures: 0, Errors: 0, Skipped: 1, Time elapsed: 1.429 sec
    [junit] Running org.apache.poi.xssf.streaming.TestSXSSFHyperlink
    [junit] Tests run: 2, Failures: 0, Errors: 0, Skipped: 0, Time elapsed: 0.023 sec
    [junit] Running org.apache.poi.xssf.streaming.TestSXSSFRow
    [junit] Tests run: 14, Failures: 0, Errors: 0, Skipped: 2, Time elapsed: 0.245 sec
    [junit] Running org.apache.poi.xssf.streaming.TestSXSSFSheet
    [junit] Tests run: 50, Failures: 0, Errors: 0, Skipped: 0, Time elapsed: 0.904 sec
    [junit] Running org.apache.poi.xssf.streaming.TestSXSSFSheetAutoSizeColumn
    [junit] Tests run: 26, Failures: 0, Errors: 0, Skipped: 0, Time elapsed: 0.132 sec
    [junit] Running org.apache.poi.xssf.streaming.TestSXSSFUnicodeSurrogates
    [junit] Tests run: 1, Failures: 0, Errors: 0, Skipped: 0, Time elapsed: 0.024 sec
    [junit] Running org.apache.poi.xssf.streaming.TestSXSSFWorkbook
    [junit] Tests run: 37, Failures: 0, Errors: 0, Skipped: 4, Time elapsed: 1.05 sec
    [junit] Running org.apache.poi.xssf.streaming.TestSXSSFWorkbookWithCustomZipEntrySource
    [junit] Tests run: 3, Failures: 0, Errors: 0, Skipped: 0, Time elapsed: 0.082 sec
    [junit] Running org.apache.poi.xssf.streaming.TestSheetDataWriter
    [junit] Tests run: 3, Failures: 0, Errors: 0, Skipped: 0, Time elapsed: 0.004 sec
    [junit] Running org.apache.poi.xssf.usermodel.TestFormulaEvaluatorOnXSSF
    [junit] Tests run: 369, Failures: 0, Errors: 0, Skipped: 90, Time elapsed: 0.556 sec
    [junit] Running org.apache.poi.xssf.usermodel.TestMatrixFormulasFromXMLSpreadsheet
    [junit] Tests run: 34, Failures: 0, Errors: 0, Skipped: 0, Time elapsed: 0.212 sec
    [junit] Running org.apache.poi.xssf.usermodel.TestMissingWorkbookOnXSSF
    [junit] Tests run: 3, Failures: 0, Errors: 0, Skipped: 0, Time elapsed: 0.045 sec
    [junit] Running org.apache.poi.xssf.usermodel.TestMultiSheetFormulaEvaluatorOnXSSF
    [junit] Tests run: 2, Failures: 0, Errors: 0, Skipped: 0, Time elapsed: 0.005 sec
    [junit] Running org.apache.poi.xssf.usermodel.TestSXSSFBugs
    [junit] Tests run: 43, Failures: 0, Errors: 0, Skipped: 9, Time elapsed: 8.087 sec
    [junit] Running org.apache.poi.xssf.usermodel.TestSheetHiding
    [junit] Tests run: 5, Failures: 0, Errors: 0, Skipped: 0, Time elapsed: 0.119 sec
    [junit] Running org.apache.poi.xssf.usermodel.TestTableStyles
    [junit] Tests run: 2, Failures: 0, Errors: 0, Skipped: 0, Time elapsed: 0.625 sec
    [junit] Running org.apache.poi.xssf.usermodel.TestXSSFBugs
    [junit] Tests run: 157, Failures: 0, Errors: 1, Skipped: 8, Time elapsed: 22.432 sec

BUILD FAILED
<https://ci-builds.apache.org/job/POI/job/POI-DSL-1.8/ws/build.xml>:1569: The following error occurred while executing this line:
<https://ci-builds.apache.org/job/POI/job/POI-DSL-1.8/ws/build.xml>:1537: The following error occurred while executing this line:
<https://ci-builds.apache.org/job/POI/job/POI-DSL-1.8/ws/build.xml>:1165: Tests failed

Total time: 14 minutes 42 seconds
Build step 'Invoke Ant' marked build as failure
[SpotBugs] Skipping execution of recorder since overall result is 'FAILURE'
Archiving artifacts
[Fast Archiver] Compressed 3.09 MB of artifacts by 22.3% relative to #35
Skipping publisher since build result is FAILURE
Recording test results

---------------------------------------------------------------------
To unsubscribe, e-mail: [hidden email]
For additional commands, e-mail: [hidden email]

Reply | Threaded
Open this post in threaded view
|

Jenkins build is back to normal : POI » POI-DSL-1.8 #39

Apache Jenkins Server
See <https://ci-builds.apache.org/job/POI/job/POI-DSL-1.8/39/display/redirect?page=changes>


---------------------------------------------------------------------
To unsubscribe, e-mail: [hidden email]
For additional commands, e-mail: [hidden email]