Build failed in Jenkins: POI » POI-DSL-1.8 #193

classic Classic list List threaded Threaded
4 messages Options
Reply | Threaded
Open this post in threaded view
|

Build failed in Jenkins: POI » POI-DSL-1.8 #193

Apache Jenkins Server
See <https://ci-builds.apache.org/job/POI/job/POI-DSL-1.8/193/display/redirect>

Changes:


------------------------------------------
[...truncated 21.75 KB...]
U         src/ooxml/java/org/apache/poi/openxml4j/opc/ZipPackage.java
U         src/ooxml/java/org/apache/poi/openxml4j/opc/internal/ZipContentTypeManager.java
U         src/ooxml/java/org/apache/poi/openxml4j/opc/internal/marshallers/DefaultMarshaller.java
U         src/ooxml/java/org/apache/poi/openxml4j/opc/internal/marshallers/ZipPartMarshaller.java
U         src/ooxml/java/org/apache/poi/poifs/crypt/dsig/KeyInfoKeySelector.java
U         src/ooxml/java/org/apache/poi/poifs/crypt/dsig/OOXMLURIDereferencer.java
U         src/ooxml/java/org/apache/poi/poifs/crypt/dsig/SignatureConfig.java
U         src/ooxml/java/org/apache/poi/poifs/crypt/dsig/SignatureInfo.java
U         src/ooxml/java/org/apache/poi/poifs/crypt/dsig/SignaturePart.java
U         src/ooxml/java/org/apache/poi/poifs/crypt/dsig/facets/KeyInfoSignatureFacet.java
U         src/ooxml/java/org/apache/poi/poifs/crypt/dsig/facets/OOXMLSignatureFacet.java
U         src/ooxml/java/org/apache/poi/poifs/crypt/dsig/facets/XAdESSignatureFacet.java
U         src/ooxml/java/org/apache/poi/poifs/crypt/dsig/facets/XAdESXLSignatureFacet.java
U         src/ooxml/java/org/apache/poi/poifs/crypt/dsig/services/RelationshipTransformService.java
U         src/ooxml/java/org/apache/poi/poifs/crypt/dsig/services/TSPTimeStampService.java
U         src/ooxml/java/org/apache/poi/poifs/crypt/temp/AesZipFileZipEntrySource.java
U         src/ooxml/java/org/apache/poi/poifs/crypt/temp/EncryptedTempData.java
U         src/ooxml/java/org/apache/poi/poifs/crypt/temp/SXSSFWorkbookWithCustomZipEntrySource.java
U         src/ooxml/java/org/apache/poi/xssf/binary/XSSFBRelation.java
U         src/ooxml/java/org/apache/poi/xssf/eventusermodel/XSSFBReader.java
U         src/ooxml/java/org/apache/poi/xssf/eventusermodel/XSSFReader.java
U         src/ooxml/java/org/apache/poi/xssf/eventusermodel/XSSFSheetXMLHandler.java
U         src/ooxml/java/org/apache/poi/xssf/extractor/XSSFBEventBasedExcelExtractor.java
U         src/ooxml/java/org/apache/poi/xssf/extractor/XSSFEventBasedExcelExtractor.java
U         src/ooxml/java/org/apache/poi/xssf/extractor/XSSFExportToXml.java
U         src/ooxml/java/org/apache/poi/xssf/extractor/XSSFImportFromXML.java
U         src/ooxml/java/org/apache/poi/xssf/streaming/DeferredSXSSFWorkbook.java
U         src/ooxml/java/org/apache/poi/xssf/streaming/SXSSFCreationHelper.java
U         src/ooxml/java/org/apache/poi/xssf/streaming/SXSSFFormulaEvaluator.java
U         src/ooxml/java/org/apache/poi/xssf/streaming/SXSSFPicture.java
U         src/ooxml/java/org/apache/poi/xssf/streaming/SXSSFWorkbook.java
U         src/ooxml/java/org/apache/poi/xssf/streaming/SheetDataWriter.java
U         src/ooxml/java/org/apache/poi/xssf/streaming/StreamingSheetWriter.java
U         src/ooxml/java/org/apache/poi/xssf/usermodel/XSSFDrawing.java
U         src/ooxml/java/org/apache/poi/xssf/usermodel/XSSFObjectData.java
U         src/ooxml/java/org/apache/poi/xssf/usermodel/XSSFPicture.java
U         src/ooxml/java/org/apache/poi/xssf/usermodel/XSSFSheet.java
U         src/ooxml/java/org/apache/poi/xssf/usermodel/XSSFTableStyle.java
U         src/ooxml/java/org/apache/poi/xssf/usermodel/XSSFWorkbook.java
U         src/ooxml/java/org/apache/poi/xssf/usermodel/helpers/XSSFColumnShifter.java
U         src/ooxml/java/org/apache/poi/xssf/usermodel/helpers/XSSFRowColShifter.java
U         src/ooxml/java/org/apache/poi/xssf/usermodel/helpers/XSSFRowShifter.java
U         src/ooxml/java/org/apache/poi/xwpf/usermodel/XWPFDocument.java
A         src/resources/integrationtest
A         src/resources/integrationtest/log4j2-test.xml
A         src/resources/test
A         src/resources/test/log4j2-test.xml
U         KEYS
AU        test-data/slideshow/ppt_with_png_encrypted.ppt
U         test-data/spreadsheet/stress.xls
U         .gitignore
U         legal/LICENSE
U         osgi/README.md
U         osgi/pom.xml

<-- Got one external: documentation, svn url: https://svn.apache.org/repos/asf/poi/site/src/documentation -->
Fetching 'https://svn.apache.org/repos/asf/poi/site/src/documentation' at -1 into '<https://ci-builds.apache.org/job/POI/job/POI-DSL-1.8/ws/src/documentation'>
U         src/documentation/content/xdocs/changes.xml
At revision 1887650


<-- Got one external: forrest.properties, svn url: https://svn.apache.org/repos/asf/poi/site/forrest.properties -->
Fetching 'https://svn.apache.org/repos/asf/poi/site/forrest.properties' at -1 into '<https://ci-builds.apache.org/job/POI/job/POI-DSL-1.8/ws/forrest.properties'>
At revision 1887650

At revision 1887650

org.tmatesoft.svn.core.SVNException: svn: E130003: Parser configuration problem: namespace reporting is not enabled
        at org.tmatesoft.svn.core.internal.wc.SVNErrorManager.error(SVNErrorManager.java:70)
        at org.tmatesoft.svn.core.internal.wc.SVNErrorManager.error(SVNErrorManager.java:57)
        at org.tmatesoft.svn.core.internal.io.dav.http.HTTPConnection.request(HTTPConnection.java:760)
        at org.tmatesoft.svn.core.internal.io.dav.http.HTTPConnection.request(HTTPConnection.java:352)
        at org.tmatesoft.svn.core.internal.io.dav.http.HTTPConnection.request(HTTPConnection.java:340)
        at org.tmatesoft.svn.core.internal.io.dav.DAVConnection.performHttpRequest(DAVConnection.java:910)
        at org.tmatesoft.svn.core.internal.io.dav.DAVConnection.doReport(DAVConnection.java:363)
        at org.tmatesoft.svn.core.internal.io.dav.DAVConnection.doReport(DAVConnection.java:353)
        at org.tmatesoft.svn.core.internal.io.dav.DAVRepository.logImpl(DAVRepository.java:1015)
        at org.tmatesoft.svn.core.io.SVNRepository.log(SVNRepository.java:1041)
        at org.tmatesoft.svn.core.internal.wc2.remote.SvnRemoteLog.run(SvnRemoteLog.java:181)
        at org.tmatesoft.svn.core.internal.wc2.remote.SvnRemoteLog.run(SvnRemoteLog.java:35)
        at org.tmatesoft.svn.core.internal.wc2.SvnOperationRunner.run(SvnOperationRunner.java:21)
        at org.tmatesoft.svn.core.wc2.SvnOperationFactory.run(SvnOperationFactory.java:1239)
        at org.tmatesoft.svn.core.wc2.SvnOperation.run(SvnOperation.java:294)
        at org.tmatesoft.svn.core.wc.SVNLogClient.doLog(SVNLogClient.java:968)
        at org.tmatesoft.svn.core.wc.SVNLogClient.doLog(SVNLogClient.java:873)
        at hudson.scm.SubversionChangeLogBuilder.buildModule(SubversionChangeLogBuilder.java:188)
Caused: java.io.IOException: revision check failed on https://svn.apache.org/repos/asf/poi/trunk
        at hudson.scm.SubversionChangeLogBuilder.buildModule(SubversionChangeLogBuilder.java:202)
        at hudson.scm.SubversionChangeLogBuilder.run(SubversionChangeLogBuilder.java:122)
        at hudson.scm.SubversionSCM.calcChangeLog(SubversionSCM.java:755)
        at hudson.scm.SubversionSCM.checkout(SubversionSCM.java:888)
        at hudson.scm.SCM.checkout(SCM.java:505)
        at hudson.model.AbstractProject.checkout(AbstractProject.java:1206)
        at hudson.model.AbstractBuild$AbstractBuildExecution.defaultCheckout(AbstractBuild.java:637)
        at jenkins.scm.SCMCheckoutStrategy.checkout(SCMCheckoutStrategy.java:86)
        at hudson.model.AbstractBuild$AbstractBuildExecution.run(AbstractBuild.java:509)
        at hudson.model.Run.execute(Run.java:1907)
        at hudson.model.FreeStyleBuild.run(FreeStyleBuild.java:43)
        at hudson.model.ResourceController.execute(ResourceController.java:97)
        at hudson.model.Executor.run(Executor.java:429)
Retrying after 10 seconds
Updating https://svn.apache.org/repos/asf/poi/trunk at revision '2021-03-14T20:44:03.593 +0000'

<-- Got one external: documentation, svn url: https://svn.apache.org/repos/asf/poi/site/src/documentation -->
Fetching 'https://svn.apache.org/repos/asf/poi/site/src/documentation' at -1 into '<https://ci-builds.apache.org/job/POI/job/POI-DSL-1.8/ws/src/documentation'>
At revision 1887650


<-- Got one external: forrest.properties, svn url: https://svn.apache.org/repos/asf/poi/site/forrest.properties -->
Fetching 'https://svn.apache.org/repos/asf/poi/site/forrest.properties' at -1 into '<https://ci-builds.apache.org/job/POI/job/POI-DSL-1.8/ws/forrest.properties'>
At revision 1887650

At revision 1887650

org.tmatesoft.svn.core.SVNException: svn: E130003: Parser configuration problem: namespace reporting is not enabled
        at org.tmatesoft.svn.core.internal.wc.SVNErrorManager.error(SVNErrorManager.java:70)
        at org.tmatesoft.svn.core.internal.wc.SVNErrorManager.error(SVNErrorManager.java:57)
        at org.tmatesoft.svn.core.internal.io.dav.http.HTTPConnection.request(HTTPConnection.java:760)
        at org.tmatesoft.svn.core.internal.io.dav.http.HTTPConnection.request(HTTPConnection.java:352)
        at org.tmatesoft.svn.core.internal.io.dav.http.HTTPConnection.request(HTTPConnection.java:340)
        at org.tmatesoft.svn.core.internal.io.dav.DAVConnection.performHttpRequest(DAVConnection.java:910)
        at org.tmatesoft.svn.core.internal.io.dav.DAVConnection.doReport(DAVConnection.java:363)
        at org.tmatesoft.svn.core.internal.io.dav.DAVConnection.doReport(DAVConnection.java:353)
        at org.tmatesoft.svn.core.internal.io.dav.DAVRepository.logImpl(DAVRepository.java:1015)
        at org.tmatesoft.svn.core.io.SVNRepository.log(SVNRepository.java:1041)
        at org.tmatesoft.svn.core.internal.wc2.remote.SvnRemoteLog.run(SvnRemoteLog.java:181)
        at org.tmatesoft.svn.core.internal.wc2.remote.SvnRemoteLog.run(SvnRemoteLog.java:35)
        at org.tmatesoft.svn.core.internal.wc2.SvnOperationRunner.run(SvnOperationRunner.java:21)
        at org.tmatesoft.svn.core.wc2.SvnOperationFactory.run(SvnOperationFactory.java:1239)
        at org.tmatesoft.svn.core.wc2.SvnOperation.run(SvnOperation.java:294)
        at org.tmatesoft.svn.core.wc.SVNLogClient.doLog(SVNLogClient.java:968)
        at org.tmatesoft.svn.core.wc.SVNLogClient.doLog(SVNLogClient.java:873)
        at hudson.scm.SubversionChangeLogBuilder.buildModule(SubversionChangeLogBuilder.java:188)
Caused: java.io.IOException: revision check failed on https://svn.apache.org/repos/asf/poi/trunk
        at hudson.scm.SubversionChangeLogBuilder.buildModule(SubversionChangeLogBuilder.java:202)
        at hudson.scm.SubversionChangeLogBuilder.run(SubversionChangeLogBuilder.java:122)
        at hudson.scm.SubversionSCM.calcChangeLog(SubversionSCM.java:755)
        at hudson.scm.SubversionSCM.checkout(SubversionSCM.java:888)
        at hudson.scm.SCM.checkout(SCM.java:505)
        at hudson.model.AbstractProject.checkout(AbstractProject.java:1206)
        at hudson.model.AbstractBuild$AbstractBuildExecution.defaultCheckout(AbstractBuild.java:637)
        at jenkins.scm.SCMCheckoutStrategy.checkout(SCMCheckoutStrategy.java:86)
        at hudson.model.AbstractBuild$AbstractBuildExecution.run(AbstractBuild.java:509)
        at hudson.model.Run.execute(Run.java:1907)
        at hudson.model.FreeStyleBuild.run(FreeStyleBuild.java:43)
        at hudson.model.ResourceController.execute(ResourceController.java:97)
        at hudson.model.Executor.run(Executor.java:429)
Retrying after 10 seconds
Updating https://svn.apache.org/repos/asf/poi/trunk at revision '2021-03-14T20:44:03.593 +0000'

<-- Got one external: documentation, svn url: https://svn.apache.org/repos/asf/poi/site/src/documentation -->
Fetching 'https://svn.apache.org/repos/asf/poi/site/src/documentation' at -1 into '<https://ci-builds.apache.org/job/POI/job/POI-DSL-1.8/ws/src/documentation'>
At revision 1887650


<-- Got one external: forrest.properties, svn url: https://svn.apache.org/repos/asf/poi/site/forrest.properties -->
Fetching 'https://svn.apache.org/repos/asf/poi/site/forrest.properties' at -1 into '<https://ci-builds.apache.org/job/POI/job/POI-DSL-1.8/ws/forrest.properties'>
At revision 1887650

At revision 1887650

org.tmatesoft.svn.core.SVNException: svn: E130003: Parser configuration problem: namespace reporting is not enabled
        at org.tmatesoft.svn.core.internal.wc.SVNErrorManager.error(SVNErrorManager.java:70)
        at org.tmatesoft.svn.core.internal.wc.SVNErrorManager.error(SVNErrorManager.java:57)
        at org.tmatesoft.svn.core.internal.io.dav.http.HTTPConnection.request(HTTPConnection.java:760)
        at org.tmatesoft.svn.core.internal.io.dav.http.HTTPConnection.request(HTTPConnection.java:352)
        at org.tmatesoft.svn.core.internal.io.dav.http.HTTPConnection.request(HTTPConnection.java:340)
        at org.tmatesoft.svn.core.internal.io.dav.DAVConnection.performHttpRequest(DAVConnection.java:910)
        at org.tmatesoft.svn.core.internal.io.dav.DAVConnection.doReport(DAVConnection.java:363)
        at org.tmatesoft.svn.core.internal.io.dav.DAVConnection.doReport(DAVConnection.java:353)
        at org.tmatesoft.svn.core.internal.io.dav.DAVRepository.logImpl(DAVRepository.java:1015)
        at org.tmatesoft.svn.core.io.SVNRepository.log(SVNRepository.java:1041)
        at org.tmatesoft.svn.core.internal.wc2.remote.SvnRemoteLog.run(SvnRemoteLog.java:181)
        at org.tmatesoft.svn.core.internal.wc2.remote.SvnRemoteLog.run(SvnRemoteLog.java:35)
        at org.tmatesoft.svn.core.internal.wc2.SvnOperationRunner.run(SvnOperationRunner.java:21)
        at org.tmatesoft.svn.core.wc2.SvnOperationFactory.run(SvnOperationFactory.java:1239)
        at org.tmatesoft.svn.core.wc2.SvnOperation.run(SvnOperation.java:294)
        at org.tmatesoft.svn.core.wc.SVNLogClient.doLog(SVNLogClient.java:968)
        at org.tmatesoft.svn.core.wc.SVNLogClient.doLog(SVNLogClient.java:873)
        at hudson.scm.SubversionChangeLogBuilder.buildModule(SubversionChangeLogBuilder.java:188)
Caused: java.io.IOException: revision check failed on https://svn.apache.org/repos/asf/poi/trunk
        at hudson.scm.SubversionChangeLogBuilder.buildModule(SubversionChangeLogBuilder.java:202)
        at hudson.scm.SubversionChangeLogBuilder.run(SubversionChangeLogBuilder.java:122)
        at hudson.scm.SubversionSCM.calcChangeLog(SubversionSCM.java:755)
        at hudson.scm.SubversionSCM.checkout(SubversionSCM.java:888)
        at hudson.scm.SCM.checkout(SCM.java:505)
        at hudson.model.AbstractProject.checkout(AbstractProject.java:1206)
        at hudson.model.AbstractBuild$AbstractBuildExecution.defaultCheckout(AbstractBuild.java:637)
        at jenkins.scm.SCMCheckoutStrategy.checkout(SCMCheckoutStrategy.java:86)
        at hudson.model.AbstractBuild$AbstractBuildExecution.run(AbstractBuild.java:509)
        at hudson.model.Run.execute(Run.java:1907)
        at hudson.model.FreeStyleBuild.run(FreeStyleBuild.java:43)
        at hudson.model.ResourceController.execute(ResourceController.java:97)
        at hudson.model.Executor.run(Executor.java:429)
Retrying after 10 seconds
Updating https://svn.apache.org/repos/asf/poi/trunk at revision '2021-03-14T20:44:03.593 +0000'

<-- Got one external: documentation, svn url: https://svn.apache.org/repos/asf/poi/site/src/documentation -->
Fetching 'https://svn.apache.org/repos/asf/poi/site/src/documentation' at -1 into '<https://ci-builds.apache.org/job/POI/job/POI-DSL-1.8/ws/src/documentation'>
At revision 1887650


<-- Got one external: forrest.properties, svn url: https://svn.apache.org/repos/asf/poi/site/forrest.properties -->
Fetching 'https://svn.apache.org/repos/asf/poi/site/forrest.properties' at -1 into '<https://ci-builds.apache.org/job/POI/job/POI-DSL-1.8/ws/forrest.properties'>
At revision 1887650

At revision 1887650

org.tmatesoft.svn.core.SVNException: svn: E130003: Parser configuration problem: namespace reporting is not enabled
        at org.tmatesoft.svn.core.internal.wc.SVNErrorManager.error(SVNErrorManager.java:70)
        at org.tmatesoft.svn.core.internal.wc.SVNErrorManager.error(SVNErrorManager.java:57)
        at org.tmatesoft.svn.core.internal.io.dav.http.HTTPConnection.request(HTTPConnection.java:760)
        at org.tmatesoft.svn.core.internal.io.dav.http.HTTPConnection.request(HTTPConnection.java:352)
        at org.tmatesoft.svn.core.internal.io.dav.http.HTTPConnection.request(HTTPConnection.java:340)
        at org.tmatesoft.svn.core.internal.io.dav.DAVConnection.performHttpRequest(DAVConnection.java:910)
        at org.tmatesoft.svn.core.internal.io.dav.DAVConnection.doReport(DAVConnection.java:363)
        at org.tmatesoft.svn.core.internal.io.dav.DAVConnection.doReport(DAVConnection.java:353)
        at org.tmatesoft.svn.core.internal.io.dav.DAVRepository.logImpl(DAVRepository.java:1015)
        at org.tmatesoft.svn.core.io.SVNRepository.log(SVNRepository.java:1041)
        at org.tmatesoft.svn.core.internal.wc2.remote.SvnRemoteLog.run(SvnRemoteLog.java:181)
        at org.tmatesoft.svn.core.internal.wc2.remote.SvnRemoteLog.run(SvnRemoteLog.java:35)
        at org.tmatesoft.svn.core.internal.wc2.SvnOperationRunner.run(SvnOperationRunner.java:21)
        at org.tmatesoft.svn.core.wc2.SvnOperationFactory.run(SvnOperationFactory.java:1239)
        at org.tmatesoft.svn.core.wc2.SvnOperation.run(SvnOperation.java:294)
        at org.tmatesoft.svn.core.wc.SVNLogClient.doLog(SVNLogClient.java:968)
        at org.tmatesoft.svn.core.wc.SVNLogClient.doLog(SVNLogClient.java:873)
        at hudson.scm.SubversionChangeLogBuilder.buildModule(SubversionChangeLogBuilder.java:188)
Caused: java.io.IOException: revision check failed on https://svn.apache.org/repos/asf/poi/trunk
        at hudson.scm.SubversionChangeLogBuilder.buildModule(SubversionChangeLogBuilder.java:202)
        at hudson.scm.SubversionChangeLogBuilder.run(SubversionChangeLogBuilder.java:122)
        at hudson.scm.SubversionSCM.calcChangeLog(SubversionSCM.java:755)
        at hudson.scm.SubversionSCM.checkout(SubversionSCM.java:888)
        at hudson.scm.SCM.checkout(SCM.java:505)
        at hudson.model.AbstractProject.checkout(AbstractProject.java:1206)
        at hudson.model.AbstractBuild$AbstractBuildExecution.defaultCheckout(AbstractBuild.java:637)
        at jenkins.scm.SCMCheckoutStrategy.checkout(SCMCheckoutStrategy.java:86)
        at hudson.model.AbstractBuild$AbstractBuildExecution.run(AbstractBuild.java:509)
        at hudson.model.Run.execute(Run.java:1907)
        at hudson.model.FreeStyleBuild.run(FreeStyleBuild.java:43)
        at hudson.model.ResourceController.execute(ResourceController.java:97)
        at hudson.model.Executor.run(Executor.java:429)
[SpotBugs] Skipping execution of recorder since overall result is 'FAILURE'
Archiving artifacts
[Fast Archiver] Compressed 232.12 MB of artifacts by 12.6% relative to #192
Skipping publisher since build result is FAILURE
Recording test results
ERROR: Step ?Publish JUnit test result report? failed: Test reports were found but none of them are new. Did leafNodes run?
For example, <https://ci-builds.apache.org/job/POI/job/POI-DSL-1.8/ws/build/excelant-test-results/TEST-org.apache.poi.ss.excelant.TestBuildFile.xml> is 23 days old


---------------------------------------------------------------------
To unsubscribe, e-mail: [hidden email]
For additional commands, e-mail: [hidden email]

Reply | Threaded
Open this post in threaded view
|

Build failed in Jenkins: POI » POI-DSL-1.8 #194

Apache Jenkins Server
See <https://ci-builds.apache.org/job/POI/job/POI-DSL-1.8/194/display/redirect>

Changes:


------------------------------------------
[...truncated 574.07 KB...]
[junitlauncher] Running org.apache.poi.xssf.usermodel.TestXSSFSimpleShape
[junitlauncher] Tests run: 1, Failures: 0, Aborted: 0, Skipped: 0, Time elapsed: 0.017000 sec
[junitlauncher]
[junitlauncher] Running org.apache.poi.xssf.usermodel.TestXSSFTable
[junitlauncher] Tests run: 29, Failures: 0, Aborted: 0, Skipped: 0, Time elapsed: 0.200000 sec
[junitlauncher]
[junitlauncher] Running org.apache.poi.xssf.usermodel.TestXSSFTableColumn
[junitlauncher] Tests run: 3, Failures: 0, Aborted: 0, Skipped: 0, Time elapsed: 0.032000 sec
[junitlauncher]
[junitlauncher] Running org.apache.poi.xssf.usermodel.TestXSSFTextParagraph
[junitlauncher] Tests run: 1, Failures: 0, Aborted: 0, Skipped: 0, Time elapsed: 0.014000 sec
[junitlauncher]
[junitlauncher] Running org.apache.poi.xssf.usermodel.TestXSSFTextRun
[junitlauncher] Tests run: 1, Failures: 0, Aborted: 0, Skipped: 0, Time elapsed: 0.008000 sec
[junitlauncher]
[junitlauncher] Running org.apache.poi.xssf.usermodel.TestXSSFUnicodeSurrogates
[junitlauncher] Tests run: 1, Failures: 0, Aborted: 0, Skipped: 0, Time elapsed: 0.012000 sec
[junitlauncher]
[junitlauncher] Running org.apache.poi.xssf.usermodel.TestXSSFVMLDrawing
[junitlauncher] Tests run: 5, Failures: 0, Aborted: 0, Skipped: 0, Time elapsed: 0.045000 sec
[junitlauncher]
[junitlauncher] Running org.apache.poi.xssf.usermodel.TestXSSFWorkbook
[junitlauncher] Tests run: 62, Failures: 0, Aborted: 0, Skipped: 0, Time elapsed: 0.752000 sec
[junitlauncher]
[junitlauncher] Running org.apache.poi.xssf.usermodel.charts.TestXDDFChartLegend
[junitlauncher] Tests run: 3, Failures: 0, Aborted: 0, Skipped: 0, Time elapsed: 0.013000 sec
[junitlauncher]
[junitlauncher] Running org.apache.poi.xssf.usermodel.charts.TestXDDFManualLayout
[junitlauncher] Tests run: 2, Failures: 0, Aborted: 0, Skipped: 0, Time elapsed: 0.010000 sec
[junitlauncher]
[junitlauncher] Running org.apache.poi.xssf.usermodel.charts.TestXSSF3DChartData
[junitlauncher] Tests run: 1, Failures: 0, Aborted: 0, Skipped: 0, Time elapsed: 0.027000 sec
[junitlauncher]
[junitlauncher] Running org.apache.poi.xssf.usermodel.charts.TestXSSFCategoryAxis
[junitlauncher] Tests run: 1, Failures: 0, Aborted: 0, Skipped: 0, Time elapsed: 0.005000 sec
[junitlauncher]
[junitlauncher] Running org.apache.poi.xssf.usermodel.charts.TestXSSFChartAxis
[junitlauncher] Tests run: 8, Failures: 0, Aborted: 0, Skipped: 0, Time elapsed: 0.037000 sec
[junitlauncher]
[junitlauncher] Running org.apache.poi.xssf.usermodel.charts.TestXSSFChartTitle
[junitlauncher] Tests run: 6, Failures: 0, Aborted: 0, Skipped: 0, Time elapsed: 0.042000 sec
[junitlauncher]
[junitlauncher] Running org.apache.poi.xssf.usermodel.charts.TestXSSFDateAxis
[junitlauncher] Tests run: 1, Failures: 0, Aborted: 0, Skipped: 0, Time elapsed: 0.009000 sec
[junitlauncher]
[junitlauncher] Running org.apache.poi.xssf.usermodel.charts.TestXSSFLineChartData
[junitlauncher] Tests run: 1, Failures: 0, Aborted: 0, Skipped: 0, Time elapsed: 0.007000 sec
[junitlauncher]
[junitlauncher] Running org.apache.poi.xssf.usermodel.charts.TestXSSFScatterChartData
[junitlauncher] Tests run: 1, Failures: 0, Aborted: 0, Skipped: 0, Time elapsed: 0.008000 sec
[junitlauncher]
[junitlauncher] Running org.apache.poi.xssf.usermodel.charts.TestXSSFValueAxis
[junitlauncher] Tests run: 1, Failures: 0, Aborted: 0, Skipped: 0, Time elapsed: 0.005000 sec
[junitlauncher]
[junitlauncher] Running org.apache.poi.xssf.usermodel.extensions.TestXSSFBorder
[junitlauncher] Tests run: 1, Failures: 0, Aborted: 0, Skipped: 0, Time elapsed: 0.001000 sec
[junitlauncher]
[junitlauncher] Running org.apache.poi.xssf.usermodel.extensions.TestXSSFCellFill
[junitlauncher] Tests run: 6, Failures: 0, Aborted: 0, Skipped: 0, Time elapsed: 0.024000 sec
[junitlauncher]
[junitlauncher] Running org.apache.poi.xssf.usermodel.extensions.TestXSSFHeaderFooter
[junitlauncher] Tests run: 10, Failures: 0, Aborted: 0, Skipped: 0, Time elapsed: 0.023000 sec
[junitlauncher]
[junitlauncher] Running org.apache.poi.xssf.usermodel.helpers.TestColumnHelper
[junitlauncher] Tests run: 16, Failures: 0, Aborted: 0, Skipped: 0, Time elapsed: 0.024000 sec
[junitlauncher]
[junitlauncher] Running org.apache.poi.xssf.usermodel.helpers.TestHeaderFooterHelper
[junitlauncher] Tests run: 2, Failures: 0, Aborted: 0, Skipped: 0, Time elapsed: 0.001000 sec
[junitlauncher]
[junitlauncher] Running org.apache.poi.xssf.usermodel.helpers.TestXSSFColumnShifting
[junitlauncher] Tests run: 2, Failures: 0, Aborted: 0, Skipped: 0, Time elapsed: 0.004000 sec
[junitlauncher]
[junitlauncher] Running org.apache.poi.xssf.util.TestCTColComparator
[junitlauncher] Tests run: 2, Failures: 0, Aborted: 0, Skipped: 0, Time elapsed: 0.001000 sec
[junitlauncher]
[junitlauncher] Running org.apache.poi.xssf.util.TestEvilUnclosedBRFixingInputStream
[junitlauncher] Tests run: 3, Failures: 0, Aborted: 0, Skipped: 0, Time elapsed: 0.002000 sec
[junitlauncher]
[junitlauncher] Running org.apache.poi.xssf.util.TestNumericRanges
[junitlauncher] Tests run: 2, Failures: 0, Aborted: 0, Skipped: 0, Time elapsed: 0.001000 sec
[junitlauncher]
[junitlauncher] Running org.apache.poi.xwpf.TestAllExtendedProperties
[junitlauncher] Tests run: 1, Failures: 0, Aborted: 0, Skipped: 0, Time elapsed: 0.030000 sec
[junitlauncher]
[junitlauncher] Running org.apache.poi.xwpf.TestDocumentProtection
[junitlauncher] Tests run: 10, Failures: 0, Aborted: 0, Skipped: 0, Time elapsed: 0.387000 sec
[junitlauncher]
[junitlauncher] Running org.apache.poi.xwpf.TestNecessaryOOXMLClasses
[junitlauncher] Tests run: 1, Failures: 0, Aborted: 0, Skipped: 0, Time elapsed: 0.010000 sec
[junitlauncher]
[junitlauncher] Running org.apache.poi.xwpf.TestPackageCorePropertiesGetKeywords
[junitlauncher] Tests run: 1, Failures: 0, Aborted: 0, Skipped: 0, Time elapsed: 0.017000 sec
[junitlauncher]
[junitlauncher] Running org.apache.poi.xwpf.TestXWPFBugs
[junitlauncher] Tests run: 4, Failures: 0, Aborted: 0, Skipped: 0, Time elapsed: 0.222000 sec
[junitlauncher]
[junitlauncher] Running org.apache.poi.xwpf.extractor.TestExternalEntities
[junitlauncher] Tests run: 1, Failures: 0, Aborted: 0, Skipped: 0, Time elapsed: 0.008000 sec
[junitlauncher]
[junitlauncher] Running org.apache.poi.xwpf.extractor.TestXWPFWordExtractor
[junitlauncher] Tests run: 24, Failures: 0, Aborted: 0, Skipped: 0, Time elapsed: 0.384000 sec
[junitlauncher]
[junitlauncher] Running org.apache.poi.xwpf.model.TestXWPFDecorators
[junitlauncher] Tests run: 2, Failures: 0, Aborted: 0, Skipped: 0, Time elapsed: 0.050000 sec
[junitlauncher]
[junitlauncher] Running org.apache.poi.xwpf.model.TestXWPFHeaderFooterPolicy
[junitlauncher] Tests run: 3, Failures: 0, Aborted: 0, Skipped: 0, Time elapsed: 0.321000 sec
[junitlauncher]
[junitlauncher] Running org.apache.poi.xwpf.usermodel.TestChangeTracking
[junitlauncher] Tests run: 3, Failures: 0, Aborted: 0, Skipped: 0, Time elapsed: 0.020000 sec
[junitlauncher]
[junitlauncher] Running org.apache.poi.xwpf.usermodel.TestColumn
[junitlauncher] Tests run: 4, Failures: 0, Aborted: 0, Skipped: 0, Time elapsed: 0.041000 sec
[junitlauncher]
[junitlauncher] Running org.apache.poi.xwpf.usermodel.TestXWPFAbstractNum
[junitlauncher] Tests run: 1, Failures: 0, Aborted: 0, Skipped: 0, Time elapsed: 0.001000 sec
[junitlauncher]
[junitlauncher] Running org.apache.poi.xwpf.usermodel.TestXWPFBugs
[junitlauncher] Tests run: 11, Failures: 0, Aborted: 0, Skipped: 0, Time elapsed: 0.200000 sec
[junitlauncher]
[junitlauncher] Running org.apache.poi.xwpf.usermodel.TestXWPFChart
[junitlauncher] Tests run: 4, Failures: 0, Aborted: 0, Skipped: 0, Time elapsed: 0.039000 sec
[junitlauncher]
[junitlauncher] Running org.apache.poi.xwpf.usermodel.TestXWPFComment
[junitlauncher] Tests run: 1, Failures: 0, Aborted: 0, Skipped: 0, Time elapsed: 0.007000 sec
[junitlauncher]
[junitlauncher] Running org.apache.poi.xwpf.usermodel.TestXWPFDocument
[junitlauncher] Tests run: 21, Failures: 0, Aborted: 0, Skipped: 1, Time elapsed: 0.224000 sec
[junitlauncher]
[junitlauncher] Running org.apache.poi.xwpf.usermodel.TestXWPFEndnote
[junitlauncher] Tests run: 4, Failures: 0, Aborted: 0, Skipped: 0, Time elapsed: 0.021000 sec
[junitlauncher]
[junitlauncher] Running org.apache.poi.xwpf.usermodel.TestXWPFEndnotes
[junitlauncher] Tests run: 2, Failures: 0, Aborted: 0, Skipped: 0, Time elapsed: 0.008000 sec
[junitlauncher]
[junitlauncher] Running org.apache.poi.xwpf.usermodel.TestXWPFFootnote
[junitlauncher] Tests run: 4, Failures: 0, Aborted: 0, Skipped: 0, Time elapsed: 0.020000 sec
[junitlauncher]
[junitlauncher] Running org.apache.poi.xwpf.usermodel.TestXWPFFootnotes
[junitlauncher] Tests run: 3, Failures: 0, Aborted: 0, Skipped: 0, Time elapsed: 0.021000 sec
[junitlauncher]
[junitlauncher] Running org.apache.poi.xwpf.usermodel.TestXWPFHeader
[junitlauncher] Tests run: 6, Failures: 0, Aborted: 0, Skipped: 0, Time elapsed: 0.087000 sec
[junitlauncher]
[junitlauncher] Running org.apache.poi.xwpf.usermodel.TestXWPFHeadings
[junitlauncher] Tests run: 1, Failures: 0, Aborted: 0, Skipped: 0, Time elapsed: 0.044000 sec
[junitlauncher]
[junitlauncher] Running org.apache.poi.xwpf.usermodel.TestXWPFNumbering
[junitlauncher] Tests run: 8, Failures: 0, Aborted: 0, Skipped: 0, Time elapsed: 0.065000 sec
[junitlauncher]
[junitlauncher] Running org.apache.poi.xwpf.usermodel.TestXWPFParagraph
[junitlauncher] Tests run: 29, Failures: 0, Aborted: 0, Skipped: 0, Time elapsed: 0.156000 sec
[junitlauncher]
[junitlauncher] Running org.apache.poi.xwpf.usermodel.TestXWPFPictureData
[junitlauncher] Tests run: 5, Failures: 0, Aborted: 0, Skipped: 0, Time elapsed: 0.088000 sec
[junitlauncher]
[junitlauncher] Running org.apache.poi.xwpf.usermodel.TestXWPFRun
[junitlauncher] Tests run: 34, Failures: 0, Aborted: 0, Skipped: 0, Time elapsed: 0.167000 sec
[junitlauncher]
[junitlauncher] Running org.apache.poi.xwpf.usermodel.TestXWPFSDT
[junitlauncher] Tests run: 7, Failures: 0, Aborted: 0, Skipped: 0, Time elapsed: 0.060000 sec
[junitlauncher]
[junitlauncher] Running org.apache.poi.xwpf.usermodel.TestXWPFSmartTag
[junitlauncher] Tests run: 1, Failures: 0, Aborted: 0, Skipped: 0, Time elapsed: 0.007000 sec
[junitlauncher]
[junitlauncher] Running org.apache.poi.xwpf.usermodel.TestXWPFStyles
[junitlauncher] Tests run: 10, Failures: 0, Aborted: 0, Skipped: 0, Time elapsed: 0.074000 sec
[junitlauncher]
[junitlauncher] Running org.apache.poi.xwpf.usermodel.TestXWPFTable
[junitlauncher] Tests run: 17, Failures: 0, Aborted: 0, Skipped: 0, Time elapsed: 0.069000 sec
[junitlauncher]
[junitlauncher] Running org.apache.poi.xwpf.usermodel.TestXWPFTableCell
[junitlauncher] Tests run: 11, Failures: 0, Aborted: 0, Skipped: 0, Time elapsed: 0.040000 sec
[junitlauncher]
[junitlauncher] Running org.apache.poi.xwpf.usermodel.TestXWPFTableRow
[junitlauncher] Tests run: 8, Failures: 0, Aborted: 0, Skipped: 0, Time elapsed: 0.029000 sec

-test-ooxml-write-testfile:

compile-ooxml-lite:
     [echo] Create ooxml-lite schemas
     [copy] Copying 1 file to <https://ci-builds.apache.org/job/POI/job/POI-DSL-1.8/ws/build>
     [copy] Copying 1 file to <https://ci-builds.apache.org/job/POI/job/POI-DSL-1.8/ws/build>
     [copy] Copying 1 file to <https://ci-builds.apache.org/job/POI/job/POI-DSL-1.8/ws/build>
    [mkdir] Created dir: <https://ci-builds.apache.org/job/POI/job/POI-DSL-1.8/ws/build/dist/maven/poi-ooxml-lite>
      [jar] Building jar: <https://ci-builds.apache.org/job/POI/job/POI-DSL-1.8/ws/build/dist/maven/poi-ooxml-lite/poi-ooxml-lite-5.0.1-SNAPSHOT.jar>

-test-excelant-check:

test-excelant:
[junitlauncher]
[junitlauncher] Running org.apache.poi.ss.excelant.TestBuildFile
[junitlauncher] Tests run: 14, Failures: 0, Aborted: 0, Skipped: 0, Time elapsed: 2.955000 sec
[junitlauncher]
[junitlauncher] Running org.apache.poi.ss.excelant.TestExcelAntPrecision
[junitlauncher] Tests run: 1, Failures: 0, Aborted: 0, Skipped: 0, Time elapsed: 0.005000 sec
[junitlauncher]
[junitlauncher] Running org.apache.poi.ss.excelant.TestExcelAntSet
[junitlauncher] Tests run: 2, Failures: 0, Aborted: 0, Skipped: 0, Time elapsed: 0.021000 sec
[junitlauncher]
[junitlauncher] Running org.apache.poi.ss.excelant.TestExcelAntSetDoubleCell
[junitlauncher] Tests run: 1, Failures: 0, Aborted: 0, Skipped: 0, Time elapsed: 0.002000 sec
[junitlauncher]
[junitlauncher] Running org.apache.poi.ss.excelant.TestExcelAntUserDefinedFunction
[junitlauncher] Tests run: 2, Failures: 0, Aborted: 0, Skipped: 0, Time elapsed: 0.003000 sec
[junitlauncher]
[junitlauncher] Running org.apache.poi.ss.excelant.util.TestExcelAntEvaluationResult
[junitlauncher] Tests run: 4, Failures: 0, Aborted: 0, Skipped: 0, Time elapsed: 0.009000 sec
[junitlauncher]
[junitlauncher] Running org.apache.poi.ss.excelant.util.TestExcelAntWorkbookUtil
[junitlauncher] Tests run: 23, Failures: 0, Aborted: 0, Skipped: 0, Time elapsed: 1.590000 sec
[junitlauncher]
[junitlauncher] Running org.apache.poi.ss.excelant.util.TestExcelAntWorkbookUtilFactory
[junitlauncher] Tests run: 2, Failures: 0, Aborted: 0, Skipped: 0, Time elapsed: 0.003000 sec

-test-excelant-write-testfile:

test:

compile-integration:
    [javac] Compiling 28 source files to <https://ci-builds.apache.org/job/POI/job/POI-DSL-1.8/ws/build/integration-test-classes>
    [javac] Support for javac --release has been added in Java9 ignoring it
    [mkdir] Created dir: <https://ci-builds.apache.org/job/POI/job/POI-DSL-1.8/ws/build/integration-test-classes/META-INF/versions/9>
      [jar] Building jar: <https://ci-builds.apache.org/job/POI/job/POI-DSL-1.8/ws/build/dist/maven/poi-integration/poi-integration-5.0.1-SNAPSHOT.jar>

-test-integration-check:

test-integration:
[junitlauncher]
[junitlauncher] Running org.apache.poi.stress.TestAllFiles
[junitlauncher]    Failed: #762 poifs/unknown_properties.msg HPSF
[junitlauncher]    Failed: #761 poifs/unknown_properties.msg HSMF
[junitlauncher]    Failed: #762 poifs/unknown_properties.msg HPSF
[junitlauncher]    Failed: #761 poifs/unknown_properties.msg HSMF
[junitlauncher]    Failed: #762 poifs/unknown_properties.msg HPSF
[junitlauncher] Tests run: 7689, Failures: 5, Aborted: 0, Skipped: 0, Time elapsed: 222.069000 sec

BUILD FAILED
<https://ci-builds.apache.org/job/POI/job/POI-DSL-1.8/ws/build.xml>:1787: The following error occurred while executing this line:
<https://ci-builds.apache.org/job/POI/job/POI-DSL-1.8/ws/build.xml>:1337: Some test(s) have failure(s)

Total time: 16 minutes 10 seconds
Build step 'Invoke Ant' marked build as failure
[SpotBugs] Skipping execution of recorder since overall result is 'FAILURE'
Archiving artifacts
[Fast Archiver] Compressed 5.53 MB of artifacts by 11.9% relative to #192
Skipping publisher since build result is FAILURE
Recording test results
[Checks API] No suitable checks publisher found.

---------------------------------------------------------------------
To unsubscribe, e-mail: [hidden email]
For additional commands, e-mail: [hidden email]

Reply | Threaded
Open this post in threaded view
|

Build failed in Jenkins: POI » POI-DSL-1.8 #195

Apache Jenkins Server
See <https://ci-builds.apache.org/job/POI/job/POI-DSL-1.8/195/display/redirect?page=changes>

Changes:

[PJ Fanning] [bug-65184] revert due to integration test failures

[Andreas Beeker] Try to fix sonar build

[PJ Fanning] reformat file


------------------------------------------
[...truncated 186.86 KB...]
[junitlauncher] Running org.apache.poi.xssf.usermodel.TestXSSFSimpleShape
[junitlauncher] Tests run: 1, Failures: 0, Aborted: 0, Skipped: 0, Time elapsed: 0.021000 sec
[junitlauncher]
[junitlauncher] Running org.apache.poi.xssf.usermodel.TestXSSFTable
[junitlauncher] Tests run: 29, Failures: 0, Aborted: 0, Skipped: 0, Time elapsed: 0.329000 sec
[junitlauncher]
[junitlauncher] Running org.apache.poi.xssf.usermodel.TestXSSFTableColumn
[junitlauncher] Tests run: 3, Failures: 0, Aborted: 0, Skipped: 0, Time elapsed: 0.048000 sec
[junitlauncher]
[junitlauncher] Running org.apache.poi.xssf.usermodel.TestXSSFTextParagraph
[junitlauncher] Tests run: 1, Failures: 0, Aborted: 0, Skipped: 0, Time elapsed: 0.019000 sec
[junitlauncher]
[junitlauncher] Running org.apache.poi.xssf.usermodel.TestXSSFTextRun
[junitlauncher] Tests run: 1, Failures: 0, Aborted: 0, Skipped: 0, Time elapsed: 0.011000 sec
[junitlauncher]
[junitlauncher] Running org.apache.poi.xssf.usermodel.TestXSSFUnicodeSurrogates
[junitlauncher] Tests run: 1, Failures: 0, Aborted: 0, Skipped: 0, Time elapsed: 0.015000 sec
[junitlauncher]
[junitlauncher] Running org.apache.poi.xssf.usermodel.TestXSSFVMLDrawing
[junitlauncher] Tests run: 5, Failures: 0, Aborted: 0, Skipped: 0, Time elapsed: 0.079000 sec
[junitlauncher]
[junitlauncher] Running org.apache.poi.xssf.usermodel.TestXSSFWorkbook
[junitlauncher] Tests run: 62, Failures: 0, Aborted: 0, Skipped: 0, Time elapsed: 1.183000 sec
[junitlauncher]
[junitlauncher] Running org.apache.poi.xssf.usermodel.charts.TestXDDFChartLegend
[junitlauncher] Tests run: 3, Failures: 0, Aborted: 0, Skipped: 0, Time elapsed: 0.018000 sec
[junitlauncher]
[junitlauncher] Running org.apache.poi.xssf.usermodel.charts.TestXDDFManualLayout
[junitlauncher] Tests run: 2, Failures: 0, Aborted: 0, Skipped: 0, Time elapsed: 0.012000 sec
[junitlauncher]
[junitlauncher] Running org.apache.poi.xssf.usermodel.charts.TestXSSF3DChartData
[junitlauncher] Tests run: 1, Failures: 0, Aborted: 0, Skipped: 0, Time elapsed: 0.032000 sec
[junitlauncher]
[junitlauncher] Running org.apache.poi.xssf.usermodel.charts.TestXSSFCategoryAxis
[junitlauncher] Tests run: 1, Failures: 0, Aborted: 0, Skipped: 0, Time elapsed: 0.006000 sec
[junitlauncher]
[junitlauncher] Running org.apache.poi.xssf.usermodel.charts.TestXSSFChartAxis
[junitlauncher] Tests run: 8, Failures: 0, Aborted: 0, Skipped: 0, Time elapsed: 0.064000 sec
[junitlauncher]
[junitlauncher] Running org.apache.poi.xssf.usermodel.charts.TestXSSFChartTitle
[junitlauncher] Tests run: 6, Failures: 0, Aborted: 0, Skipped: 0, Time elapsed: 0.063000 sec
[junitlauncher]
[junitlauncher] Running org.apache.poi.xssf.usermodel.charts.TestXSSFDateAxis
[junitlauncher] Tests run: 1, Failures: 0, Aborted: 0, Skipped: 0, Time elapsed: 0.016000 sec
[junitlauncher]
[junitlauncher] Running org.apache.poi.xssf.usermodel.charts.TestXSSFLineChartData
[junitlauncher] Tests run: 1, Failures: 0, Aborted: 0, Skipped: 0, Time elapsed: 0.009000 sec
[junitlauncher]
[junitlauncher] Running org.apache.poi.xssf.usermodel.charts.TestXSSFScatterChartData
[junitlauncher] Tests run: 1, Failures: 0, Aborted: 0, Skipped: 0, Time elapsed: 0.010000 sec
[junitlauncher]
[junitlauncher] Running org.apache.poi.xssf.usermodel.charts.TestXSSFValueAxis
[junitlauncher] Tests run: 1, Failures: 0, Aborted: 0, Skipped: 0, Time elapsed: 0.004000 sec
[junitlauncher]
[junitlauncher] Running org.apache.poi.xssf.usermodel.extensions.TestXSSFBorder
[junitlauncher] Tests run: 1, Failures: 0, Aborted: 0, Skipped: 0, Time elapsed: 0.002000 sec
[junitlauncher]
[junitlauncher] Running org.apache.poi.xssf.usermodel.extensions.TestXSSFCellFill
[junitlauncher] Tests run: 6, Failures: 0, Aborted: 0, Skipped: 0, Time elapsed: 0.028000 sec
[junitlauncher]
[junitlauncher] Running org.apache.poi.xssf.usermodel.extensions.TestXSSFHeaderFooter
[junitlauncher] Tests run: 10, Failures: 0, Aborted: 0, Skipped: 0, Time elapsed: 0.031000 sec
[junitlauncher]
[junitlauncher] Running org.apache.poi.xssf.usermodel.helpers.TestColumnHelper
[junitlauncher] Tests run: 16, Failures: 0, Aborted: 0, Skipped: 0, Time elapsed: 0.031000 sec
[junitlauncher]
[junitlauncher] Running org.apache.poi.xssf.usermodel.helpers.TestHeaderFooterHelper
[junitlauncher] Tests run: 2, Failures: 0, Aborted: 0, Skipped: 0, Time elapsed: 0.001000 sec
[junitlauncher]
[junitlauncher] Running org.apache.poi.xssf.usermodel.helpers.TestXSSFColumnShifting
[junitlauncher] Tests run: 2, Failures: 0, Aborted: 0, Skipped: 0, Time elapsed: 0.004000 sec
[junitlauncher]
[junitlauncher] Running org.apache.poi.xssf.util.TestCTColComparator
[junitlauncher] Tests run: 2, Failures: 0, Aborted: 0, Skipped: 0, Time elapsed: 0.001000 sec
[junitlauncher]
[junitlauncher] Running org.apache.poi.xssf.util.TestEvilUnclosedBRFixingInputStream
[junitlauncher] Tests run: 3, Failures: 0, Aborted: 0, Skipped: 0, Time elapsed: 0.003000 sec
[junitlauncher]
[junitlauncher] Running org.apache.poi.xssf.util.TestNumericRanges
[junitlauncher] Tests run: 2, Failures: 0, Aborted: 0, Skipped: 0, Time elapsed: 0.001000 sec
[junitlauncher]
[junitlauncher] Running org.apache.poi.xwpf.TestAllExtendedProperties
[junitlauncher] Tests run: 1, Failures: 0, Aborted: 0, Skipped: 0, Time elapsed: 0.048000 sec
[junitlauncher]
[junitlauncher] Running org.apache.poi.xwpf.TestDocumentProtection
[junitlauncher] Tests run: 10, Failures: 0, Aborted: 0, Skipped: 0, Time elapsed: 0.647000 sec
[junitlauncher]
[junitlauncher] Running org.apache.poi.xwpf.TestNecessaryOOXMLClasses
[junitlauncher] Tests run: 1, Failures: 0, Aborted: 0, Skipped: 0, Time elapsed: 0.014000 sec
[junitlauncher]
[junitlauncher] Running org.apache.poi.xwpf.TestPackageCorePropertiesGetKeywords
[junitlauncher] Tests run: 1, Failures: 0, Aborted: 0, Skipped: 0, Time elapsed: 0.024000 sec
[junitlauncher]
[junitlauncher] Running org.apache.poi.xwpf.TestXWPFBugs
[junitlauncher] Tests run: 4, Failures: 0, Aborted: 0, Skipped: 0, Time elapsed: 0.389000 sec
[junitlauncher]
[junitlauncher] Running org.apache.poi.xwpf.extractor.TestExternalEntities
[junitlauncher] Tests run: 1, Failures: 0, Aborted: 0, Skipped: 0, Time elapsed: 0.014000 sec
[junitlauncher]
[junitlauncher] Running org.apache.poi.xwpf.extractor.TestXWPFWordExtractor
[junitlauncher] Tests run: 24, Failures: 0, Aborted: 0, Skipped: 0, Time elapsed: 0.726000 sec
[junitlauncher]
[junitlauncher] Running org.apache.poi.xwpf.model.TestXWPFDecorators
[junitlauncher] Tests run: 2, Failures: 0, Aborted: 0, Skipped: 0, Time elapsed: 0.083000 sec
[junitlauncher]
[junitlauncher] Running org.apache.poi.xwpf.model.TestXWPFHeaderFooterPolicy
[junitlauncher] Tests run: 3, Failures: 0, Aborted: 0, Skipped: 0, Time elapsed: 0.250000 sec
[junitlauncher]
[junitlauncher] Running org.apache.poi.xwpf.usermodel.TestChangeTracking
[junitlauncher] Tests run: 3, Failures: 0, Aborted: 0, Skipped: 0, Time elapsed: 0.030000 sec
[junitlauncher]
[junitlauncher] Running org.apache.poi.xwpf.usermodel.TestColumn
[junitlauncher] Tests run: 4, Failures: 0, Aborted: 0, Skipped: 0, Time elapsed: 0.067000 sec
[junitlauncher]
[junitlauncher] Running org.apache.poi.xwpf.usermodel.TestXWPFAbstractNum
[junitlauncher] Tests run: 1, Failures: 0, Aborted: 0, Skipped: 0, Time elapsed: 0.001000 sec
[junitlauncher]
[junitlauncher] Running org.apache.poi.xwpf.usermodel.TestXWPFBugs
[junitlauncher] Tests run: 11, Failures: 0, Aborted: 0, Skipped: 0, Time elapsed: 0.344000 sec
[junitlauncher]
[junitlauncher] Running org.apache.poi.xwpf.usermodel.TestXWPFChart
[junitlauncher] Tests run: 4, Failures: 0, Aborted: 0, Skipped: 0, Time elapsed: 0.057000 sec
[junitlauncher]
[junitlauncher] Running org.apache.poi.xwpf.usermodel.TestXWPFComment
[junitlauncher] Tests run: 1, Failures: 0, Aborted: 0, Skipped: 0, Time elapsed: 0.010000 sec
[junitlauncher]
[junitlauncher] Running org.apache.poi.xwpf.usermodel.TestXWPFDocument
[junitlauncher] Tests run: 21, Failures: 0, Aborted: 0, Skipped: 1, Time elapsed: 0.400000 sec
[junitlauncher]
[junitlauncher] Running org.apache.poi.xwpf.usermodel.TestXWPFEndnote
[junitlauncher] Tests run: 4, Failures: 0, Aborted: 0, Skipped: 0, Time elapsed: 0.030000 sec
[junitlauncher]
[junitlauncher] Running org.apache.poi.xwpf.usermodel.TestXWPFEndnotes
[junitlauncher] Tests run: 2, Failures: 0, Aborted: 0, Skipped: 0, Time elapsed: 0.017000 sec
[junitlauncher]
[junitlauncher] Running org.apache.poi.xwpf.usermodel.TestXWPFFootnote
[junitlauncher] Tests run: 4, Failures: 0, Aborted: 0, Skipped: 0, Time elapsed: 0.023000 sec
[junitlauncher]
[junitlauncher] Running org.apache.poi.xwpf.usermodel.TestXWPFFootnotes
[junitlauncher] Tests run: 3, Failures: 0, Aborted: 0, Skipped: 0, Time elapsed: 0.030000 sec
[junitlauncher]
[junitlauncher] Running org.apache.poi.xwpf.usermodel.TestXWPFHeader
[junitlauncher] Tests run: 6, Failures: 0, Aborted: 0, Skipped: 0, Time elapsed: 0.139000 sec
[junitlauncher]
[junitlauncher] Running org.apache.poi.xwpf.usermodel.TestXWPFHeadings
[junitlauncher] Tests run: 1, Failures: 0, Aborted: 0, Skipped: 0, Time elapsed: 0.059000 sec
[junitlauncher]
[junitlauncher] Running org.apache.poi.xwpf.usermodel.TestXWPFNumbering
[junitlauncher] Tests run: 8, Failures: 0, Aborted: 0, Skipped: 0, Time elapsed: 0.114000 sec
[junitlauncher]
[junitlauncher] Running org.apache.poi.xwpf.usermodel.TestXWPFParagraph
[junitlauncher] Tests run: 29, Failures: 0, Aborted: 0, Skipped: 0, Time elapsed: 0.233000 sec
[junitlauncher]
[junitlauncher] Running org.apache.poi.xwpf.usermodel.TestXWPFPictureData
[junitlauncher] Tests run: 5, Failures: 0, Aborted: 0, Skipped: 0, Time elapsed: 0.132000 sec
[junitlauncher]
[junitlauncher] Running org.apache.poi.xwpf.usermodel.TestXWPFRun
[junitlauncher] Tests run: 34, Failures: 0, Aborted: 0, Skipped: 0, Time elapsed: 0.292000 sec
[junitlauncher]
[junitlauncher] Running org.apache.poi.xwpf.usermodel.TestXWPFSDT
[junitlauncher] Tests run: 7, Failures: 0, Aborted: 0, Skipped: 0, Time elapsed: 0.103000 sec
[junitlauncher]
[junitlauncher] Running org.apache.poi.xwpf.usermodel.TestXWPFSmartTag
[junitlauncher] Tests run: 1, Failures: 0, Aborted: 0, Skipped: 0, Time elapsed: 0.010000 sec
[junitlauncher]
[junitlauncher] Running org.apache.poi.xwpf.usermodel.TestXWPFStyles
[junitlauncher] Tests run: 10, Failures: 0, Aborted: 0, Skipped: 0, Time elapsed: 0.112000 sec
[junitlauncher]
[junitlauncher] Running org.apache.poi.xwpf.usermodel.TestXWPFTable
[junitlauncher] Tests run: 17, Failures: 0, Aborted: 0, Skipped: 0, Time elapsed: 0.121000 sec
[junitlauncher]
[junitlauncher] Running org.apache.poi.xwpf.usermodel.TestXWPFTableCell
[junitlauncher] Tests run: 11, Failures: 0, Aborted: 0, Skipped: 0, Time elapsed: 0.059000 sec
[junitlauncher]
[junitlauncher] Running org.apache.poi.xwpf.usermodel.TestXWPFTableRow
[junitlauncher] Tests run: 8, Failures: 0, Aborted: 0, Skipped: 0, Time elapsed: 0.041000 sec

-test-ooxml-write-testfile:

compile-ooxml-lite:
     [echo] Create ooxml-lite schemas
     [copy] Copying 1 file to <https://ci-builds.apache.org/job/POI/job/POI-DSL-1.8/ws/build>
     [copy] Copying 1 file to <https://ci-builds.apache.org/job/POI/job/POI-DSL-1.8/ws/build>
     [copy] Copying 1 file to <https://ci-builds.apache.org/job/POI/job/POI-DSL-1.8/ws/build>
    [mkdir] Created dir: <https://ci-builds.apache.org/job/POI/job/POI-DSL-1.8/ws/build/dist/maven/poi-ooxml-lite>
      [jar] Building jar: <https://ci-builds.apache.org/job/POI/job/POI-DSL-1.8/ws/build/dist/maven/poi-ooxml-lite/poi-ooxml-lite-5.0.1-SNAPSHOT.jar>

-test-excelant-check:

test-excelant:
[junitlauncher]
[junitlauncher] Running org.apache.poi.ss.excelant.TestBuildFile
[junitlauncher] Tests run: 14, Failures: 0, Aborted: 0, Skipped: 0, Time elapsed: 4.810000 sec
[junitlauncher]
[junitlauncher] Running org.apache.poi.ss.excelant.TestExcelAntPrecision
[junitlauncher] Tests run: 1, Failures: 0, Aborted: 0, Skipped: 0, Time elapsed: 0.008000 sec
[junitlauncher]
[junitlauncher] Running org.apache.poi.ss.excelant.TestExcelAntSet
[junitlauncher] Tests run: 2, Failures: 0, Aborted: 0, Skipped: 0, Time elapsed: 0.032000 sec
[junitlauncher]
[junitlauncher] Running org.apache.poi.ss.excelant.TestExcelAntSetDoubleCell
[junitlauncher] Tests run: 1, Failures: 0, Aborted: 0, Skipped: 0, Time elapsed: 0.005000 sec
[junitlauncher]
[junitlauncher] Running org.apache.poi.ss.excelant.TestExcelAntUserDefinedFunction
[junitlauncher] Tests run: 2, Failures: 0, Aborted: 0, Skipped: 0, Time elapsed: 0.005000 sec
[junitlauncher]
[junitlauncher] Running org.apache.poi.ss.excelant.util.TestExcelAntEvaluationResult
[junitlauncher] Tests run: 4, Failures: 0, Aborted: 0, Skipped: 0, Time elapsed: 0.008000 sec
[junitlauncher]
[junitlauncher] Running org.apache.poi.ss.excelant.util.TestExcelAntWorkbookUtil
[junitlauncher] Tests run: 23, Failures: 0, Aborted: 0, Skipped: 0, Time elapsed: 2.400000 sec
[junitlauncher]
[junitlauncher] Running org.apache.poi.ss.excelant.util.TestExcelAntWorkbookUtilFactory
[junitlauncher] Tests run: 2, Failures: 0, Aborted: 0, Skipped: 0, Time elapsed: 0.003000 sec

-test-excelant-write-testfile:

test:

compile-integration:
    [javac] Compiling 28 source files to <https://ci-builds.apache.org/job/POI/job/POI-DSL-1.8/ws/build/integration-test-classes>
    [javac] Support for javac --release has been added in Java9 ignoring it
    [mkdir] Created dir: <https://ci-builds.apache.org/job/POI/job/POI-DSL-1.8/ws/build/integration-test-classes/META-INF/versions/9>
      [jar] Building jar: <https://ci-builds.apache.org/job/POI/job/POI-DSL-1.8/ws/build/dist/maven/poi-integration/poi-integration-5.0.1-SNAPSHOT.jar>

-test-integration-check:

test-integration:
[junitlauncher]
[junitlauncher] Running org.apache.poi.stress.TestAllFiles
[junitlauncher]    Failed: #762 poifs/unknown_properties.msg HPSF
[junitlauncher]    Failed: #761 poifs/unknown_properties.msg HSMF
[junitlauncher]    Failed: #762 poifs/unknown_properties.msg HPSF
[junitlauncher]    Failed: #761 poifs/unknown_properties.msg HSMF
[junitlauncher]    Failed: #762 poifs/unknown_properties.msg HPSF
[junitlauncher] Tests run: 7689, Failures: 5, Aborted: 0, Skipped: 0, Time elapsed: 300.918000 sec

BUILD FAILED
<https://ci-builds.apache.org/job/POI/job/POI-DSL-1.8/ws/build.xml>:1787: The following error occurred while executing this line:
<https://ci-builds.apache.org/job/POI/job/POI-DSL-1.8/ws/build.xml>:1337: Some test(s) have failure(s)

Total time: 24 minutes 39 seconds
Build step 'Invoke Ant' marked build as failure
[SpotBugs] Skipping execution of recorder since overall result is 'FAILURE'
Archiving artifacts
[Fast Archiver] Compressed 5.63 MB of artifacts by 11.7% relative to #192
Skipping publisher since build result is FAILURE
Recording test results
[Checks API] No suitable checks publisher found.

---------------------------------------------------------------------
To unsubscribe, e-mail: [hidden email]
For additional commands, e-mail: [hidden email]

Reply | Threaded
Open this post in threaded view
|

Jenkins build is back to normal : POI » POI-DSL-1.8 #196

Apache Jenkins Server
See <https://ci-builds.apache.org/job/POI/job/POI-DSL-1.8/196/display/redirect?page=changes>


---------------------------------------------------------------------
To unsubscribe, e-mail: [hidden email]
For additional commands, e-mail: [hidden email]