Build failed in Jenkins: POI » POI-DSL-1.16 #248

classic Classic list List threaded Threaded
3 messages Options
Reply | Threaded
Open this post in threaded view
|

Build failed in Jenkins: POI » POI-DSL-1.16 #248

Apache Jenkins Server
See <https://ci-builds.apache.org/job/POI/job/POI-DSL-1.16/248/display/redirect?page=changes>

Changes:

[PJ Fanning] reformat file

[PJ Fanning] [bug-65184] Improve performance of POFSMiniStore getBlockAt. Thanks to sits


------------------------------------------
[...truncated 187.03 KB...]
[junitlauncher] Tests run: 29, Failures: 0, Aborted: 0, Skipped: 0, Time elapsed: 0.198000 sec
[junitlauncher]
[junitlauncher] Running org.apache.poi.xssf.usermodel.TestXSSFTableColumn
[junitlauncher] Tests run: 3, Failures: 0, Aborted: 0, Skipped: 0, Time elapsed: 0.029000 sec
[junitlauncher]
[junitlauncher] Running org.apache.poi.xssf.usermodel.TestXSSFTextParagraph
[junitlauncher] Tests run: 1, Failures: 0, Aborted: 0, Skipped: 0, Time elapsed: 0.015000 sec
[junitlauncher]
[junitlauncher] Running org.apache.poi.xssf.usermodel.TestXSSFTextRun
[junitlauncher] Tests run: 1, Failures: 0, Aborted: 0, Skipped: 0, Time elapsed: 0.009000 sec
[junitlauncher]
[junitlauncher] Running org.apache.poi.xssf.usermodel.TestXSSFUnicodeSurrogates
[junitlauncher] Tests run: 1, Failures: 0, Aborted: 0, Skipped: 0, Time elapsed: 0.013000 sec
[junitlauncher]
[junitlauncher] Running org.apache.poi.xssf.usermodel.TestXSSFVMLDrawing
[junitlauncher] Tests run: 5, Failures: 0, Aborted: 0, Skipped: 0, Time elapsed: 0.059000 sec
[junitlauncher]
[junitlauncher] Running org.apache.poi.xssf.usermodel.TestXSSFWorkbook
[junitlauncher] Tests run: 62, Failures: 0, Aborted: 0, Skipped: 0, Time elapsed: 0.685000 sec
[junitlauncher]
[junitlauncher] Running org.apache.poi.xssf.usermodel.charts.TestXDDFChartLegend
[junitlauncher] Tests run: 3, Failures: 0, Aborted: 0, Skipped: 0, Time elapsed: 0.012000 sec
[junitlauncher]
[junitlauncher] Running org.apache.poi.xssf.usermodel.charts.TestXDDFManualLayout
[junitlauncher] Tests run: 2, Failures: 0, Aborted: 0, Skipped: 0, Time elapsed: 0.011000 sec
[junitlauncher]
[junitlauncher] Running org.apache.poi.xssf.usermodel.charts.TestXSSF3DChartData
[junitlauncher] Tests run: 1, Failures: 0, Aborted: 0, Skipped: 0, Time elapsed: 0.029000 sec
[junitlauncher]
[junitlauncher] Running org.apache.poi.xssf.usermodel.charts.TestXSSFCategoryAxis
[junitlauncher] Tests run: 1, Failures: 0, Aborted: 0, Skipped: 0, Time elapsed: 0.006000 sec
[junitlauncher]
[junitlauncher] Running org.apache.poi.xssf.usermodel.charts.TestXSSFChartAxis
[junitlauncher] Tests run: 8, Failures: 0, Aborted: 0, Skipped: 0, Time elapsed: 0.041000 sec
[junitlauncher]
[junitlauncher] Running org.apache.poi.xssf.usermodel.charts.TestXSSFChartTitle
[junitlauncher] Tests run: 6, Failures: 0, Aborted: 0, Skipped: 0, Time elapsed: 0.048000 sec
[junitlauncher]
[junitlauncher] Running org.apache.poi.xssf.usermodel.charts.TestXSSFDateAxis
[junitlauncher] Tests run: 1, Failures: 0, Aborted: 0, Skipped: 0, Time elapsed: 0.012000 sec
[junitlauncher]
[junitlauncher] Running org.apache.poi.xssf.usermodel.charts.TestXSSFLineChartData
[junitlauncher] Tests run: 1, Failures: 0, Aborted: 0, Skipped: 0, Time elapsed: 0.010000 sec
[junitlauncher]
[junitlauncher] Running org.apache.poi.xssf.usermodel.charts.TestXSSFScatterChartData
[junitlauncher] Tests run: 1, Failures: 0, Aborted: 0, Skipped: 0, Time elapsed: 0.008000 sec
[junitlauncher]
[junitlauncher] Running org.apache.poi.xssf.usermodel.charts.TestXSSFValueAxis
[junitlauncher] Tests run: 1, Failures: 0, Aborted: 0, Skipped: 0, Time elapsed: 0.005000 sec
[junitlauncher]
[junitlauncher] Running org.apache.poi.xssf.usermodel.extensions.TestXSSFBorder
[junitlauncher] Tests run: 1, Failures: 0, Aborted: 0, Skipped: 0, Time elapsed: 0.001000 sec
[junitlauncher]
[junitlauncher] Running org.apache.poi.xssf.usermodel.extensions.TestXSSFCellFill
[junitlauncher] Tests run: 6, Failures: 0, Aborted: 0, Skipped: 0, Time elapsed: 0.023000 sec
[junitlauncher]
[junitlauncher] Running org.apache.poi.xssf.usermodel.extensions.TestXSSFHeaderFooter
[junitlauncher] Tests run: 10, Failures: 0, Aborted: 0, Skipped: 0, Time elapsed: 0.025000 sec
[junitlauncher]
[junitlauncher] Running org.apache.poi.xssf.usermodel.helpers.TestColumnHelper
[junitlauncher] Tests run: 16, Failures: 0, Aborted: 0, Skipped: 0, Time elapsed: 0.029000 sec
[junitlauncher]
[junitlauncher] Running org.apache.poi.xssf.usermodel.helpers.TestHeaderFooterHelper
[junitlauncher] Tests run: 2, Failures: 0, Aborted: 0, Skipped: 0, Time elapsed: 0.001000 sec
[junitlauncher]
[junitlauncher] Running org.apache.poi.xssf.usermodel.helpers.TestXSSFColumnShifting
[junitlauncher] Tests run: 2, Failures: 0, Aborted: 0, Skipped: 0, Time elapsed: 0.005000 sec
[junitlauncher]
[junitlauncher] Running org.apache.poi.xssf.util.TestCTColComparator
[junitlauncher] Tests run: 2, Failures: 0, Aborted: 0, Skipped: 0, Time elapsed: 0.001000 sec
[junitlauncher]
[junitlauncher] Running org.apache.poi.xssf.util.TestEvilUnclosedBRFixingInputStream
[junitlauncher] Tests run: 3, Failures: 0, Aborted: 0, Skipped: 0, Time elapsed: 0.002000 sec
[junitlauncher]
[junitlauncher] Running org.apache.poi.xssf.util.TestNumericRanges
[junitlauncher] Tests run: 2, Failures: 0, Aborted: 0, Skipped: 0, Time elapsed: 0.000000 sec
[junitlauncher]
[junitlauncher] Running org.apache.poi.xwpf.TestAllExtendedProperties
[junitlauncher] Tests run: 1, Failures: 0, Aborted: 0, Skipped: 0, Time elapsed: 0.029000 sec
[junitlauncher]
[junitlauncher] Running org.apache.poi.xwpf.TestDocumentProtection
[junitlauncher] Tests run: 10, Failures: 0, Aborted: 0, Skipped: 0, Time elapsed: 0.372000 sec
[junitlauncher]
[junitlauncher] Running org.apache.poi.xwpf.TestNecessaryOOXMLClasses
[junitlauncher] Tests run: 1, Failures: 0, Aborted: 0, Skipped: 0, Time elapsed: 0.010000 sec
[junitlauncher]
[junitlauncher] Running org.apache.poi.xwpf.TestPackageCorePropertiesGetKeywords
[junitlauncher] Tests run: 1, Failures: 0, Aborted: 0, Skipped: 0, Time elapsed: 0.021000 sec
[junitlauncher]
[junitlauncher] Running org.apache.poi.xwpf.TestXWPFBugs
[junitlauncher] Tests run: 4, Failures: 0, Aborted: 0, Skipped: 0, Time elapsed: 0.253000 sec
[junitlauncher]
[junitlauncher] Running org.apache.poi.xwpf.extractor.TestExternalEntities
[junitlauncher] Tests run: 1, Failures: 0, Aborted: 0, Skipped: 0, Time elapsed: 0.011000 sec
[junitlauncher]
[junitlauncher] Running org.apache.poi.xwpf.extractor.TestXWPFWordExtractor
[junitlauncher] Tests run: 24, Failures: 0, Aborted: 0, Skipped: 0, Time elapsed: 0.422000 sec
[junitlauncher]
[junitlauncher] Running org.apache.poi.xwpf.model.TestXWPFDecorators
[junitlauncher] Tests run: 2, Failures: 0, Aborted: 0, Skipped: 0, Time elapsed: 0.049000 sec
[junitlauncher]
[junitlauncher] Running org.apache.poi.xwpf.model.TestXWPFHeaderFooterPolicy
[junitlauncher] Tests run: 3, Failures: 0, Aborted: 0, Skipped: 0, Time elapsed: 0.135000 sec
[junitlauncher]
[junitlauncher] Running org.apache.poi.xwpf.usermodel.TestChangeTracking
[junitlauncher] Tests run: 3, Failures: 0, Aborted: 0, Skipped: 0, Time elapsed: 0.019000 sec
[junitlauncher]
[junitlauncher] Running org.apache.poi.xwpf.usermodel.TestColumn
[junitlauncher] Tests run: 4, Failures: 0, Aborted: 0, Skipped: 0, Time elapsed: 0.041000 sec
[junitlauncher]
[junitlauncher] Running org.apache.poi.xwpf.usermodel.TestXWPFAbstractNum
[junitlauncher] Tests run: 1, Failures: 0, Aborted: 0, Skipped: 0, Time elapsed: 0.000000 sec
[junitlauncher]
[junitlauncher] Running org.apache.poi.xwpf.usermodel.TestXWPFBugs
[junitlauncher] Tests run: 11, Failures: 0, Aborted: 0, Skipped: 0, Time elapsed: 0.167000 sec
[junitlauncher]
[junitlauncher] Running org.apache.poi.xwpf.usermodel.TestXWPFChart
[junitlauncher] Tests run: 4, Failures: 0, Aborted: 0, Skipped: 0, Time elapsed: 0.031000 sec
[junitlauncher]
[junitlauncher] Running org.apache.poi.xwpf.usermodel.TestXWPFComment
[junitlauncher] Tests run: 1, Failures: 0, Aborted: 0, Skipped: 0, Time elapsed: 0.009000 sec
[junitlauncher]
[junitlauncher] Running org.apache.poi.xwpf.usermodel.TestXWPFDocument
[junitlauncher] Tests run: 21, Failures: 0, Aborted: 0, Skipped: 1, Time elapsed: 0.218000 sec
[junitlauncher]
[junitlauncher] Running org.apache.poi.xwpf.usermodel.TestXWPFEndnote
[junitlauncher] Tests run: 4, Failures: 0, Aborted: 0, Skipped: 0, Time elapsed: 0.021000 sec
[junitlauncher]
[junitlauncher] Running org.apache.poi.xwpf.usermodel.TestXWPFEndnotes
[junitlauncher] Tests run: 2, Failures: 0, Aborted: 0, Skipped: 0, Time elapsed: 0.011000 sec
[junitlauncher]
[junitlauncher] Running org.apache.poi.xwpf.usermodel.TestXWPFFootnote
[junitlauncher] Tests run: 4, Failures: 0, Aborted: 0, Skipped: 0, Time elapsed: 0.019000 sec
[junitlauncher]
[junitlauncher] Running org.apache.poi.xwpf.usermodel.TestXWPFFootnotes
[junitlauncher] Tests run: 3, Failures: 0, Aborted: 0, Skipped: 0, Time elapsed: 0.022000 sec
[junitlauncher]
[junitlauncher] Running org.apache.poi.xwpf.usermodel.TestXWPFHeader
[junitlauncher] Tests run: 6, Failures: 0, Aborted: 0, Skipped: 0, Time elapsed: 0.078000 sec
[junitlauncher]
[junitlauncher] Running org.apache.poi.xwpf.usermodel.TestXWPFHeadings
[junitlauncher] Tests run: 1, Failures: 0, Aborted: 0, Skipped: 0, Time elapsed: 0.032000 sec
[junitlauncher]
[junitlauncher] Running org.apache.poi.xwpf.usermodel.TestXWPFNumbering
[junitlauncher] Tests run: 8, Failures: 0, Aborted: 0, Skipped: 0, Time elapsed: 0.072000 sec
[junitlauncher]
[junitlauncher] Running org.apache.poi.xwpf.usermodel.TestXWPFParagraph
[junitlauncher] Tests run: 29, Failures: 0, Aborted: 0, Skipped: 0, Time elapsed: 0.152000 sec
[junitlauncher]
[junitlauncher] Running org.apache.poi.xwpf.usermodel.TestXWPFPictureData
[junitlauncher] Tests run: 5, Failures: 0, Aborted: 0, Skipped: 0, Time elapsed: 0.097000 sec
[junitlauncher]
[junitlauncher] Running org.apache.poi.xwpf.usermodel.TestXWPFRun
[junitlauncher] Tests run: 34, Failures: 0, Aborted: 0, Skipped: 0, Time elapsed: 0.177000 sec
[junitlauncher]
[junitlauncher] Running org.apache.poi.xwpf.usermodel.TestXWPFSDT
[junitlauncher] Tests run: 7, Failures: 0, Aborted: 0, Skipped: 0, Time elapsed: 0.070000 sec
[junitlauncher]
[junitlauncher] Running org.apache.poi.xwpf.usermodel.TestXWPFSmartTag
[junitlauncher] Tests run: 1, Failures: 0, Aborted: 0, Skipped: 0, Time elapsed: 0.008000 sec
[junitlauncher]
[junitlauncher] Running org.apache.poi.xwpf.usermodel.TestXWPFStyles
[junitlauncher] Tests run: 10, Failures: 0, Aborted: 0, Skipped: 0, Time elapsed: 0.078000 sec
[junitlauncher]
[junitlauncher] Running org.apache.poi.xwpf.usermodel.TestXWPFTable
[junitlauncher] Tests run: 17, Failures: 0, Aborted: 0, Skipped: 0, Time elapsed: 0.075000 sec
[junitlauncher]
[junitlauncher] Running org.apache.poi.xwpf.usermodel.TestXWPFTableCell
[junitlauncher] Tests run: 11, Failures: 0, Aborted: 0, Skipped: 0, Time elapsed: 0.041000 sec
[junitlauncher]
[junitlauncher] Running org.apache.poi.xwpf.usermodel.TestXWPFTableRow
[junitlauncher] Tests run: 8, Failures: 0, Aborted: 0, Skipped: 0, Time elapsed: 0.033000 sec

-test-ooxml-write-testfile:

compile-ooxml-lite:
     [echo] Create ooxml-lite schemas
    [javac] Compiling 1 source file to <https://ci-builds.apache.org/job/POI/job/POI-DSL-1.16/ws/src/multimodule/ooxml-lite/java9>
     [copy] Copying 1 file to <https://ci-builds.apache.org/job/POI/job/POI-DSL-1.16/ws/build>
     [copy] Copying 1 file to <https://ci-builds.apache.org/job/POI/job/POI-DSL-1.16/ws/build>
     [copy] Copying 1 file to <https://ci-builds.apache.org/job/POI/job/POI-DSL-1.16/ws/build>
    [mkdir] Created dir: <https://ci-builds.apache.org/job/POI/job/POI-DSL-1.16/ws/build/dist/maven/poi-ooxml-lite>
      [jar] Building jar: <https://ci-builds.apache.org/job/POI/job/POI-DSL-1.16/ws/build/dist/maven/poi-ooxml-lite/poi-ooxml-lite-5.0.1-SNAPSHOT.jar>

-test-excelant-check:

test-excelant:
[junitlauncher] OpenJDK 64-Bit Server VM warning: Option --illegal-access is deprecated and will be removed in a future release.
[junitlauncher]
[junitlauncher] Running org.apache.poi.ss.excelant.TestBuildFile
[junitlauncher] Tests run: 14, Failures: 0, Aborted: 0, Skipped: 0, Time elapsed: 3.072000 sec
[junitlauncher]
[junitlauncher] Running org.apache.poi.ss.excelant.TestExcelAntPrecision
[junitlauncher] Tests run: 1, Failures: 0, Aborted: 0, Skipped: 0, Time elapsed: 0.005000 sec
[junitlauncher]
[junitlauncher] Running org.apache.poi.ss.excelant.TestExcelAntSet
[junitlauncher] Tests run: 2, Failures: 0, Aborted: 0, Skipped: 0, Time elapsed: 0.022000 sec
[junitlauncher]
[junitlauncher] Running org.apache.poi.ss.excelant.TestExcelAntSetDoubleCell
[junitlauncher] Tests run: 1, Failures: 0, Aborted: 0, Skipped: 0, Time elapsed: 0.003000 sec
[junitlauncher]
[junitlauncher] Running org.apache.poi.ss.excelant.TestExcelAntUserDefinedFunction
[junitlauncher] Tests run: 2, Failures: 0, Aborted: 0, Skipped: 0, Time elapsed: 0.003000 sec
[junitlauncher]
[junitlauncher] Running org.apache.poi.ss.excelant.util.TestExcelAntEvaluationResult
[junitlauncher] Tests run: 4, Failures: 0, Aborted: 0, Skipped: 0, Time elapsed: 0.008000 sec
[junitlauncher]
[junitlauncher] Running org.apache.poi.ss.excelant.util.TestExcelAntWorkbookUtil
[junitlauncher] Tests run: 23, Failures: 0, Aborted: 0, Skipped: 0, Time elapsed: 1.106000 sec
[junitlauncher]
[junitlauncher] Running org.apache.poi.ss.excelant.util.TestExcelAntWorkbookUtilFactory
[junitlauncher] Tests run: 2, Failures: 0, Aborted: 0, Skipped: 0, Time elapsed: 0.002000 sec

-test-excelant-write-testfile:

test:

compile-integration:
    [javac] Compiling 28 source files to <https://ci-builds.apache.org/job/POI/job/POI-DSL-1.16/ws/build/integration-test-classes>
    [javac] Ignoring source, target and bootclasspath as release has been set
    [mkdir] Created dir: <https://ci-builds.apache.org/job/POI/job/POI-DSL-1.16/ws/build/integration-test-classes/META-INF/versions/9>
    [javac] Compiling 1 source file to <https://ci-builds.apache.org/job/POI/job/POI-DSL-1.16/ws/build/integration-test-classes/META-INF/versions/9>
      [jar] Building jar: <https://ci-builds.apache.org/job/POI/job/POI-DSL-1.16/ws/build/dist/maven/poi-integration/poi-integration-5.0.1-SNAPSHOT.jar>

-test-integration-check:

test-integration:
[junitlauncher] OpenJDK 64-Bit Server VM warning: Option --illegal-access is deprecated and will be removed in a future release.
[junitlauncher]
[junitlauncher] Running org.apache.poi.stress.TestAllFiles
[junitlauncher]    Failed: #762 poifs/unknown_properties.msg HPSF
[junitlauncher]    Failed: #761 poifs/unknown_properties.msg HSMF
[junitlauncher]    Failed: #762 poifs/unknown_properties.msg HPSF
[junitlauncher]    Failed: #761 poifs/unknown_properties.msg HSMF
[junitlauncher]    Failed: #762 poifs/unknown_properties.msg HPSF
[junitlauncher] Tests run: 7689, Failures: 5, Aborted: 0, Skipped: 0, Time elapsed: 194.573000 sec

BUILD FAILED
<https://ci-builds.apache.org/job/POI/job/POI-DSL-1.16/ws/build.xml>:1787: The following error occurred while executing this line:
<https://ci-builds.apache.org/job/POI/job/POI-DSL-1.16/ws/build.xml>:1337: Some test(s) have failure(s)

Total time: 14 minutes 49 seconds
Build step 'Invoke Ant' marked build as failure
[SpotBugs] Skipping execution of recorder since overall result is 'FAILURE'
Archiving artifacts
[Fast Archiver] Compressed 5.70 MB of artifacts by 48.8% relative to #247
Skipping publisher since build result is FAILURE
Recording test results
[Checks API] No suitable checks publisher found.

---------------------------------------------------------------------
To unsubscribe, e-mail: [hidden email]
For additional commands, e-mail: [hidden email]

Reply | Threaded
Open this post in threaded view
|

Build failed in Jenkins: POI » POI-DSL-1.16 #249

Apache Jenkins Server
See <https://ci-builds.apache.org/job/POI/job/POI-DSL-1.16/249/display/redirect?page=changes>

Changes:

[PJ Fanning] [bug-65184] revert due to integration test failures

[Andreas Beeker] Try to fix sonar build


------------------------------------------
[...truncated 187.25 KB...]
[junitlauncher] Tests run: 29, Failures: 0, Aborted: 0, Skipped: 0, Time elapsed: 0.181000 sec
[junitlauncher]
[junitlauncher] Running org.apache.poi.xssf.usermodel.TestXSSFTableColumn
[junitlauncher] Tests run: 3, Failures: 0, Aborted: 0, Skipped: 0, Time elapsed: 0.025000 sec
[junitlauncher]
[junitlauncher] Running org.apache.poi.xssf.usermodel.TestXSSFTextParagraph
[junitlauncher] Tests run: 1, Failures: 0, Aborted: 0, Skipped: 0, Time elapsed: 0.015000 sec
[junitlauncher]
[junitlauncher] Running org.apache.poi.xssf.usermodel.TestXSSFTextRun
[junitlauncher] Tests run: 1, Failures: 0, Aborted: 0, Skipped: 0, Time elapsed: 0.007000 sec
[junitlauncher]
[junitlauncher] Running org.apache.poi.xssf.usermodel.TestXSSFUnicodeSurrogates
[junitlauncher] Tests run: 1, Failures: 0, Aborted: 0, Skipped: 0, Time elapsed: 0.013000 sec
[junitlauncher]
[junitlauncher] Running org.apache.poi.xssf.usermodel.TestXSSFVMLDrawing
[junitlauncher] Tests run: 5, Failures: 0, Aborted: 0, Skipped: 0, Time elapsed: 0.051000 sec
[junitlauncher]
[junitlauncher] Running org.apache.poi.xssf.usermodel.TestXSSFWorkbook
[junitlauncher] Tests run: 62, Failures: 0, Aborted: 0, Skipped: 0, Time elapsed: 0.682000 sec
[junitlauncher]
[junitlauncher] Running org.apache.poi.xssf.usermodel.charts.TestXDDFChartLegend
[junitlauncher] Tests run: 3, Failures: 0, Aborted: 0, Skipped: 0, Time elapsed: 0.013000 sec
[junitlauncher]
[junitlauncher] Running org.apache.poi.xssf.usermodel.charts.TestXDDFManualLayout
[junitlauncher] Tests run: 2, Failures: 0, Aborted: 0, Skipped: 0, Time elapsed: 0.013000 sec
[junitlauncher]
[junitlauncher] Running org.apache.poi.xssf.usermodel.charts.TestXSSF3DChartData
[junitlauncher] Tests run: 1, Failures: 0, Aborted: 0, Skipped: 0, Time elapsed: 0.028000 sec
[junitlauncher]
[junitlauncher] Running org.apache.poi.xssf.usermodel.charts.TestXSSFCategoryAxis
[junitlauncher] Tests run: 1, Failures: 0, Aborted: 0, Skipped: 0, Time elapsed: 0.007000 sec
[junitlauncher]
[junitlauncher] Running org.apache.poi.xssf.usermodel.charts.TestXSSFChartAxis
[junitlauncher] Tests run: 8, Failures: 0, Aborted: 0, Skipped: 0, Time elapsed: 0.041000 sec
[junitlauncher]
[junitlauncher] Running org.apache.poi.xssf.usermodel.charts.TestXSSFChartTitle
[junitlauncher] Tests run: 6, Failures: 0, Aborted: 0, Skipped: 0, Time elapsed: 0.047000 sec
[junitlauncher]
[junitlauncher] Running org.apache.poi.xssf.usermodel.charts.TestXSSFDateAxis
[junitlauncher] Tests run: 1, Failures: 0, Aborted: 0, Skipped: 0, Time elapsed: 0.014000 sec
[junitlauncher]
[junitlauncher] Running org.apache.poi.xssf.usermodel.charts.TestXSSFLineChartData
[junitlauncher] Tests run: 1, Failures: 0, Aborted: 0, Skipped: 0, Time elapsed: 0.010000 sec
[junitlauncher]
[junitlauncher] Running org.apache.poi.xssf.usermodel.charts.TestXSSFScatterChartData
[junitlauncher] Tests run: 1, Failures: 0, Aborted: 0, Skipped: 0, Time elapsed: 0.009000 sec
[junitlauncher]
[junitlauncher] Running org.apache.poi.xssf.usermodel.charts.TestXSSFValueAxis
[junitlauncher] Tests run: 1, Failures: 0, Aborted: 0, Skipped: 0, Time elapsed: 0.005000 sec
[junitlauncher]
[junitlauncher] Running org.apache.poi.xssf.usermodel.extensions.TestXSSFBorder
[junitlauncher] Tests run: 1, Failures: 0, Aborted: 0, Skipped: 0, Time elapsed: 0.001000 sec
[junitlauncher]
[junitlauncher] Running org.apache.poi.xssf.usermodel.extensions.TestXSSFCellFill
[junitlauncher] Tests run: 6, Failures: 0, Aborted: 0, Skipped: 0, Time elapsed: 0.025000 sec
[junitlauncher]
[junitlauncher] Running org.apache.poi.xssf.usermodel.extensions.TestXSSFHeaderFooter
[junitlauncher] Tests run: 10, Failures: 0, Aborted: 0, Skipped: 0, Time elapsed: 0.028000 sec
[junitlauncher]
[junitlauncher] Running org.apache.poi.xssf.usermodel.helpers.TestColumnHelper
[junitlauncher] Tests run: 16, Failures: 0, Aborted: 0, Skipped: 0, Time elapsed: 0.026000 sec
[junitlauncher]
[junitlauncher] Running org.apache.poi.xssf.usermodel.helpers.TestHeaderFooterHelper
[junitlauncher] Tests run: 2, Failures: 0, Aborted: 0, Skipped: 0, Time elapsed: 0.001000 sec
[junitlauncher]
[junitlauncher] Running org.apache.poi.xssf.usermodel.helpers.TestXSSFColumnShifting
[junitlauncher] Tests run: 2, Failures: 0, Aborted: 0, Skipped: 0, Time elapsed: 0.003000 sec
[junitlauncher]
[junitlauncher] Running org.apache.poi.xssf.util.TestCTColComparator
[junitlauncher] Tests run: 2, Failures: 0, Aborted: 0, Skipped: 0, Time elapsed: 0.001000 sec
[junitlauncher]
[junitlauncher] Running org.apache.poi.xssf.util.TestEvilUnclosedBRFixingInputStream
[junitlauncher] Tests run: 3, Failures: 0, Aborted: 0, Skipped: 0, Time elapsed: 0.002000 sec
[junitlauncher]
[junitlauncher] Running org.apache.poi.xssf.util.TestNumericRanges
[junitlauncher] Tests run: 2, Failures: 0, Aborted: 0, Skipped: 0, Time elapsed: 0.001000 sec
[junitlauncher]
[junitlauncher] Running org.apache.poi.xwpf.TestAllExtendedProperties
[junitlauncher] Tests run: 1, Failures: 0, Aborted: 0, Skipped: 0, Time elapsed: 0.026000 sec
[junitlauncher]
[junitlauncher] Running org.apache.poi.xwpf.TestDocumentProtection
[junitlauncher] Tests run: 10, Failures: 0, Aborted: 0, Skipped: 0, Time elapsed: 0.370000 sec
[junitlauncher]
[junitlauncher] Running org.apache.poi.xwpf.TestNecessaryOOXMLClasses
[junitlauncher] Tests run: 1, Failures: 0, Aborted: 0, Skipped: 0, Time elapsed: 0.011000 sec
[junitlauncher]
[junitlauncher] Running org.apache.poi.xwpf.TestPackageCorePropertiesGetKeywords
[junitlauncher] Tests run: 1, Failures: 0, Aborted: 0, Skipped: 0, Time elapsed: 0.017000 sec
[junitlauncher]
[junitlauncher] Running org.apache.poi.xwpf.TestXWPFBugs
[junitlauncher] Tests run: 4, Failures: 0, Aborted: 0, Skipped: 0, Time elapsed: 0.202000 sec
[junitlauncher]
[junitlauncher] Running org.apache.poi.xwpf.extractor.TestExternalEntities
[junitlauncher] Tests run: 1, Failures: 0, Aborted: 0, Skipped: 0, Time elapsed: 0.011000 sec
[junitlauncher]
[junitlauncher] Running org.apache.poi.xwpf.extractor.TestXWPFWordExtractor
[junitlauncher] Tests run: 24, Failures: 0, Aborted: 0, Skipped: 0, Time elapsed: 0.388000 sec
[junitlauncher]
[junitlauncher] Running org.apache.poi.xwpf.model.TestXWPFDecorators
[junitlauncher] Tests run: 2, Failures: 0, Aborted: 0, Skipped: 0, Time elapsed: 0.059000 sec
[junitlauncher]
[junitlauncher] Running org.apache.poi.xwpf.model.TestXWPFHeaderFooterPolicy
[junitlauncher] Tests run: 3, Failures: 0, Aborted: 0, Skipped: 0, Time elapsed: 0.129000 sec
[junitlauncher]
[junitlauncher] Running org.apache.poi.xwpf.usermodel.TestChangeTracking
[junitlauncher] Tests run: 3, Failures: 0, Aborted: 0, Skipped: 0, Time elapsed: 0.018000 sec
[junitlauncher]
[junitlauncher] Running org.apache.poi.xwpf.usermodel.TestColumn
[junitlauncher] Tests run: 4, Failures: 0, Aborted: 0, Skipped: 0, Time elapsed: 0.034000 sec
[junitlauncher]
[junitlauncher] Running org.apache.poi.xwpf.usermodel.TestXWPFAbstractNum
[junitlauncher] Tests run: 1, Failures: 0, Aborted: 0, Skipped: 0, Time elapsed: 0.000000 sec
[junitlauncher]
[junitlauncher] Running org.apache.poi.xwpf.usermodel.TestXWPFBugs
[junitlauncher] Tests run: 11, Failures: 0, Aborted: 0, Skipped: 0, Time elapsed: 0.201000 sec
[junitlauncher]
[junitlauncher] Running org.apache.poi.xwpf.usermodel.TestXWPFChart
[junitlauncher] Tests run: 4, Failures: 0, Aborted: 0, Skipped: 0, Time elapsed: 0.037000 sec
[junitlauncher]
[junitlauncher] Running org.apache.poi.xwpf.usermodel.TestXWPFComment
[junitlauncher] Tests run: 1, Failures: 0, Aborted: 0, Skipped: 0, Time elapsed: 0.005000 sec
[junitlauncher]
[junitlauncher] Running org.apache.poi.xwpf.usermodel.TestXWPFDocument
[junitlauncher] Tests run: 21, Failures: 0, Aborted: 0, Skipped: 1, Time elapsed: 0.249000 sec
[junitlauncher]
[junitlauncher] Running org.apache.poi.xwpf.usermodel.TestXWPFEndnote
[junitlauncher] Tests run: 4, Failures: 0, Aborted: 0, Skipped: 0, Time elapsed: 0.024000 sec
[junitlauncher]
[junitlauncher] Running org.apache.poi.xwpf.usermodel.TestXWPFEndnotes
[junitlauncher] Tests run: 2, Failures: 0, Aborted: 0, Skipped: 0, Time elapsed: 0.013000 sec
[junitlauncher]
[junitlauncher] Running org.apache.poi.xwpf.usermodel.TestXWPFFootnote
[junitlauncher] Tests run: 4, Failures: 0, Aborted: 0, Skipped: 0, Time elapsed: 0.021000 sec
[junitlauncher]
[junitlauncher] Running org.apache.poi.xwpf.usermodel.TestXWPFFootnotes
[junitlauncher] Tests run: 3, Failures: 0, Aborted: 0, Skipped: 0, Time elapsed: 0.025000 sec
[junitlauncher]
[junitlauncher] Running org.apache.poi.xwpf.usermodel.TestXWPFHeader
[junitlauncher] Tests run: 6, Failures: 0, Aborted: 0, Skipped: 0, Time elapsed: 0.100000 sec
[junitlauncher]
[junitlauncher] Running org.apache.poi.xwpf.usermodel.TestXWPFHeadings
[junitlauncher] Tests run: 1, Failures: 0, Aborted: 0, Skipped: 0, Time elapsed: 0.039000 sec
[junitlauncher]
[junitlauncher] Running org.apache.poi.xwpf.usermodel.TestXWPFNumbering
[junitlauncher] Tests run: 8, Failures: 0, Aborted: 0, Skipped: 0, Time elapsed: 0.080000 sec
[junitlauncher]
[junitlauncher] Running org.apache.poi.xwpf.usermodel.TestXWPFParagraph
[junitlauncher] Tests run: 29, Failures: 0, Aborted: 0, Skipped: 0, Time elapsed: 0.169000 sec
[junitlauncher]
[junitlauncher] Running org.apache.poi.xwpf.usermodel.TestXWPFPictureData
[junitlauncher] Tests run: 5, Failures: 0, Aborted: 0, Skipped: 0, Time elapsed: 0.120000 sec
[junitlauncher]
[junitlauncher] Running org.apache.poi.xwpf.usermodel.TestXWPFRun
[junitlauncher] Tests run: 34, Failures: 0, Aborted: 0, Skipped: 0, Time elapsed: 0.171000 sec
[junitlauncher]
[junitlauncher] Running org.apache.poi.xwpf.usermodel.TestXWPFSDT
[junitlauncher] Tests run: 7, Failures: 0, Aborted: 0, Skipped: 0, Time elapsed: 0.069000 sec
[junitlauncher]
[junitlauncher] Running org.apache.poi.xwpf.usermodel.TestXWPFSmartTag
[junitlauncher] Tests run: 1, Failures: 0, Aborted: 0, Skipped: 0, Time elapsed: 0.009000 sec
[junitlauncher]
[junitlauncher] Running org.apache.poi.xwpf.usermodel.TestXWPFStyles
[junitlauncher] Tests run: 10, Failures: 0, Aborted: 0, Skipped: 0, Time elapsed: 0.077000 sec
[junitlauncher]
[junitlauncher] Running org.apache.poi.xwpf.usermodel.TestXWPFTable
[junitlauncher] Tests run: 17, Failures: 0, Aborted: 0, Skipped: 0, Time elapsed: 0.073000 sec
[junitlauncher]
[junitlauncher] Running org.apache.poi.xwpf.usermodel.TestXWPFTableCell
[junitlauncher] Tests run: 11, Failures: 0, Aborted: 0, Skipped: 0, Time elapsed: 0.044000 sec
[junitlauncher]
[junitlauncher] Running org.apache.poi.xwpf.usermodel.TestXWPFTableRow
[junitlauncher] Tests run: 8, Failures: 0, Aborted: 0, Skipped: 0, Time elapsed: 0.033000 sec

-test-ooxml-write-testfile:

compile-ooxml-lite:
     [echo] Create ooxml-lite schemas
    [javac] Compiling 1 source file to <https://ci-builds.apache.org/job/POI/job/POI-DSL-1.16/ws/src/multimodule/ooxml-lite/java9>
     [copy] Copying 1 file to <https://ci-builds.apache.org/job/POI/job/POI-DSL-1.16/ws/build>
     [copy] Copying 1 file to <https://ci-builds.apache.org/job/POI/job/POI-DSL-1.16/ws/build>
     [copy] Copying 1 file to <https://ci-builds.apache.org/job/POI/job/POI-DSL-1.16/ws/build>
    [mkdir] Created dir: <https://ci-builds.apache.org/job/POI/job/POI-DSL-1.16/ws/build/dist/maven/poi-ooxml-lite>
      [jar] Building jar: <https://ci-builds.apache.org/job/POI/job/POI-DSL-1.16/ws/build/dist/maven/poi-ooxml-lite/poi-ooxml-lite-5.0.1-SNAPSHOT.jar>

-test-excelant-check:

test-excelant:
[junitlauncher] OpenJDK 64-Bit Server VM warning: Option --illegal-access is deprecated and will be removed in a future release.
[junitlauncher]
[junitlauncher] Running org.apache.poi.ss.excelant.TestBuildFile
[junitlauncher] Tests run: 14, Failures: 0, Aborted: 0, Skipped: 0, Time elapsed: 3.092000 sec
[junitlauncher]
[junitlauncher] Running org.apache.poi.ss.excelant.TestExcelAntPrecision
[junitlauncher] Tests run: 1, Failures: 0, Aborted: 0, Skipped: 0, Time elapsed: 0.006000 sec
[junitlauncher]
[junitlauncher] Running org.apache.poi.ss.excelant.TestExcelAntSet
[junitlauncher] Tests run: 2, Failures: 0, Aborted: 0, Skipped: 0, Time elapsed: 0.023000 sec
[junitlauncher]
[junitlauncher] Running org.apache.poi.ss.excelant.TestExcelAntSetDoubleCell
[junitlauncher] Tests run: 1, Failures: 0, Aborted: 0, Skipped: 0, Time elapsed: 0.003000 sec
[junitlauncher]
[junitlauncher] Running org.apache.poi.ss.excelant.TestExcelAntUserDefinedFunction
[junitlauncher] Tests run: 2, Failures: 0, Aborted: 0, Skipped: 0, Time elapsed: 0.003000 sec
[junitlauncher]
[junitlauncher] Running org.apache.poi.ss.excelant.util.TestExcelAntEvaluationResult
[junitlauncher] Tests run: 4, Failures: 0, Aborted: 0, Skipped: 0, Time elapsed: 0.007000 sec
[junitlauncher]
[junitlauncher] Running org.apache.poi.ss.excelant.util.TestExcelAntWorkbookUtil
[junitlauncher] Tests run: 23, Failures: 0, Aborted: 0, Skipped: 0, Time elapsed: 1.063000 sec
[junitlauncher]
[junitlauncher] Running org.apache.poi.ss.excelant.util.TestExcelAntWorkbookUtilFactory
[junitlauncher] Tests run: 2, Failures: 0, Aborted: 0, Skipped: 0, Time elapsed: 0.002000 sec

-test-excelant-write-testfile:

test:

compile-integration:
    [javac] Compiling 28 source files to <https://ci-builds.apache.org/job/POI/job/POI-DSL-1.16/ws/build/integration-test-classes>
    [javac] Ignoring source, target and bootclasspath as release has been set
    [mkdir] Created dir: <https://ci-builds.apache.org/job/POI/job/POI-DSL-1.16/ws/build/integration-test-classes/META-INF/versions/9>
    [javac] Compiling 1 source file to <https://ci-builds.apache.org/job/POI/job/POI-DSL-1.16/ws/build/integration-test-classes/META-INF/versions/9>
      [jar] Building jar: <https://ci-builds.apache.org/job/POI/job/POI-DSL-1.16/ws/build/dist/maven/poi-integration/poi-integration-5.0.1-SNAPSHOT.jar>

-test-integration-check:

test-integration:
[junitlauncher] OpenJDK 64-Bit Server VM warning: Option --illegal-access is deprecated and will be removed in a future release.
[junitlauncher]
[junitlauncher] Running org.apache.poi.stress.TestAllFiles
[junitlauncher]    Failed: #762 poifs/unknown_properties.msg HPSF
[junitlauncher]    Failed: #761 poifs/unknown_properties.msg HSMF
[junitlauncher]    Failed: #762 poifs/unknown_properties.msg HPSF
[junitlauncher]    Failed: #761 poifs/unknown_properties.msg HSMF
[junitlauncher]    Failed: #762 poifs/unknown_properties.msg HPSF
[junitlauncher] Tests run: 7689, Failures: 5, Aborted: 0, Skipped: 0, Time elapsed: 206.875000 sec

BUILD FAILED
<https://ci-builds.apache.org/job/POI/job/POI-DSL-1.16/ws/build.xml>:1787: The following error occurred while executing this line:
<https://ci-builds.apache.org/job/POI/job/POI-DSL-1.16/ws/build.xml>:1337: Some test(s) have failure(s)

Total time: 15 minutes 13 seconds
Build step 'Invoke Ant' marked build as failure
[SpotBugs] Skipping execution of recorder since overall result is 'FAILURE'
Archiving artifacts
[Fast Archiver] Compressed 5.72 MB of artifacts by 48.6% relative to #247
Skipping publisher since build result is FAILURE
Recording test results
[Checks API] No suitable checks publisher found.

---------------------------------------------------------------------
To unsubscribe, e-mail: [hidden email]
For additional commands, e-mail: [hidden email]

Reply | Threaded
Open this post in threaded view
|

Jenkins build is back to normal : POI » POI-DSL-1.16 #250

Apache Jenkins Server
See <https://ci-builds.apache.org/job/POI/job/POI-DSL-1.16/250/display/redirect?page=changes>


---------------------------------------------------------------------
To unsubscribe, e-mail: [hidden email]
For additional commands, e-mail: [hidden email]