Build failed in Jenkins: POI » POI-DSL-1.15 #28

classic Classic list List threaded Threaded
6 messages Options
Reply | Threaded
Open this post in threaded view
|

Build failed in Jenkins: POI » POI-DSL-1.15 #28

Apache Jenkins Server
See <https://ci-builds.apache.org/job/POI/job/POI-DSL-1.15/28/display/redirect?page=changes>

Changes:

[Andreas Beeker] Integration tests - try to fix Oracle/OpenJDK vs IBM-JDK error message differences on XXE files

[Andreas Beeker] Update docs to 5.0.0

[Andreas Beeker] Bump versions to 5.0.1-SNAPSHOT

[Andreas Beeker] Sonar fixes
constant name to match the regular expression '^[A-Z][A-Z0-9]*(_[A-Z0-9]+)*$'
reorder "final static" -> "static final"

[Andreas Beeker] integration tests: ignore hsmf/lots-of-recipients.msg because of concurrent test errors - also takes too long to process

[Andreas Beeker] Integration test - fix filenames with windows path separator

[Andreas Beeker] Remove superfluous test

[Andreas Beeker] Sonar fixes
add asserts to tests

[Andreas Beeker] integration tests: Fix handling of NullPointerExceptions for Java 16+ (again ...)
Refactor TestAllFiles to provide an API for mass testing

[Andreas Beeker] integration tests: Fix JDK version handling

[Andreas Beeker] integration tests: NullPointerExceptions contain now a description in Java 16+

[Andreas Beeker] include externals on release build checkout

[Andreas Beeker] #65046 - Simplify integration tests

[Andreas Beeker] Sonar fixes
add asserts to tests

[Andreas Beeker] Sonar fixes
add asserts to tests

[PJ Fanning] fix date in news

[PJ Fanning] sync up xmlbeans date with https://xmlbeans.apache.org/

[PJ Fanning] add CVE info to news section

[Andreas Beeker] prepare for 5.0.1

[Andreas Beeker] add lz4-java for svn/release operations

[Andreas Beeker] release prepare for 5.0.0 - updating build.xml and changes.xml

[Andreas Beeker] update changes based on github history

[Andreas Beeker] remove EPL license

see https://lists.apache.org/thread.html/r605598dd36a371a8439652c8b362f4099d57662aeaf837fe5c22ad25%40%3Cdev.poi.apache.org%3E

[PJ Fanning] add missing release not for XMLBeans 4.0.0

[Andreas Beeker] Update license / NOTICE

[Andreas Beeker] Update maven dependencies

[Andreas Beeker] Update maven dependencies

[Andreas Beeker] Sonar fixes
add asserts to tests

[Andreas Beeker] revert Sonar fixes on BaseIntegrationTest


------------------------------------------
[...truncated 311.19 KB...]
     [echo] Tests run: 3, Failures: 0, Aborted: 0, Skipped: 0, Time elapsed: 0.009023 sec
     [echo] Ran org.apache.poi.ss.formula.functions.TestIndirectFunctionFromSpreadsheet
     [echo] Tests run: 11, Failures: 0, Aborted: 0, Skipped: 0, Time elapsed: 0.013472 sec
     [echo] Ran org.apache.poi.ss.formula.functions.TestIntercept
     [echo] Tests run: 4, Failures: 0, Aborted: 0, Skipped: 0, Time elapsed: 0.004143 sec
     [echo] Ran org.apache.poi.ss.formula.functions.TestIrr
     [echo] Tests run: 3, Failures: 0, Aborted: 0, Skipped: 0, Time elapsed: 0.004804 sec
     [echo] Ran org.apache.poi.ss.formula.functions.TestIsBlank
     [echo] Tests run: 1, Failures: 0, Aborted: 0, Skipped: 0, Time elapsed: 0.001083 sec
     [echo] Ran org.apache.poi.ss.formula.functions.TestLeftRight
     [echo] Tests run: 2, Failures: 0, Aborted: 0, Skipped: 0, Time elapsed: 0.000753 sec
     [echo] Ran org.apache.poi.ss.formula.functions.TestLen
     [echo] Tests run: 3, Failures: 0, Aborted: 0, Skipped: 0, Time elapsed: 0.001917 sec
     [echo] Ran org.apache.poi.ss.formula.functions.TestLogicalFunction
     [echo] Tests run: 2, Failures: 0, Aborted: 0, Skipped: 0, Time elapsed: 0.002448 sec
     [echo] Ran org.apache.poi.ss.formula.functions.TestLogicalFunctionsFromSpreadsheet
     [echo] Tests run: 15, Failures: 0, Aborted: 0, Skipped: 0, Time elapsed: 0.014818 sec
     [echo] Ran org.apache.poi.ss.formula.functions.TestLookupFunctionsFromSpreadsheet
     [echo] Tests run: 205, Failures: 0, Aborted: 0, Skipped: 0, Time elapsed: 0.151376 sec
     [echo] Ran org.apache.poi.ss.formula.functions.TestMatch
     [echo] Tests run: 9, Failures: 0, Aborted: 0, Skipped: 0, Time elapsed: 0.004569 sec
     [echo] Ran org.apache.poi.ss.formula.functions.TestMatchFunctionsFromSpreadsheet
     [echo] Tests run: 14, Failures: 0, Aborted: 0, Skipped: 0, Time elapsed: 0.012093 sec
     [echo] Ran org.apache.poi.ss.formula.functions.TestMathX
     [echo] Tests run: 23, Failures: 0, Aborted: 0, Skipped: 0, Time elapsed: 0.011977 sec
     [echo] Ran org.apache.poi.ss.formula.functions.TestMid
     [echo] Tests run: 4, Failures: 0, Aborted: 0, Skipped: 0, Time elapsed: 0.002490 sec
     [echo] Ran org.apache.poi.ss.formula.functions.TestMirr
     [echo] Tests run: 4, Failures: 0, Aborted: 0, Skipped: 0, Time elapsed: 0.004035 sec
     [echo] Ran org.apache.poi.ss.formula.functions.TestMultiOperandNumericFunction
     [echo] Tests run: 3, Failures: 0, Aborted: 0, Skipped: 0, Time elapsed: 0.001522 sec
     [echo] Ran org.apache.poi.ss.formula.functions.TestNper
     [echo] Tests run: 2, Failures: 0, Aborted: 0, Skipped: 0, Time elapsed: 0.001123 sec
     [echo] Ran org.apache.poi.ss.formula.functions.TestNpv
     [echo] Tests run: 2, Failures: 0, Aborted: 0, Skipped: 0, Time elapsed: 0.002509 sec
     [echo] Ran org.apache.poi.ss.formula.functions.TestOct2Dec
     [echo] Tests run: 2, Failures: 0, Aborted: 0, Skipped: 0, Time elapsed: 0.001321 sec
     [echo] Ran org.apache.poi.ss.formula.functions.TestOffset
     [echo] Tests run: 21, Failures: 0, Aborted: 0, Skipped: 0, Time elapsed: 0.027526 sec
     [echo] Ran org.apache.poi.ss.formula.functions.TestPPMT
     [echo] Tests run: 1, Failures: 0, Aborted: 0, Skipped: 0, Time elapsed: 0.001940 sec
     [echo] Ran org.apache.poi.ss.formula.functions.TestPmt
     [echo] Tests run: 2, Failures: 0, Aborted: 0, Skipped: 0, Time elapsed: 0.000724 sec
     [echo] Ran org.apache.poi.ss.formula.functions.TestPoisson
     [echo] Tests run: 6, Failures: 0, Aborted: 0, Skipped: 0, Time elapsed: 0.001422 sec
     [echo] Ran org.apache.poi.ss.formula.functions.TestProduct
     [echo] Tests run: 4, Failures: 0, Aborted: 0, Skipped: 0, Time elapsed: 0.000865 sec
     [echo] Ran org.apache.poi.ss.formula.functions.TestQuotient
     [echo] Tests run: 2, Failures: 0, Aborted: 0, Skipped: 0, Time elapsed: 0.002026 sec
     [echo] Ran org.apache.poi.ss.formula.functions.TestQuotientFunctionsFromSpreadsheet
     [echo] Tests run: 8, Failures: 0, Aborted: 0, Skipped: 0, Time elapsed: 0.008093 sec
     [echo] Ran org.apache.poi.ss.formula.functions.TestRank
     [echo] Tests run: 1, Failures: 0, Aborted: 0, Skipped: 0, Time elapsed: 0.003783 sec
     [echo] Ran org.apache.poi.ss.formula.functions.TestRelationalOperations
     [echo] Tests run: 5, Failures: 0, Aborted: 0, Skipped: 0, Time elapsed: 0.001790 sec
     [echo] Ran org.apache.poi.ss.formula.functions.TestReptFunctionsFromSpreadsheet
     [echo] Tests run: 5, Failures: 0, Aborted: 0, Skipped: 0, Time elapsed: 0.009630 sec
     [echo] Ran org.apache.poi.ss.formula.functions.TestRomanFunctionsFromSpreadsheet
     [echo] Tests run: 35, Failures: 0, Aborted: 0, Skipped: 0, Time elapsed: 0.014477 sec
     [echo] Ran org.apache.poi.ss.formula.functions.TestRoundFuncs
     [echo] Tests run: 5, Failures: 0, Aborted: 0, Skipped: 1, Time elapsed: 0.001644 sec
     [echo] Ran org.apache.poi.ss.formula.functions.TestRowCol
     [echo] Tests run: 4, Failures: 0, Aborted: 0, Skipped: 0, Time elapsed: 0.002433 sec
     [echo] Ran org.apache.poi.ss.formula.functions.TestSlope
     [echo] Tests run: 3, Failures: 0, Aborted: 0, Skipped: 0, Time elapsed: 0.001528 sec
     [echo] Ran org.apache.poi.ss.formula.functions.TestStatsLib
     [echo] Tests run: 8, Failures: 0, Aborted: 0, Skipped: 0, Time elapsed: 0.003151 sec
     [echo] Ran org.apache.poi.ss.formula.functions.TestSubstitute
     [echo] Tests run: 5, Failures: 0, Aborted: 0, Skipped: 0, Time elapsed: 0.001424 sec
     [echo] Ran org.apache.poi.ss.formula.functions.TestSubtotal
     [echo] Tests run: 11, Failures: 0, Aborted: 0, Skipped: 0, Time elapsed: 0.012414 sec
     [echo] Ran org.apache.poi.ss.formula.functions.TestSumif
     [echo] Tests run: 3, Failures: 0, Aborted: 0, Skipped: 0, Time elapsed: 0.001806 sec
     [echo] Ran org.apache.poi.ss.formula.functions.TestSumifs
     [echo] Tests run: 7, Failures: 0, Aborted: 0, Skipped: 0, Time elapsed: 0.008836 sec
     [echo] Ran org.apache.poi.ss.formula.functions.TestSumproduct
     [echo] Tests run: 5, Failures: 0, Aborted: 0, Skipped: 0, Time elapsed: 0.002197 sec
     [echo] Ran org.apache.poi.ss.formula.functions.TestTFunc
     [echo] Tests run: 5, Failures: 0, Aborted: 0, Skipped: 0, Time elapsed: 0.002075 sec
     [echo] Ran org.apache.poi.ss.formula.functions.TestText
     [echo] Tests run: 4, Failures: 0, Aborted: 0, Skipped: 0, Time elapsed: 0.004544 sec
     [echo] Ran org.apache.poi.ss.formula.functions.TestTime
     [echo] Tests run: 2, Failures: 0, Aborted: 0, Skipped: 0, Time elapsed: 0.007700 sec
     [echo] Ran org.apache.poi.ss.formula.functions.TestTrendFunctionsFromSpreadsheet
     [echo] Tests run: 41, Failures: 0, Aborted: 0, Skipped: 0, Time elapsed: 0.065332 sec
     [echo] Ran org.apache.poi.ss.formula.functions.TestTrim
     [echo] Tests run: 3, Failures: 0, Aborted: 0, Skipped: 0, Time elapsed: 0.001225 sec
     [echo] Ran org.apache.poi.ss.formula.functions.TestTrunc
     [echo] Tests run: 7, Failures: 0, Aborted: 0, Skipped: 0, Time elapsed: 0.002141 sec
     [echo] Ran org.apache.poi.ss.formula.functions.TestTwoOperandNumericFunctionsFromSpreadsheet
     [echo] Tests run: 34, Failures: 0, Aborted: 0, Skipped: 0, Time elapsed: 0.032120 sec
     [echo] Ran org.apache.poi.ss.formula.functions.TestValue
     [echo] Tests run: 2, Failures: 0, Aborted: 0, Skipped: 0, Time elapsed: 0.002210 sec
     [echo] Ran org.apache.poi.ss.formula.functions.TestWeekNumFunctionsFromSpreadsheet
     [echo] Tests run: 7, Failures: 0, Aborted: 0, Skipped: 0, Time elapsed: 0.010443 sec
     [echo] Ran org.apache.poi.ss.formula.functions.TestWeekNumFunctionsFromSpreadsheet2013
     [echo] Tests run: 7, Failures: 0, Aborted: 0, Skipped: 0, Time elapsed: 0.008862 sec
     [echo] Ran org.apache.poi.ss.formula.functions.TestWeekdayFunc
     [echo] Tests run: 2, Failures: 0, Aborted: 0, Skipped: 0, Time elapsed: 0.002297 sec
     [echo] Ran org.apache.poi.ss.formula.functions.TestXYNumericFunction
     [echo] Tests run: 3, Failures: 0, Aborted: 0, Skipped: 0, Time elapsed: 0.002771 sec
     [echo] Ran org.apache.poi.ss.formula.ptg.TestAbstractFunctionPtg
     [echo] Tests run: 3, Failures: 0, Aborted: 0, Skipped: 0, Time elapsed: 0.001893 sec
     [echo] Ran org.apache.poi.ss.formula.ptg.TestArea3DPtg
     [echo] Tests run: 1, Failures: 0, Aborted: 0, Skipped: 0, Time elapsed: 0.001258 sec
     [echo] Ran org.apache.poi.ss.formula.ptg.TestAreaErrPtg
     [echo] Tests run: 1, Failures: 0, Aborted: 0, Skipped: 0, Time elapsed: 0.001557 sec
     [echo] Ran org.apache.poi.ss.formula.ptg.TestAreaPtg
     [echo] Tests run: 5, Failures: 0, Aborted: 0, Skipped: 0, Time elapsed: 0.002132 sec
     [echo] Ran org.apache.poi.ss.formula.ptg.TestArrayPtg
     [echo] Tests run: 5, Failures: 0, Aborted: 0, Skipped: 0, Time elapsed: 0.002937 sec
     [echo] Ran org.apache.poi.ss.formula.ptg.TestAttrPtg
     [echo] Tests run: 1, Failures: 0, Aborted: 0, Skipped: 0, Time elapsed: 0.000680 sec
     [echo] Ran org.apache.poi.ss.formula.ptg.TestErrPtg
     [echo] Tests run: 1, Failures: 0, Aborted: 0, Skipped: 0, Time elapsed: 0.001542 sec
     [echo] Ran org.apache.poi.ss.formula.ptg.TestExternalFunctionFormulas
     [echo] Tests run: 3, Failures: 0, Aborted: 0, Skipped: 0, Time elapsed: 0.005323 sec
     [echo] Ran org.apache.poi.ss.formula.ptg.TestExternalNameReference
     [echo] Tests run: 3, Failures: 0, Aborted: 0, Skipped: 0, Time elapsed: 0.005670 sec
     [echo] Ran org.apache.poi.ss.formula.ptg.TestFuncPtg
     [echo] Tests run: 2, Failures: 0, Aborted: 0, Skipped: 0, Time elapsed: 0.000585 sec
     [echo] Ran org.apache.poi.ss.formula.ptg.TestFuncVarPtg
     [echo] Tests run: 1, Failures: 0, Aborted: 0, Skipped: 0, Time elapsed: 0.000544 sec
     [echo] Ran org.apache.poi.ss.formula.ptg.TestIntersectionPtg
     [echo] Tests run: 1, Failures: 0, Aborted: 0, Skipped: 0, Time elapsed: 0.001022 sec
     [echo] Ran org.apache.poi.ss.formula.ptg.TestPercentPtg
     [echo] Tests run: 1, Failures: 0, Aborted: 0, Skipped: 0, Time elapsed: 0.000971 sec
     [echo] Ran org.apache.poi.ss.formula.ptg.TestRangePtg
     [echo] Tests run: 1, Failures: 0, Aborted: 0, Skipped: 0, Time elapsed: 0.000938 sec
     [echo] Ran org.apache.poi.ss.formula.ptg.TestRef3DPtg
     [echo] Tests run: 1, Failures: 0, Aborted: 0, Skipped: 0, Time elapsed: 0.000630 sec
     [echo] Ran org.apache.poi.ss.formula.ptg.TestReferencePtg
     [echo] Tests run: 4, Failures: 0, Aborted: 0, Skipped: 0, Time elapsed: 0.012584 sec
     [echo] Ran org.apache.poi.ss.formula.ptg.TestUnionPtg
     [echo] Tests run: 1, Failures: 0, Aborted: 0, Skipped: 0, Time elapsed: 0.001095 sec
     [echo] Ran org.apache.poi.ss.formula.udf.TestAggregatingUDFFinder
     [echo] Tests run: 2, Failures: 0, Aborted: 0, Skipped: 0, Time elapsed: 0.002358 sec
     [echo] Ran org.apache.poi.ss.formula.udf.TestDefaultUDFFinder
     [echo] Tests run: 1, Failures: 0, Aborted: 0, Skipped: 0, Time elapsed: 0.000587 sec
     [echo] Ran org.apache.poi.ss.usermodel.TestDataFormatter
     [echo] Tests run: 37, Failures: 0, Aborted: 0, Skipped: 1, Time elapsed: 0.398989 sec
     [echo] Ran org.apache.poi.ss.usermodel.TestDateUtil
     [echo] Tests run: 26, Failures: 0, Aborted: 0, Skipped: 0, Time elapsed: 0.018223 sec
     [echo] Ran org.apache.poi.ss.usermodel.TestExcelStyleDateFormatter
     [echo] Tests run: 123, Failures: 0, Aborted: 0, Skipped: 0, Time elapsed: 0.074081 sec
     [echo] Ran org.apache.poi.ss.usermodel.TestFractionFormat
     [echo] Tests run: 5, Failures: 0, Aborted: 0, Skipped: 1, Time elapsed: 0.253016 sec
     [echo] Ran org.apache.poi.ss.usermodel.TestHSSFBorderStyle
     [echo] Tests run: 1, Failures: 0, Aborted: 0, Skipped: 0, Time elapsed: 0.001617 sec
     [echo] Ran org.apache.poi.ss.usermodel.TestIndexedColors
     [echo] Tests run: 3, Failures: 0, Aborted: 0, Skipped: 0, Time elapsed: 0.001987 sec
     [echo] Ran org.apache.poi.ss.util.TestAreaReference
     [echo] Tests run: 3, Failures: 0, Aborted: 0, Skipped: 0, Time elapsed: 0.001308 sec
     [echo] Ran org.apache.poi.ss.util.TestCellAddress
     [echo] Tests run: 6, Failures: 0, Aborted: 0, Skipped: 0, Time elapsed: 0.001170 sec
     [echo] Ran org.apache.poi.ss.util.TestCellRangeAddress
     [echo] Tests run: 14, Failures: 0, Aborted: 0, Skipped: 0, Time elapsed: 0.005809 sec
     [echo] Ran org.apache.poi.ss.util.TestCellRangeUtil
     [echo] Tests run: 1, Failures: 0, Aborted: 0, Skipped: 0, Time elapsed: 0.000686 sec
     [echo] Ran org.apache.poi.ss.util.TestCellReference
     [echo] Tests run: 27, Failures: 0, Aborted: 0, Skipped: 0, Time elapsed: 0.198797 sec
     [echo] Ran org.apache.poi.ss.util.TestDateFormatConverter
     [echo] Tests run: 18, Failures: 0, Aborted: 0, Skipped: 0, Time elapsed: 3.923238 sec
     [echo] Ran org.apache.poi.ss.util.TestDateParser
     [echo] Tests run: 5, Failures: 0, Aborted: 0, Skipped: 0, Time elapsed: 0.004907 sec
     [echo] Ran org.apache.poi.ss.util.TestExpandedDouble
     [echo] Tests run: 18, Failures: 0, Aborted: 0, Skipped: 0, Time elapsed: 0.013589 sec
     [echo] Ran org.apache.poi.ss.util.TestHSSFCellUtil
     [echo] Tests run: 14, Failures: 0, Aborted: 0, Skipped: 0, Time elapsed: 0.017845 sec
     [echo] Ran org.apache.poi.ss.util.TestNumberComparer
     [echo] Tests run: 115, Failures: 0, Aborted: 0, Skipped: 0, Time elapsed: 0.087674 sec
     [echo] Ran org.apache.poi.ss.util.TestNumberToTextConverter
     [echo] Tests run: 2, Failures: 0, Aborted: 0, Skipped: 0, Time elapsed: 0.013298 sec
     [echo] Ran org.apache.poi.ss.util.TestPropertyTemplate
     [echo] Tests run: 8, Failures: 0, Aborted: 0, Skipped: 0, Time elapsed: 0.014703 sec
     [echo] Ran org.apache.poi.ss.util.TestRegionUtil
     [echo] Tests run: 10, Failures: 0, Aborted: 0, Skipped: 0, Time elapsed: 0.010567 sec
     [echo] Ran org.apache.poi.ss.util.TestSheetBuilder
     [echo] Tests run: 3, Failures: 0, Aborted: 0, Skipped: 0, Time elapsed: 0.004165 sec
     [echo] Ran org.apache.poi.ss.util.TestSheetUtil
     [echo] Tests run: 7, Failures: 0, Aborted: 0, Skipped: 0, Time elapsed: 0.007823 sec
     [echo] Ran org.apache.poi.ss.util.TestWorkbookUtil
     [echo] Tests run: 1, Failures: 0, Aborted: 0, Skipped: 0, Time elapsed: 0.000707 sec
     [echo] Ran org.apache.poi.ss.util.cellwalk.TestCellWalk
     [echo] Tests run: 1, Failures: 0, Aborted: 0, Skipped: 0, Time elapsed: 0.004833 sec
     [echo] Ran org.apache.poi.util.TestArrayUtil
     [echo] Tests run: 1, Failures: 0, Aborted: 0, Skipped: 0, Time elapsed: 0.002609 sec
     [echo] Ran org.apache.poi.util.TestBitField
     [echo] Tests run: 16, Failures: 0, Aborted: 0, Skipped: 0, Time elapsed: 0.004940 sec
     [echo] Ran org.apache.poi.util.TestByteField
     [echo] Tests run: 5, Failures: 0, Aborted: 0, Skipped: 0, Time elapsed: 0.002230 sec
     [echo] Ran org.apache.poi.util.TestHexDump
     [echo] Tests run: 8, Failures: 0, Aborted: 0, Skipped: 0, Time elapsed: 0.015001 sec
     [echo] Ran org.apache.poi.util.TestIOUtils
     [echo] Tests run: 36, Failures: 0, Aborted: 0, Skipped: 0, Time elapsed: 0.036807 sec
     [echo] Ran org.apache.poi.util.TestIntList
     [echo] Tests run: 19, Failures: 0, Aborted: 0, Skipped: 0, Time elapsed: 0.050934 sec
     [echo] Ran org.apache.poi.util.TestIntegerField
     [echo] Tests run: 5, Failures: 0, Aborted: 0, Skipped: 0, Time elapsed: 0.004695 sec
     [echo] Ran org.apache.poi.util.TestLittleEndian
     [echo] Tests run: 15, Failures: 0, Aborted: 0, Skipped: 0, Time elapsed: 0.005581 sec
     [echo] Ran org.apache.poi.util.TestLittleEndianStreams
     [echo] Tests run: 5, Failures: 0, Aborted: 0, Skipped: 0, Time elapsed: 0.002665 sec
     [echo] Ran org.apache.poi.util.TestLocaleUtil
     [echo] Tests run: 3, Failures: 0, Aborted: 0, Skipped: 0, Time elapsed: 0.001514 sec
     [echo] Ran org.apache.poi.util.TestLongField
     [echo] Tests run: 5, Failures: 0, Aborted: 0, Skipped: 0, Time elapsed: 0.003052 sec
     [echo] Ran org.apache.poi.util.TestPOILogger
     [echo] Tests run: 1, Failures: 0, Aborted: 0, Skipped: 0, Time elapsed: 0.001237 sec
     [echo] Ran org.apache.poi.util.TestRLEDecompressingInputStream
     [echo] Tests run: 4, Failures: 0, Aborted: 0, Skipped: 0, Time elapsed: 0.001577 sec
     [echo] Ran org.apache.poi.util.TestShortField
     [echo] Tests run: 5, Failures: 0, Aborted: 0, Skipped: 0, Time elapsed: 0.004908 sec
     [echo] Ran org.apache.poi.util.TestStringCodepointsIterable
     [echo] Tests run: 1, Failures: 0, Aborted: 0, Skipped: 0, Time elapsed: 0.001323 sec
     [echo] Ran org.apache.poi.util.TestStringUtil
     [echo] Tests run: 7, Failures: 0, Aborted: 0, Skipped: 0, Time elapsed: 0.003047 sec
     [echo] Ran org.apache.poi.util.TestTempFile
     [echo] Tests run: 4, Failures: 0, Aborted: 0, Skipped: 0, Time elapsed: 0.004721 sec
     [echo] Ran org.apache.poi.util.TestXMLHelper
     [echo] Tests run: 8, Failures: 0, Aborted: 0, Skipped: 0, Time elapsed: 0.264670 sec

-test-excelant-write-testfile:

test:

compile-integration:
    [javac] Compiling 28 source files to <https://ci-builds.apache.org/job/POI/job/POI-DSL-1.15/ws/build/integration-test-classes>
    [javac] Ignoring source, target and bootclasspath as release has been set
    [mkdir] Created dir: <https://ci-builds.apache.org/job/POI/job/POI-DSL-1.15/ws/build/integration-test-classes/META-INF/versions/9>
    [javac] Compiling 1 source file to <https://ci-builds.apache.org/job/POI/job/POI-DSL-1.15/ws/build/integration-test-classes/META-INF/versions/9>
      [jar] Building jar: <https://ci-builds.apache.org/job/POI/job/POI-DSL-1.15/ws/build/dist/maven/poi-integration/poi-integration-5.0.1-SNAPSHOT.jar>

-test-integration-check:

test-integration:
[junitlauncher] [63.969s][warning][gc,alloc] ForkJoinPool-1-worker-13: Retried waiting for GCLocker too often allocating 3644930 words

BUILD FAILED
<https://ci-builds.apache.org/job/POI/job/POI-DSL-1.15/ws/build.xml>:1709: The following error occurred while executing this line:
<https://ci-builds.apache.org/job/POI/job/POI-DSL-1.15/ws/build.xml>:1256: Some test(s) have failure(s)

Total time: 15 minutes 22 seconds
Build step 'Invoke Ant' marked build as failure
[SpotBugs] Skipping execution of recorder since overall result is 'FAILURE'
Archiving artifacts
[Fast Archiver] Compressed 8.09 MB of artifacts by 37.9% relative to #27
Skipping publisher since build result is FAILURE
Recording test results

---------------------------------------------------------------------
To unsubscribe, e-mail: [hidden email]
For additional commands, e-mail: [hidden email]

Reply | Threaded
Open this post in threaded view
|

Build failed in Jenkins: POI » POI-DSL-1.15 #29

Apache Jenkins Server
See <https://ci-builds.apache.org/job/POI/job/POI-DSL-1.15/29/display/redirect?page=changes>

Changes:

[Alain Béarez] Replace deprecated methods used  in tests

[Andreas Beeker] Sonar fixes
add asserts to tests

[Andreas Beeker] Junit5 - fix logging to console

[Dominik Stadler] List more bugfixes that went into 5.0.0

[Andreas Beeker] try to fix font-based issues

[Dominik Stadler] List some more changes for 5.0.0

[Dominik Stadler] Documentation: Adjust examples, fix git command, adjust for JUnit 5

[Andreas Beeker] Sonar fixes
add asserts to tests

[PJ Fanning] missing license

[Alain Béarez] Bug 64950: handle doughnut hole size

[PJ Fanning] [bug-65096] XLSX Streaming XML not correctly reading multiple inline Strings

[Andreas Beeker] typo

[Andreas Beeker] apply @announce comments

[Andreas Beeker] limit junit concurrent threads to 3 (fixed amount)

[Alain Béarez] Bug 65016 - Creating a chart throws exception

[Andreas Beeker] github-211 - Revert addRow to behaviour before 4.1.2

[Andreas Beeker] fix small typo on main page

[PJ Fanning] add fastexcel lib to related projects

[PJ Fanning] gradle 6.8

[PJ Fanning] gradle 6.8

[PJ Fanning] [github-215] Improve Performance of OperandResolver#parseDouble. Thanks to Robert Wenzel. This closes #215


------------------------------------------
[...truncated 188.49 KB...]
[junitlauncher]
[junitlauncher] Running org.apache.poi.xssf.usermodel.TestXSSFUnicodeSurrogates
[junitlauncher] Tests run: 1, Failures: 0, Aborted: 0, Skipped: 0, Time elapsed: 0.011000 sec
[junitlauncher]
[junitlauncher] Running org.apache.poi.xssf.usermodel.TestXSSFVMLDrawing
[junitlauncher] Tests run: 5, Failures: 0, Aborted: 0, Skipped: 0, Time elapsed: 0.066000 sec
[junitlauncher]
[junitlauncher] Running org.apache.poi.xssf.usermodel.TestXSSFWorkbook
[junitlauncher] Tests run: 62, Failures: 0, Aborted: 0, Skipped: 0, Time elapsed: 0.709000 sec
[junitlauncher]
[junitlauncher] Running org.apache.poi.xssf.usermodel.charts.TestXDDFChartLegend
[junitlauncher] Tests run: 3, Failures: 0, Aborted: 0, Skipped: 0, Time elapsed: 0.013000 sec
[junitlauncher]
[junitlauncher] Running org.apache.poi.xssf.usermodel.charts.TestXDDFManualLayout
[junitlauncher] Tests run: 2, Failures: 0, Aborted: 0, Skipped: 0, Time elapsed: 0.012000 sec
[junitlauncher]
[junitlauncher] Running org.apache.poi.xssf.usermodel.charts.TestXSSF3DChartData
[junitlauncher] Tests run: 1, Failures: 0, Aborted: 0, Skipped: 0, Time elapsed: 0.026000 sec
[junitlauncher]
[junitlauncher] Running org.apache.poi.xssf.usermodel.charts.TestXSSFCategoryAxis
[junitlauncher] Tests run: 1, Failures: 0, Aborted: 0, Skipped: 0, Time elapsed: 0.007000 sec
[junitlauncher]
[junitlauncher] Running org.apache.poi.xssf.usermodel.charts.TestXSSFChartAxis
[junitlauncher] Tests run: 8, Failures: 0, Aborted: 0, Skipped: 0, Time elapsed: 0.044000 sec
[junitlauncher]
[junitlauncher] Running org.apache.poi.xssf.usermodel.charts.TestXSSFChartTitle
[junitlauncher] Tests run: 6, Failures: 0, Aborted: 0, Skipped: 0, Time elapsed: 0.057000 sec
[junitlauncher]
[junitlauncher] Running org.apache.poi.xssf.usermodel.charts.TestXSSFDateAxis
[junitlauncher] Tests run: 1, Failures: 0, Aborted: 0, Skipped: 0, Time elapsed: 0.014000 sec
[junitlauncher]
[junitlauncher] Running org.apache.poi.xssf.usermodel.charts.TestXSSFLineChartData
[junitlauncher] Tests run: 1, Failures: 0, Aborted: 0, Skipped: 0, Time elapsed: 0.008000 sec
[junitlauncher]
[junitlauncher] Running org.apache.poi.xssf.usermodel.charts.TestXSSFScatterChartData
[junitlauncher] Tests run: 1, Failures: 0, Aborted: 0, Skipped: 0, Time elapsed: 0.008000 sec
[junitlauncher]
[junitlauncher] Running org.apache.poi.xssf.usermodel.charts.TestXSSFValueAxis
[junitlauncher] Tests run: 1, Failures: 0, Aborted: 0, Skipped: 0, Time elapsed: 0.004000 sec
[junitlauncher]
[junitlauncher] Running org.apache.poi.xssf.usermodel.extensions.TestXSSFBorder
[junitlauncher] Tests run: 1, Failures: 0, Aborted: 0, Skipped: 0, Time elapsed: 0.003000 sec
[junitlauncher]
[junitlauncher] Running org.apache.poi.xssf.usermodel.extensions.TestXSSFCellFill
[junitlauncher] Tests run: 6, Failures: 0, Aborted: 0, Skipped: 0, Time elapsed: 0.043000 sec
[junitlauncher]
[junitlauncher] Running org.apache.poi.xssf.usermodel.extensions.TestXSSFHeaderFooter
[junitlauncher] Tests run: 10, Failures: 0, Aborted: 0, Skipped: 0, Time elapsed: 0.022000 sec
[junitlauncher]
[junitlauncher] Running org.apache.poi.xssf.usermodel.helpers.TestColumnHelper
[junitlauncher] Tests run: 16, Failures: 0, Aborted: 0, Skipped: 0, Time elapsed: 0.027000 sec
[junitlauncher]
[junitlauncher] Running org.apache.poi.xssf.usermodel.helpers.TestHeaderFooterHelper
[junitlauncher] Tests run: 2, Failures: 0, Aborted: 0, Skipped: 0, Time elapsed: 0.001000 sec
[junitlauncher]
[junitlauncher] Running org.apache.poi.xssf.usermodel.helpers.TestXSSFColumnShifting
[junitlauncher] Tests run: 2, Failures: 0, Aborted: 0, Skipped: 0, Time elapsed: 0.003000 sec
[junitlauncher]
[junitlauncher] Running org.apache.poi.xssf.util.TestCTColComparator
[junitlauncher] Tests run: 2, Failures: 0, Aborted: 0, Skipped: 0, Time elapsed: 0.001000 sec
[junitlauncher]
[junitlauncher] Running org.apache.poi.xssf.util.TestEvilUnclosedBRFixingInputStream
[junitlauncher] Tests run: 3, Failures: 0, Aborted: 0, Skipped: 0, Time elapsed: 0.001000 sec
[junitlauncher]
[junitlauncher] Running org.apache.poi.xssf.util.TestNumericRanges
[junitlauncher] Tests run: 2, Failures: 0, Aborted: 0, Skipped: 0, Time elapsed: 0.001000 sec
[junitlauncher]
[junitlauncher] Running org.apache.poi.xwpf.TestAllExtendedProperties
[junitlauncher] Tests run: 1, Failures: 0, Aborted: 0, Skipped: 0, Time elapsed: 0.045000 sec
[junitlauncher]
[junitlauncher] Running org.apache.poi.xwpf.TestDocumentProtection
[junitlauncher] Tests run: 10, Failures: 0, Aborted: 0, Skipped: 0, Time elapsed: 0.412000 sec
[junitlauncher]
[junitlauncher] Running org.apache.poi.xwpf.TestNecessaryOOXMLClasses
[junitlauncher] Tests run: 1, Failures: 0, Aborted: 0, Skipped: 0, Time elapsed: 0.011000 sec
[junitlauncher]
[junitlauncher] Running org.apache.poi.xwpf.TestPackageCorePropertiesGetKeywords
[junitlauncher] Tests run: 1, Failures: 0, Aborted: 0, Skipped: 0, Time elapsed: 0.023000 sec
[junitlauncher]
[junitlauncher] Running org.apache.poi.xwpf.TestXWPFBugs
[junitlauncher] Tests run: 4, Failures: 0, Aborted: 0, Skipped: 0, Time elapsed: 0.289000 sec
[junitlauncher]
[junitlauncher] Running org.apache.poi.xwpf.extractor.TestExternalEntities
[junitlauncher] Tests run: 1, Failures: 0, Aborted: 0, Skipped: 0, Time elapsed: 0.025000 sec
[junitlauncher]
[junitlauncher] Running org.apache.poi.xwpf.extractor.TestXWPFWordExtractor
[junitlauncher] Tests run: 24, Failures: 0, Aborted: 0, Skipped: 0, Time elapsed: 0.552000 sec
[junitlauncher]
[junitlauncher] Running org.apache.poi.xwpf.model.TestXWPFDecorators
[junitlauncher] Tests run: 2, Failures: 0, Aborted: 0, Skipped: 0, Time elapsed: 0.051000 sec
[junitlauncher]
[junitlauncher] Running org.apache.poi.xwpf.model.TestXWPFHeaderFooterPolicy
[junitlauncher] Tests run: 3, Failures: 0, Aborted: 0, Skipped: 0, Time elapsed: 0.115000 sec
[junitlauncher]
[junitlauncher] Running org.apache.poi.xwpf.usermodel.TestChangeTracking
[junitlauncher] Tests run: 3, Failures: 0, Aborted: 0, Skipped: 0, Time elapsed: 0.019000 sec
[junitlauncher]
[junitlauncher] Running org.apache.poi.xwpf.usermodel.TestColumn
[junitlauncher] Tests run: 4, Failures: 0, Aborted: 0, Skipped: 0, Time elapsed: 0.053000 sec
[junitlauncher]
[junitlauncher] Running org.apache.poi.xwpf.usermodel.TestXWPFAbstractNum
[junitlauncher] Tests run: 1, Failures: 0, Aborted: 0, Skipped: 0, Time elapsed: 0.000000 sec
[junitlauncher]
[junitlauncher] Running org.apache.poi.xwpf.usermodel.TestXWPFBugs
[junitlauncher] Tests run: 10, Failures: 0, Aborted: 0, Skipped: 0, Time elapsed: 0.176000 sec
[junitlauncher]
[junitlauncher] Running org.apache.poi.xwpf.usermodel.TestXWPFChart
[junitlauncher] Tests run: 4, Failures: 0, Aborted: 0, Skipped: 0, Time elapsed: 0.053000 sec
[junitlauncher]
[junitlauncher] Running org.apache.poi.xwpf.usermodel.TestXWPFComment
[junitlauncher] Tests run: 1, Failures: 0, Aborted: 0, Skipped: 0, Time elapsed: 0.007000 sec
[junitlauncher]
[junitlauncher] Running org.apache.poi.xwpf.usermodel.TestXWPFDocument
[junitlauncher] Tests run: 21, Failures: 0, Aborted: 0, Skipped: 1, Time elapsed: 0.269000 sec
[junitlauncher]
[junitlauncher] Running org.apache.poi.xwpf.usermodel.TestXWPFEndnote
[junitlauncher] Tests run: 4, Failures: 0, Aborted: 0, Skipped: 0, Time elapsed: 0.014000 sec
[junitlauncher]
[junitlauncher] Running org.apache.poi.xwpf.usermodel.TestXWPFEndnotes
[junitlauncher] Tests run: 2, Failures: 0, Aborted: 0, Skipped: 0, Time elapsed: 0.013000 sec
[junitlauncher]
[junitlauncher] Running org.apache.poi.xwpf.usermodel.TestXWPFFootnote
[junitlauncher] Tests run: 4, Failures: 0, Aborted: 0, Skipped: 0, Time elapsed: 0.016000 sec
[junitlauncher]
[junitlauncher] Running org.apache.poi.xwpf.usermodel.TestXWPFFootnotes
[junitlauncher] Tests run: 3, Failures: 0, Aborted: 0, Skipped: 0, Time elapsed: 0.021000 sec
[junitlauncher]
[junitlauncher] Running org.apache.poi.xwpf.usermodel.TestXWPFHeader
[junitlauncher] Tests run: 6, Failures: 0, Aborted: 0, Skipped: 0, Time elapsed: 0.074000 sec
[junitlauncher]
[junitlauncher] Running org.apache.poi.xwpf.usermodel.TestXWPFHeadings
[junitlauncher] Tests run: 1, Failures: 0, Aborted: 0, Skipped: 0, Time elapsed: 0.044000 sec
[junitlauncher]
[junitlauncher] Running org.apache.poi.xwpf.usermodel.TestXWPFNumbering
[junitlauncher] Tests run: 8, Failures: 0, Aborted: 0, Skipped: 0, Time elapsed: 0.062000 sec
[junitlauncher]
[junitlauncher] Running org.apache.poi.xwpf.usermodel.TestXWPFParagraph
[junitlauncher] Tests run: 29, Failures: 0, Aborted: 0, Skipped: 0, Time elapsed: 0.141000 sec
[junitlauncher]
[junitlauncher] Running org.apache.poi.xwpf.usermodel.TestXWPFPictureData
[junitlauncher] Tests run: 5, Failures: 0, Aborted: 0, Skipped: 0, Time elapsed: 0.114000 sec
[junitlauncher]
[junitlauncher] Running org.apache.poi.xwpf.usermodel.TestXWPFRun
[junitlauncher] Tests run: 34, Failures: 0, Aborted: 0, Skipped: 0, Time elapsed: 0.142000 sec
[junitlauncher]
[junitlauncher] Running org.apache.poi.xwpf.usermodel.TestXWPFSDT
[junitlauncher] Tests run: 7, Failures: 0, Aborted: 0, Skipped: 0, Time elapsed: 0.078000 sec
[junitlauncher]
[junitlauncher] Running org.apache.poi.xwpf.usermodel.TestXWPFSmartTag
[junitlauncher] Tests run: 1, Failures: 0, Aborted: 0, Skipped: 0, Time elapsed: 0.006000 sec
[junitlauncher]
[junitlauncher] Running org.apache.poi.xwpf.usermodel.TestXWPFStyles
[junitlauncher] Tests run: 10, Failures: 0, Aborted: 0, Skipped: 0, Time elapsed: 0.092000 sec
[junitlauncher]
[junitlauncher] Running org.apache.poi.xwpf.usermodel.TestXWPFTable
[junitlauncher] Tests run: 17, Failures: 0, Aborted: 0, Skipped: 0, Time elapsed: 0.078000 sec
[junitlauncher]
[junitlauncher] Running org.apache.poi.xwpf.usermodel.TestXWPFTableCell
[junitlauncher] Tests run: 11, Failures: 0, Aborted: 0, Skipped: 1, Time elapsed: 0.039000 sec
[junitlauncher]
[junitlauncher] Running org.apache.poi.xwpf.usermodel.TestXWPFTableRow
[junitlauncher] Tests run: 8, Failures: 0, Aborted: 0, Skipped: 0, Time elapsed: 0.029000 sec

-test-ooxml-write-testfile:

compile-ooxml-lite:
     [echo] Create ooxml-lite schemas
    [javac] Compiling 1 source file to <https://ci-builds.apache.org/job/POI/job/POI-DSL-1.15/ws/src/multimodule/ooxml-lite/java9>
    [javac] <https://ci-builds.apache.org/job/POI/job/POI-DSL-1.15/ws/src/multimodule/ooxml-lite/java9/module-info.java>:22: warning: requires transitive directive for an automatic module
    [javac]     requires transitive org.apache.xmlbeans;
    [javac]                                   ^
    [javac] 1 warning
     [copy] Copying 1 file to <https://ci-builds.apache.org/job/POI/job/POI-DSL-1.15/ws/build>
     [copy] Copying 1 file to <https://ci-builds.apache.org/job/POI/job/POI-DSL-1.15/ws/build>
     [copy] Copying 1 file to <https://ci-builds.apache.org/job/POI/job/POI-DSL-1.15/ws/build>
    [mkdir] Created dir: <https://ci-builds.apache.org/job/POI/job/POI-DSL-1.15/ws/build/dist/maven/poi-ooxml-lite>
      [jar] Building jar: <https://ci-builds.apache.org/job/POI/job/POI-DSL-1.15/ws/build/dist/maven/poi-ooxml-lite/poi-ooxml-lite-5.0.1-SNAPSHOT.jar>

-test-excelant-check:

test-excelant:
[junitlauncher]
[junitlauncher] Running org.apache.poi.ss.excelant.TestBuildFile
[junitlauncher] Tests run: 14, Failures: 0, Aborted: 0, Skipped: 0, Time elapsed: 2.940000 sec
[junitlauncher]
[junitlauncher] Running org.apache.poi.ss.excelant.TestExcelAntPrecision
[junitlauncher] Tests run: 1, Failures: 0, Aborted: 0, Skipped: 0, Time elapsed: 0.003000 sec
[junitlauncher]
[junitlauncher] Running org.apache.poi.ss.excelant.TestExcelAntSet
[junitlauncher] Tests run: 2, Failures: 0, Aborted: 0, Skipped: 0, Time elapsed: 0.021000 sec
[junitlauncher]
[junitlauncher] Running org.apache.poi.ss.excelant.TestExcelAntSetDoubleCell
[junitlauncher] Tests run: 1, Failures: 0, Aborted: 0, Skipped: 0, Time elapsed: 0.002000 sec
[junitlauncher]
[junitlauncher] Running org.apache.poi.ss.excelant.TestExcelAntUserDefinedFunction
[junitlauncher] Tests run: 2, Failures: 0, Aborted: 0, Skipped: 0, Time elapsed: 0.002000 sec
[junitlauncher]
[junitlauncher] Running org.apache.poi.ss.excelant.util.TestExcelAntEvaluationResult
[junitlauncher] Tests run: 4, Failures: 0, Aborted: 0, Skipped: 0, Time elapsed: 0.005000 sec
[junitlauncher]
[junitlauncher] Running org.apache.poi.ss.excelant.util.TestExcelAntWorkbookUtil
[junitlauncher] Tests run: 23, Failures: 0, Aborted: 0, Skipped: 0, Time elapsed: 1.108000 sec
[junitlauncher]
[junitlauncher] Running org.apache.poi.ss.excelant.util.TestExcelAntWorkbookUtilFactory
[junitlauncher] Tests run: 2, Failures: 0, Aborted: 0, Skipped: 0, Time elapsed: 0.002000 sec

-test-excelant-write-testfile:

test:

compile-integration:
    [javac] Compiling 28 source files to <https://ci-builds.apache.org/job/POI/job/POI-DSL-1.15/ws/build/integration-test-classes>
    [javac] Ignoring source, target and bootclasspath as release has been set
    [mkdir] Created dir: <https://ci-builds.apache.org/job/POI/job/POI-DSL-1.15/ws/build/integration-test-classes/META-INF/versions/9>
    [javac] Compiling 1 source file to <https://ci-builds.apache.org/job/POI/job/POI-DSL-1.15/ws/build/integration-test-classes/META-INF/versions/9>
      [jar] Building jar: <https://ci-builds.apache.org/job/POI/job/POI-DSL-1.15/ws/build/dist/maven/poi-integration/poi-integration-5.0.1-SNAPSHOT.jar>

-test-integration-check:

test-integration:
[junitlauncher]
[junitlauncher] Running org.apache.poi.stress.TestAllFiles
[junitlauncher]    Failed: #1304 spreadsheet/44958.xls HSSF
[junitlauncher]    Failed: #1305 spreadsheet/44958.xls HPSF
[junitlauncher]    Failed: #1793 spreadsheet/59074.xls HSSF
[junitlauncher]    Failed: #1794 spreadsheet/59074.xls HPSF
[junitlauncher]    Failed: #1868 spreadsheet/64130.xls HSSF
[junitlauncher]    Failed: #1869 spreadsheet/64130.xls HPSF
[junitlauncher]    Failed: #1304 spreadsheet/44958.xls HSSF
[junitlauncher]    Failed: #2467 spreadsheet/testArraysAndTables.xls HSSF
[junitlauncher]    Failed: #2473 spreadsheet/testEXCEL_5.xls HSSF
[junitlauncher]    Failed: #2476 spreadsheet/testEXCEL_95.xls HPSF
[junitlauncher]    Failed: #2468 spreadsheet/testArraysAndTables.xls HPSF
[junitlauncher]    Failed: #2474 spreadsheet/testEXCEL_5.xls HPSF
[junitlauncher]    Failed: #2475 spreadsheet/testEXCEL_95.xls HSSF
[junitlauncher]    Failed: #1683 spreadsheet/56450.xls HSSF
[junitlauncher] Tests run: 7677, Failures: 14, Aborted: 0, Skipped: 0, Time elapsed: 212.380000 sec

BUILD FAILED
<https://ci-builds.apache.org/job/POI/job/POI-DSL-1.15/ws/build.xml>:1704: The following error occurred while executing this line:
<https://ci-builds.apache.org/job/POI/job/POI-DSL-1.15/ws/build.xml>:1254: Some test(s) have failure(s)

Total time: 16 minutes 7 seconds
Build step 'Invoke Ant' marked build as failure
[SpotBugs] Skipping execution of recorder since overall result is 'FAILURE'
Archiving artifacts
[Fast Archiver] Compressed 7.61 MB of artifacts by 40.2% relative to #27
Skipping publisher since build result is FAILURE
Recording test results

---------------------------------------------------------------------
To unsubscribe, e-mail: [hidden email]
For additional commands, e-mail: [hidden email]

Reply | Threaded
Open this post in threaded view
|

Build failed in Jenkins: POI » POI-DSL-1.15 #30

Apache Jenkins Server
See <https://ci-builds.apache.org/job/POI/job/POI-DSL-1.15/30/display/redirect?page=changes>

Changes:

[Andreas Beeker] Sonar fixes
add asserts to tests

[Dominik Stadler] Bug 65099: Fix incorrect handling of styles in XWPFStyle.getUsedStyleList

Closes github #216

[Dominik Stadler] Adjust integration-test slightly for running mass-regression-tests

[Dominik Stadler] Apply IDE suggestions, add toString(), adjust JavaDoc and simplify code slightly

[Dominik Stadler] Enable storing an SXSSF workbook twice

Verify this via a unit-test for all types of workbooks
Add a test to verify the contents is byte-for-byte equal
Also remove an overwritten test which works the same now for all three workbook-types

[Andreas Beeker] Sonar fixes
add asserts to tests

[Andreas Beeker] Sonar fixes
add asserts to tests

[Andreas Beeker] try to fix windows integration tests


------------------------------------------
[...truncated 186.99 KB...]
[junitlauncher] Running org.apache.poi.xssf.usermodel.TestXSSFTextRun
[junitlauncher] Tests run: 1, Failures: 0, Aborted: 0, Skipped: 0, Time elapsed: 0.009000 sec
[junitlauncher]
[junitlauncher] Running org.apache.poi.xssf.usermodel.TestXSSFUnicodeSurrogates
[junitlauncher] Tests run: 1, Failures: 0, Aborted: 0, Skipped: 0, Time elapsed: 0.012000 sec
[junitlauncher]
[junitlauncher] Running org.apache.poi.xssf.usermodel.TestXSSFVMLDrawing
[junitlauncher] Tests run: 5, Failures: 0, Aborted: 0, Skipped: 0, Time elapsed: 0.061000 sec
[junitlauncher]
[junitlauncher] Running org.apache.poi.xssf.usermodel.TestXSSFWorkbook
[junitlauncher] Tests run: 62, Failures: 0, Aborted: 0, Skipped: 0, Time elapsed: 0.588000 sec
[junitlauncher]
[junitlauncher] Running org.apache.poi.xssf.usermodel.charts.TestXDDFChartLegend
[junitlauncher] Tests run: 3, Failures: 0, Aborted: 0, Skipped: 0, Time elapsed: 0.013000 sec
[junitlauncher]
[junitlauncher] Running org.apache.poi.xssf.usermodel.charts.TestXDDFManualLayout
[junitlauncher] Tests run: 2, Failures: 0, Aborted: 0, Skipped: 0, Time elapsed: 0.012000 sec
[junitlauncher]
[junitlauncher] Running org.apache.poi.xssf.usermodel.charts.TestXSSF3DChartData
[junitlauncher] Tests run: 1, Failures: 0, Aborted: 0, Skipped: 0, Time elapsed: 0.026000 sec
[junitlauncher]
[junitlauncher] Running org.apache.poi.xssf.usermodel.charts.TestXSSFCategoryAxis
[junitlauncher] Tests run: 1, Failures: 0, Aborted: 0, Skipped: 0, Time elapsed: 0.003000 sec
[junitlauncher]
[junitlauncher] Running org.apache.poi.xssf.usermodel.charts.TestXSSFChartAxis
[junitlauncher] Tests run: 8, Failures: 0, Aborted: 0, Skipped: 0, Time elapsed: 0.031000 sec
[junitlauncher]
[junitlauncher] Running org.apache.poi.xssf.usermodel.charts.TestXSSFChartTitle
[junitlauncher] Tests run: 6, Failures: 0, Aborted: 0, Skipped: 0, Time elapsed: 0.036000 sec
[junitlauncher]
[junitlauncher] Running org.apache.poi.xssf.usermodel.charts.TestXSSFDateAxis
[junitlauncher] Tests run: 1, Failures: 0, Aborted: 0, Skipped: 0, Time elapsed: 0.015000 sec
[junitlauncher]
[junitlauncher] Running org.apache.poi.xssf.usermodel.charts.TestXSSFLineChartData
[junitlauncher] Tests run: 1, Failures: 0, Aborted: 0, Skipped: 0, Time elapsed: 0.007000 sec
[junitlauncher]
[junitlauncher] Running org.apache.poi.xssf.usermodel.charts.TestXSSFScatterChartData
[junitlauncher] Tests run: 1, Failures: 0, Aborted: 0, Skipped: 0, Time elapsed: 0.008000 sec
[junitlauncher]
[junitlauncher] Running org.apache.poi.xssf.usermodel.charts.TestXSSFValueAxis
[junitlauncher] Tests run: 1, Failures: 0, Aborted: 0, Skipped: 0, Time elapsed: 0.004000 sec
[junitlauncher]
[junitlauncher] Running org.apache.poi.xssf.usermodel.extensions.TestXSSFBorder
[junitlauncher] Tests run: 1, Failures: 0, Aborted: 0, Skipped: 0, Time elapsed: 0.002000 sec
[junitlauncher]
[junitlauncher] Running org.apache.poi.xssf.usermodel.extensions.TestXSSFCellFill
[junitlauncher] Tests run: 6, Failures: 0, Aborted: 0, Skipped: 0, Time elapsed: 0.022000 sec
[junitlauncher]
[junitlauncher] Running org.apache.poi.xssf.usermodel.extensions.TestXSSFHeaderFooter
[junitlauncher] Tests run: 10, Failures: 0, Aborted: 0, Skipped: 0, Time elapsed: 0.027000 sec
[junitlauncher]
[junitlauncher] Running org.apache.poi.xssf.usermodel.helpers.TestColumnHelper
[junitlauncher] Tests run: 16, Failures: 0, Aborted: 0, Skipped: 0, Time elapsed: 0.026000 sec
[junitlauncher]
[junitlauncher] Running org.apache.poi.xssf.usermodel.helpers.TestHeaderFooterHelper
[junitlauncher] Tests run: 2, Failures: 0, Aborted: 0, Skipped: 0, Time elapsed: 0.000000 sec
[junitlauncher]
[junitlauncher] Running org.apache.poi.xssf.usermodel.helpers.TestXSSFColumnShifting
[junitlauncher] Tests run: 2, Failures: 0, Aborted: 0, Skipped: 0, Time elapsed: 0.004000 sec
[junitlauncher]
[junitlauncher] Running org.apache.poi.xssf.util.TestCTColComparator
[junitlauncher] Tests run: 2, Failures: 0, Aborted: 0, Skipped: 0, Time elapsed: 0.001000 sec
[junitlauncher]
[junitlauncher] Running org.apache.poi.xssf.util.TestEvilUnclosedBRFixingInputStream
[junitlauncher] Tests run: 3, Failures: 0, Aborted: 0, Skipped: 0, Time elapsed: 0.002000 sec
[junitlauncher]
[junitlauncher] Running org.apache.poi.xssf.util.TestNumericRanges
[junitlauncher] Tests run: 2, Failures: 0, Aborted: 0, Skipped: 0, Time elapsed: 0.000000 sec
[junitlauncher]
[junitlauncher] Running org.apache.poi.xwpf.TestAllExtendedProperties
[junitlauncher] Tests run: 1, Failures: 0, Aborted: 0, Skipped: 0, Time elapsed: 0.031000 sec
[junitlauncher]
[junitlauncher] Running org.apache.poi.xwpf.TestDocumentProtection
[junitlauncher] Tests run: 10, Failures: 0, Aborted: 0, Skipped: 0, Time elapsed: 0.378000 sec
[junitlauncher]
[junitlauncher] Running org.apache.poi.xwpf.TestNecessaryOOXMLClasses
[junitlauncher] Tests run: 1, Failures: 0, Aborted: 0, Skipped: 0, Time elapsed: 0.013000 sec
[junitlauncher]
[junitlauncher] Running org.apache.poi.xwpf.TestPackageCorePropertiesGetKeywords
[junitlauncher] Tests run: 1, Failures: 0, Aborted: 0, Skipped: 0, Time elapsed: 0.019000 sec
[junitlauncher]
[junitlauncher] Running org.apache.poi.xwpf.TestXWPFBugs
[junitlauncher] Tests run: 4, Failures: 0, Aborted: 0, Skipped: 0, Time elapsed: 0.268000 sec
[junitlauncher]
[junitlauncher] Running org.apache.poi.xwpf.extractor.TestExternalEntities
[junitlauncher] Tests run: 1, Failures: 0, Aborted: 0, Skipped: 0, Time elapsed: 0.015000 sec
[junitlauncher]
[junitlauncher] Running org.apache.poi.xwpf.extractor.TestXWPFWordExtractor
[junitlauncher] Tests run: 24, Failures: 0, Aborted: 0, Skipped: 0, Time elapsed: 0.471000 sec
[junitlauncher]
[junitlauncher] Running org.apache.poi.xwpf.model.TestXWPFDecorators
[junitlauncher] Tests run: 2, Failures: 0, Aborted: 0, Skipped: 0, Time elapsed: 0.044000 sec
[junitlauncher]
[junitlauncher] Running org.apache.poi.xwpf.model.TestXWPFHeaderFooterPolicy
[junitlauncher] Tests run: 3, Failures: 0, Aborted: 0, Skipped: 0, Time elapsed: 0.109000 sec
[junitlauncher]
[junitlauncher] Running org.apache.poi.xwpf.usermodel.TestChangeTracking
[junitlauncher] Tests run: 3, Failures: 0, Aborted: 0, Skipped: 0, Time elapsed: 0.016000 sec
[junitlauncher]
[junitlauncher] Running org.apache.poi.xwpf.usermodel.TestColumn
[junitlauncher] Tests run: 4, Failures: 0, Aborted: 0, Skipped: 0, Time elapsed: 0.038000 sec
[junitlauncher]
[junitlauncher] Running org.apache.poi.xwpf.usermodel.TestXWPFAbstractNum
[junitlauncher] Tests run: 1, Failures: 0, Aborted: 0, Skipped: 0, Time elapsed: 0.000000 sec
[junitlauncher]
[junitlauncher] Running org.apache.poi.xwpf.usermodel.TestXWPFBugs
[junitlauncher] Tests run: 11, Failures: 0, Aborted: 0, Skipped: 0, Time elapsed: 0.184000 sec
[junitlauncher]
[junitlauncher] Running org.apache.poi.xwpf.usermodel.TestXWPFChart
[junitlauncher] Tests run: 4, Failures: 0, Aborted: 0, Skipped: 0, Time elapsed: 0.044000 sec
[junitlauncher]
[junitlauncher] Running org.apache.poi.xwpf.usermodel.TestXWPFComment
[junitlauncher] Tests run: 1, Failures: 0, Aborted: 0, Skipped: 0, Time elapsed: 0.005000 sec
[junitlauncher]
[junitlauncher] Running org.apache.poi.xwpf.usermodel.TestXWPFDocument
[junitlauncher] Tests run: 21, Failures: 0, Aborted: 0, Skipped: 1, Time elapsed: 0.237000 sec
[junitlauncher]
[junitlauncher] Running org.apache.poi.xwpf.usermodel.TestXWPFEndnote
[junitlauncher] Tests run: 4, Failures: 0, Aborted: 0, Skipped: 0, Time elapsed: 0.022000 sec
[junitlauncher]
[junitlauncher] Running org.apache.poi.xwpf.usermodel.TestXWPFEndnotes
[junitlauncher] Tests run: 2, Failures: 0, Aborted: 0, Skipped: 0, Time elapsed: 0.012000 sec
[junitlauncher]
[junitlauncher] Running org.apache.poi.xwpf.usermodel.TestXWPFFootnote
[junitlauncher] Tests run: 4, Failures: 0, Aborted: 0, Skipped: 0, Time elapsed: 0.011000 sec
[junitlauncher]
[junitlauncher] Running org.apache.poi.xwpf.usermodel.TestXWPFFootnotes
[junitlauncher] Tests run: 3, Failures: 0, Aborted: 0, Skipped: 0, Time elapsed: 0.019000 sec
[junitlauncher]
[junitlauncher] Running org.apache.poi.xwpf.usermodel.TestXWPFHeader
[junitlauncher] Tests run: 6, Failures: 0, Aborted: 0, Skipped: 0, Time elapsed: 0.076000 sec
[junitlauncher]
[junitlauncher] Running org.apache.poi.xwpf.usermodel.TestXWPFHeadings
[junitlauncher] Tests run: 1, Failures: 0, Aborted: 0, Skipped: 0, Time elapsed: 0.054000 sec
[junitlauncher]
[junitlauncher] Running org.apache.poi.xwpf.usermodel.TestXWPFNumbering
[junitlauncher] Tests run: 8, Failures: 0, Aborted: 0, Skipped: 0, Time elapsed: 0.064000 sec
[junitlauncher]
[junitlauncher] Running org.apache.poi.xwpf.usermodel.TestXWPFParagraph
[junitlauncher] Tests run: 29, Failures: 0, Aborted: 0, Skipped: 0, Time elapsed: 0.126000 sec
[junitlauncher]
[junitlauncher] Running org.apache.poi.xwpf.usermodel.TestXWPFPictureData
[junitlauncher] Tests run: 5, Failures: 0, Aborted: 0, Skipped: 0, Time elapsed: 0.103000 sec
[junitlauncher]
[junitlauncher] Running org.apache.poi.xwpf.usermodel.TestXWPFRun
[junitlauncher] Tests run: 34, Failures: 0, Aborted: 0, Skipped: 0, Time elapsed: 0.168000 sec
[junitlauncher]
[junitlauncher] Running org.apache.poi.xwpf.usermodel.TestXWPFSDT
[junitlauncher] Tests run: 7, Failures: 0, Aborted: 0, Skipped: 0, Time elapsed: 0.091000 sec
[junitlauncher]
[junitlauncher] Running org.apache.poi.xwpf.usermodel.TestXWPFSmartTag
[junitlauncher] Tests run: 1, Failures: 0, Aborted: 0, Skipped: 0, Time elapsed: 0.007000 sec
[junitlauncher]
[junitlauncher] Running org.apache.poi.xwpf.usermodel.TestXWPFStyles
[junitlauncher] Tests run: 10, Failures: 0, Aborted: 0, Skipped: 0, Time elapsed: 0.076000 sec
[junitlauncher]
[junitlauncher] Running org.apache.poi.xwpf.usermodel.TestXWPFTable
[junitlauncher] Tests run: 17, Failures: 0, Aborted: 0, Skipped: 0, Time elapsed: 0.073000 sec
[junitlauncher]
[junitlauncher] Running org.apache.poi.xwpf.usermodel.TestXWPFTableCell
[junitlauncher] Tests run: 11, Failures: 0, Aborted: 0, Skipped: 0, Time elapsed: 0.047000 sec
[junitlauncher]
[junitlauncher] Running org.apache.poi.xwpf.usermodel.TestXWPFTableRow
[junitlauncher] Tests run: 8, Failures: 0, Aborted: 0, Skipped: 0, Time elapsed: 0.031000 sec

-test-ooxml-write-testfile:

compile-ooxml-lite:
     [echo] Create ooxml-lite schemas
    [javac] Compiling 1 source file to <https://ci-builds.apache.org/job/POI/job/POI-DSL-1.15/ws/src/multimodule/ooxml-lite/java9>
    [javac] <https://ci-builds.apache.org/job/POI/job/POI-DSL-1.15/ws/src/multimodule/ooxml-lite/java9/module-info.java>:22: warning: requires transitive directive for an automatic module
    [javac]     requires transitive org.apache.xmlbeans;
    [javac]                                   ^
    [javac] 1 warning
     [copy] Copying 1 file to <https://ci-builds.apache.org/job/POI/job/POI-DSL-1.15/ws/build>
     [copy] Copying 1 file to <https://ci-builds.apache.org/job/POI/job/POI-DSL-1.15/ws/build>
     [copy] Copying 1 file to <https://ci-builds.apache.org/job/POI/job/POI-DSL-1.15/ws/build>
    [mkdir] Created dir: <https://ci-builds.apache.org/job/POI/job/POI-DSL-1.15/ws/build/dist/maven/poi-ooxml-lite>
      [jar] Building jar: <https://ci-builds.apache.org/job/POI/job/POI-DSL-1.15/ws/build/dist/maven/poi-ooxml-lite/poi-ooxml-lite-5.0.1-SNAPSHOT.jar>

-test-excelant-check:

test-excelant:
[junitlauncher]
[junitlauncher] Running org.apache.poi.ss.excelant.TestBuildFile
[junitlauncher] Tests run: 14, Failures: 0, Aborted: 0, Skipped: 0, Time elapsed: 2.865000 sec
[junitlauncher]
[junitlauncher] Running org.apache.poi.ss.excelant.TestExcelAntPrecision
[junitlauncher] Tests run: 1, Failures: 0, Aborted: 0, Skipped: 0, Time elapsed: 0.004000 sec
[junitlauncher]
[junitlauncher] Running org.apache.poi.ss.excelant.TestExcelAntSet
[junitlauncher] Tests run: 2, Failures: 0, Aborted: 0, Skipped: 0, Time elapsed: 0.016000 sec
[junitlauncher]
[junitlauncher] Running org.apache.poi.ss.excelant.TestExcelAntSetDoubleCell
[junitlauncher] Tests run: 1, Failures: 0, Aborted: 0, Skipped: 0, Time elapsed: 0.002000 sec
[junitlauncher]
[junitlauncher] Running org.apache.poi.ss.excelant.TestExcelAntUserDefinedFunction
[junitlauncher] Tests run: 2, Failures: 0, Aborted: 0, Skipped: 0, Time elapsed: 0.002000 sec
[junitlauncher]
[junitlauncher] Running org.apache.poi.ss.excelant.util.TestExcelAntEvaluationResult
[junitlauncher] Tests run: 4, Failures: 0, Aborted: 0, Skipped: 0, Time elapsed: 0.005000 sec
[junitlauncher]
[junitlauncher] Running org.apache.poi.ss.excelant.util.TestExcelAntWorkbookUtil
[junitlauncher] Tests run: 23, Failures: 0, Aborted: 0, Skipped: 0, Time elapsed: 1.012000 sec
[junitlauncher]
[junitlauncher] Running org.apache.poi.ss.excelant.util.TestExcelAntWorkbookUtilFactory
[junitlauncher] Tests run: 2, Failures: 0, Aborted: 0, Skipped: 0, Time elapsed: 0.002000 sec

-test-excelant-write-testfile:

test:

compile-integration:
    [javac] Compiling 28 source files to <https://ci-builds.apache.org/job/POI/job/POI-DSL-1.15/ws/build/integration-test-classes>
    [javac] Ignoring source, target and bootclasspath as release has been set
    [mkdir] Created dir: <https://ci-builds.apache.org/job/POI/job/POI-DSL-1.15/ws/build/integration-test-classes/META-INF/versions/9>
    [javac] Compiling 1 source file to <https://ci-builds.apache.org/job/POI/job/POI-DSL-1.15/ws/build/integration-test-classes/META-INF/versions/9>
      [jar] Building jar: <https://ci-builds.apache.org/job/POI/job/POI-DSL-1.15/ws/build/dist/maven/poi-integration/poi-integration-5.0.1-SNAPSHOT.jar>

-test-integration-check:

test-integration:
[junitlauncher]
[junitlauncher] Running org.apache.poi.stress.TestAllFiles
[junitlauncher]    Failed: #1306 spreadsheet/44958.xls HSSF
[junitlauncher]    Failed: #1307 spreadsheet/44958.xls HPSF
[junitlauncher]    Failed: #1795 spreadsheet/59074.xls HSSF
[junitlauncher]    Failed: #1796 spreadsheet/59074.xls HPSF
[junitlauncher]    Failed: #1870 spreadsheet/64130.xls HSSF
[junitlauncher]    Failed: #1871 spreadsheet/64130.xls HPSF
[junitlauncher]    Failed: #1306 spreadsheet/44958.xls HSSF
[junitlauncher]    Failed: #2475 spreadsheet/testEXCEL_5.xls HSSF
[junitlauncher]    Failed: #2476 spreadsheet/testEXCEL_5.xls HPSF
[junitlauncher]    Failed: #2478 spreadsheet/testEXCEL_95.xls HPSF
[junitlauncher]    Failed: #2477 spreadsheet/testEXCEL_95.xls HSSF
[junitlauncher]    Failed: #1685 spreadsheet/56450.xls HSSF
[junitlauncher] Tests run: 7683, Failures: 12, Aborted: 0, Skipped: 0, Time elapsed: 214.972000 sec

BUILD FAILED
<https://ci-builds.apache.org/job/POI/job/POI-DSL-1.15/ws/build.xml>:1704: The following error occurred while executing this line:
<https://ci-builds.apache.org/job/POI/job/POI-DSL-1.15/ws/build.xml>:1254: Some test(s) have failure(s)

Total time: 15 minutes 18 seconds
Build step 'Invoke Ant' marked build as failure
[SpotBugs] Skipping execution of recorder since overall result is 'FAILURE'
Archiving artifacts
[Fast Archiver] Compressed 7.49 MB of artifacts by 40.9% relative to #27
Skipping publisher since build result is FAILURE
Recording test results

---------------------------------------------------------------------
To unsubscribe, e-mail: [hidden email]
For additional commands, e-mail: [hidden email]

Reply | Threaded
Open this post in threaded view
|

Build failed in Jenkins: POI » POI-DSL-1.15 #31

Apache Jenkins Server
See <https://ci-builds.apache.org/job/POI/job/POI-DSL-1.15/31/display/redirect?page=changes>

Changes:

[Marius Volkhart] [github-219] Add GitHub Action to verify Gradle wrapper

Thanks to Valery Yatsynovich. This closes #219

[Marius Volkhart] Cache Gradle wrapper & caches during GitHub Actions

[Marius Volkhart] Cache Maven repo during GitHub Actions

[PJ Fanning] remove accidental commit

[PJ Fanning] [bug-65120] PartAlreadyExistsException when creating cell comments (after some comments removed). Thanks to Raúl Wegmann

[Marius Volkhart] Fix inconsistent logging statement

The conditions check for max, but the logging was copy/pasted and still uses the minimum.

[Alain Béarez] Bugfixes for XDDF charts

[Alain Béarez] Clone only content of imported chart


------------------------------------------
[...truncated 184.38 KB...]
[junitlauncher] Running org.apache.poi.xssf.usermodel.TestXSSFTextRun
[junitlauncher] Tests run: 1, Failures: 0, Aborted: 0, Skipped: 0, Time elapsed: 0.007000 sec
[junitlauncher]
[junitlauncher] Running org.apache.poi.xssf.usermodel.TestXSSFUnicodeSurrogates
[junitlauncher] Tests run: 1, Failures: 0, Aborted: 0, Skipped: 0, Time elapsed: 0.009000 sec
[junitlauncher]
[junitlauncher] Running org.apache.poi.xssf.usermodel.TestXSSFVMLDrawing
[junitlauncher] Tests run: 5, Failures: 0, Aborted: 0, Skipped: 0, Time elapsed: 0.074000 sec
[junitlauncher]
[junitlauncher] Running org.apache.poi.xssf.usermodel.TestXSSFWorkbook
[junitlauncher] Tests run: 62, Failures: 0, Aborted: 0, Skipped: 0, Time elapsed: 0.574000 sec
[junitlauncher]
[junitlauncher] Running org.apache.poi.xssf.usermodel.charts.TestXDDFChartLegend
[junitlauncher] Tests run: 3, Failures: 0, Aborted: 0, Skipped: 0, Time elapsed: 0.013000 sec
[junitlauncher]
[junitlauncher] Running org.apache.poi.xssf.usermodel.charts.TestXDDFManualLayout
[junitlauncher] Tests run: 2, Failures: 0, Aborted: 0, Skipped: 0, Time elapsed: 0.011000 sec
[junitlauncher]
[junitlauncher] Running org.apache.poi.xssf.usermodel.charts.TestXSSF3DChartData
[junitlauncher] Tests run: 1, Failures: 0, Aborted: 0, Skipped: 0, Time elapsed: 0.028000 sec
[junitlauncher]
[junitlauncher] Running org.apache.poi.xssf.usermodel.charts.TestXSSFCategoryAxis
[junitlauncher] Tests run: 1, Failures: 0, Aborted: 0, Skipped: 0, Time elapsed: 0.005000 sec
[junitlauncher]
[junitlauncher] Running org.apache.poi.xssf.usermodel.charts.TestXSSFChartAxis
[junitlauncher] Tests run: 8, Failures: 0, Aborted: 0, Skipped: 0, Time elapsed: 0.031000 sec
[junitlauncher]
[junitlauncher] Running org.apache.poi.xssf.usermodel.charts.TestXSSFChartTitle
[junitlauncher] Tests run: 6, Failures: 0, Aborted: 0, Skipped: 0, Time elapsed: 0.041000 sec
[junitlauncher]
[junitlauncher] Running org.apache.poi.xssf.usermodel.charts.TestXSSFDateAxis
[junitlauncher] Tests run: 1, Failures: 0, Aborted: 0, Skipped: 0, Time elapsed: 0.013000 sec
[junitlauncher]
[junitlauncher] Running org.apache.poi.xssf.usermodel.charts.TestXSSFLineChartData
[junitlauncher] Tests run: 1, Failures: 0, Aborted: 0, Skipped: 0, Time elapsed: 0.008000 sec
[junitlauncher]
[junitlauncher] Running org.apache.poi.xssf.usermodel.charts.TestXSSFScatterChartData
[junitlauncher] Tests run: 1, Failures: 0, Aborted: 0, Skipped: 0, Time elapsed: 0.010000 sec
[junitlauncher]
[junitlauncher] Running org.apache.poi.xssf.usermodel.charts.TestXSSFValueAxis
[junitlauncher] Tests run: 1, Failures: 0, Aborted: 0, Skipped: 0, Time elapsed: 0.005000 sec
[junitlauncher]
[junitlauncher] Running org.apache.poi.xssf.usermodel.extensions.TestXSSFBorder
[junitlauncher] Tests run: 1, Failures: 0, Aborted: 0, Skipped: 0, Time elapsed: 0.002000 sec
[junitlauncher]
[junitlauncher] Running org.apache.poi.xssf.usermodel.extensions.TestXSSFCellFill
[junitlauncher] Tests run: 6, Failures: 0, Aborted: 0, Skipped: 0, Time elapsed: 0.023000 sec
[junitlauncher]
[junitlauncher] Running org.apache.poi.xssf.usermodel.extensions.TestXSSFHeaderFooter
[junitlauncher] Tests run: 10, Failures: 0, Aborted: 0, Skipped: 0, Time elapsed: 0.025000 sec
[junitlauncher]
[junitlauncher] Running org.apache.poi.xssf.usermodel.helpers.TestColumnHelper
[junitlauncher] Tests run: 16, Failures: 0, Aborted: 0, Skipped: 0, Time elapsed: 0.029000 sec
[junitlauncher]
[junitlauncher] Running org.apache.poi.xssf.usermodel.helpers.TestHeaderFooterHelper
[junitlauncher] Tests run: 2, Failures: 0, Aborted: 0, Skipped: 0, Time elapsed: 0.001000 sec
[junitlauncher]
[junitlauncher] Running org.apache.poi.xssf.usermodel.helpers.TestXSSFColumnShifting
[junitlauncher] Tests run: 2, Failures: 0, Aborted: 0, Skipped: 0, Time elapsed: 0.005000 sec
[junitlauncher]
[junitlauncher] Running org.apache.poi.xssf.util.TestCTColComparator
[junitlauncher] Tests run: 2, Failures: 0, Aborted: 0, Skipped: 0, Time elapsed: 0.001000 sec
[junitlauncher]
[junitlauncher] Running org.apache.poi.xssf.util.TestEvilUnclosedBRFixingInputStream
[junitlauncher] Tests run: 3, Failures: 0, Aborted: 0, Skipped: 0, Time elapsed: 0.001000 sec
[junitlauncher]
[junitlauncher] Running org.apache.poi.xssf.util.TestNumericRanges
[junitlauncher] Tests run: 2, Failures: 0, Aborted: 0, Skipped: 0, Time elapsed: 0.000000 sec
[junitlauncher]
[junitlauncher] Running org.apache.poi.xwpf.TestAllExtendedProperties
[junitlauncher] Tests run: 1, Failures: 0, Aborted: 0, Skipped: 0, Time elapsed: 0.031000 sec
[junitlauncher]
[junitlauncher] Running org.apache.poi.xwpf.TestDocumentProtection
[junitlauncher] Tests run: 10, Failures: 0, Aborted: 0, Skipped: 0, Time elapsed: 0.410000 sec
[junitlauncher]
[junitlauncher] Running org.apache.poi.xwpf.TestNecessaryOOXMLClasses
[junitlauncher] Tests run: 1, Failures: 0, Aborted: 0, Skipped: 0, Time elapsed: 0.013000 sec
[junitlauncher]
[junitlauncher] Running org.apache.poi.xwpf.TestPackageCorePropertiesGetKeywords
[junitlauncher] Tests run: 1, Failures: 0, Aborted: 0, Skipped: 0, Time elapsed: 0.019000 sec
[junitlauncher]
[junitlauncher] Running org.apache.poi.xwpf.TestXWPFBugs
[junitlauncher] Tests run: 4, Failures: 0, Aborted: 0, Skipped: 0, Time elapsed: 0.264000 sec
[junitlauncher]
[junitlauncher] Running org.apache.poi.xwpf.extractor.TestExternalEntities
[junitlauncher] Tests run: 1, Failures: 0, Aborted: 0, Skipped: 0, Time elapsed: 0.007000 sec
[junitlauncher]
[junitlauncher] Running org.apache.poi.xwpf.extractor.TestXWPFWordExtractor
[junitlauncher] Tests run: 24, Failures: 0, Aborted: 0, Skipped: 0, Time elapsed: 0.528000 sec
[junitlauncher]
[junitlauncher] Running org.apache.poi.xwpf.model.TestXWPFDecorators
[junitlauncher] Tests run: 2, Failures: 0, Aborted: 0, Skipped: 0, Time elapsed: 0.044000 sec
[junitlauncher]
[junitlauncher] Running org.apache.poi.xwpf.model.TestXWPFHeaderFooterPolicy
[junitlauncher] Tests run: 3, Failures: 0, Aborted: 0, Skipped: 0, Time elapsed: 0.111000 sec
[junitlauncher]
[junitlauncher] Running org.apache.poi.xwpf.usermodel.TestChangeTracking
[junitlauncher] Tests run: 3, Failures: 0, Aborted: 0, Skipped: 0, Time elapsed: 0.016000 sec
[junitlauncher]
[junitlauncher] Running org.apache.poi.xwpf.usermodel.TestColumn
[junitlauncher] Tests run: 4, Failures: 0, Aborted: 0, Skipped: 0, Time elapsed: 0.055000 sec
[junitlauncher]
[junitlauncher] Running org.apache.poi.xwpf.usermodel.TestXWPFAbstractNum
[junitlauncher] Tests run: 1, Failures: 0, Aborted: 0, Skipped: 0, Time elapsed: 0.000000 sec
[junitlauncher]
[junitlauncher] Running org.apache.poi.xwpf.usermodel.TestXWPFBugs
[junitlauncher] Tests run: 11, Failures: 0, Aborted: 0, Skipped: 0, Time elapsed: 0.216000 sec
[junitlauncher]
[junitlauncher] Running org.apache.poi.xwpf.usermodel.TestXWPFChart
[junitlauncher] Tests run: 4, Failures: 0, Aborted: 0, Skipped: 0, Time elapsed: 0.033000 sec
[junitlauncher]
[junitlauncher] Running org.apache.poi.xwpf.usermodel.TestXWPFComment
[junitlauncher] Tests run: 1, Failures: 0, Aborted: 0, Skipped: 0, Time elapsed: 0.005000 sec
[junitlauncher]
[junitlauncher] Running org.apache.poi.xwpf.usermodel.TestXWPFDocument
[junitlauncher] Tests run: 21, Failures: 0, Aborted: 0, Skipped: 1, Time elapsed: 0.385000 sec
[junitlauncher]
[junitlauncher] Running org.apache.poi.xwpf.usermodel.TestXWPFEndnote
[junitlauncher] Tests run: 4, Failures: 0, Aborted: 0, Skipped: 0, Time elapsed: 0.018000 sec
[junitlauncher]
[junitlauncher] Running org.apache.poi.xwpf.usermodel.TestXWPFEndnotes
[junitlauncher] Tests run: 2, Failures: 0, Aborted: 0, Skipped: 0, Time elapsed: 0.007000 sec
[junitlauncher]
[junitlauncher] Running org.apache.poi.xwpf.usermodel.TestXWPFFootnote
[junitlauncher] Tests run: 4, Failures: 0, Aborted: 0, Skipped: 0, Time elapsed: 0.011000 sec
[junitlauncher]
[junitlauncher] Running org.apache.poi.xwpf.usermodel.TestXWPFFootnotes
[junitlauncher] Tests run: 3, Failures: 0, Aborted: 0, Skipped: 0, Time elapsed: 0.020000 sec
[junitlauncher]
[junitlauncher] Running org.apache.poi.xwpf.usermodel.TestXWPFHeader
[junitlauncher] Tests run: 6, Failures: 0, Aborted: 0, Skipped: 0, Time elapsed: 0.073000 sec
[junitlauncher]
[junitlauncher] Running org.apache.poi.xwpf.usermodel.TestXWPFHeadings
[junitlauncher] Tests run: 1, Failures: 0, Aborted: 0, Skipped: 0, Time elapsed: 0.059000 sec
[junitlauncher]
[junitlauncher] Running org.apache.poi.xwpf.usermodel.TestXWPFNumbering
[junitlauncher] Tests run: 8, Failures: 0, Aborted: 0, Skipped: 0, Time elapsed: 0.088000 sec
[junitlauncher]
[junitlauncher] Running org.apache.poi.xwpf.usermodel.TestXWPFParagraph
[junitlauncher] Tests run: 29, Failures: 0, Aborted: 0, Skipped: 0, Time elapsed: 0.131000 sec
[junitlauncher]
[junitlauncher] Running org.apache.poi.xwpf.usermodel.TestXWPFPictureData
[junitlauncher] Tests run: 5, Failures: 0, Aborted: 0, Skipped: 0, Time elapsed: 0.207000 sec
[junitlauncher]
[junitlauncher] Running org.apache.poi.xwpf.usermodel.TestXWPFRun
[junitlauncher] Tests run: 34, Failures: 0, Aborted: 0, Skipped: 0, Time elapsed: 0.149000 sec
[junitlauncher]
[junitlauncher] Running org.apache.poi.xwpf.usermodel.TestXWPFSDT
[junitlauncher] Tests run: 7, Failures: 0, Aborted: 0, Skipped: 0, Time elapsed: 0.063000 sec
[junitlauncher]
[junitlauncher] Running org.apache.poi.xwpf.usermodel.TestXWPFSmartTag
[junitlauncher] Tests run: 1, Failures: 0, Aborted: 0, Skipped: 0, Time elapsed: 0.007000 sec
[junitlauncher]
[junitlauncher] Running org.apache.poi.xwpf.usermodel.TestXWPFStyles
[junitlauncher] Tests run: 10, Failures: 0, Aborted: 0, Skipped: 0, Time elapsed: 0.099000 sec
[junitlauncher]
[junitlauncher] Running org.apache.poi.xwpf.usermodel.TestXWPFTable
[junitlauncher] Tests run: 17, Failures: 0, Aborted: 0, Skipped: 0, Time elapsed: 0.055000 sec
[junitlauncher]
[junitlauncher] Running org.apache.poi.xwpf.usermodel.TestXWPFTableCell
[junitlauncher] Tests run: 11, Failures: 0, Aborted: 0, Skipped: 0, Time elapsed: 0.046000 sec
[junitlauncher]
[junitlauncher] Running org.apache.poi.xwpf.usermodel.TestXWPFTableRow
[junitlauncher] Tests run: 8, Failures: 0, Aborted: 0, Skipped: 0, Time elapsed: 0.023000 sec

-test-ooxml-write-testfile:

compile-ooxml-lite:
     [echo] Create ooxml-lite schemas
    [javac] Compiling 1 source file to <https://ci-builds.apache.org/job/POI/job/POI-DSL-1.15/ws/src/multimodule/ooxml-lite/java9>
    [javac] <https://ci-builds.apache.org/job/POI/job/POI-DSL-1.15/ws/src/multimodule/ooxml-lite/java9/module-info.java>:22: warning: requires transitive directive for an automatic module
    [javac]     requires transitive org.apache.xmlbeans;
    [javac]                                   ^
    [javac] 1 warning
     [copy] Copying 1 file to <https://ci-builds.apache.org/job/POI/job/POI-DSL-1.15/ws/build>
     [copy] Copying 1 file to <https://ci-builds.apache.org/job/POI/job/POI-DSL-1.15/ws/build>
     [copy] Copying 1 file to <https://ci-builds.apache.org/job/POI/job/POI-DSL-1.15/ws/build>
    [mkdir] Created dir: <https://ci-builds.apache.org/job/POI/job/POI-DSL-1.15/ws/build/dist/maven/poi-ooxml-lite>
      [jar] Building jar: <https://ci-builds.apache.org/job/POI/job/POI-DSL-1.15/ws/build/dist/maven/poi-ooxml-lite/poi-ooxml-lite-5.0.1-SNAPSHOT.jar>

-test-excelant-check:

test-excelant:
[junitlauncher]
[junitlauncher] Running org.apache.poi.ss.excelant.TestBuildFile
[junitlauncher] Tests run: 14, Failures: 0, Aborted: 0, Skipped: 0, Time elapsed: 2.664000 sec
[junitlauncher]
[junitlauncher] Running org.apache.poi.ss.excelant.TestExcelAntPrecision
[junitlauncher] Tests run: 1, Failures: 0, Aborted: 0, Skipped: 0, Time elapsed: 0.004000 sec
[junitlauncher]
[junitlauncher] Running org.apache.poi.ss.excelant.TestExcelAntSet
[junitlauncher] Tests run: 2, Failures: 0, Aborted: 0, Skipped: 0, Time elapsed: 0.022000 sec
[junitlauncher]
[junitlauncher] Running org.apache.poi.ss.excelant.TestExcelAntSetDoubleCell
[junitlauncher] Tests run: 1, Failures: 0, Aborted: 0, Skipped: 0, Time elapsed: 0.003000 sec
[junitlauncher]
[junitlauncher] Running org.apache.poi.ss.excelant.TestExcelAntUserDefinedFunction
[junitlauncher] Tests run: 2, Failures: 0, Aborted: 0, Skipped: 0, Time elapsed: 0.003000 sec
[junitlauncher]
[junitlauncher] Running org.apache.poi.ss.excelant.util.TestExcelAntEvaluationResult
[junitlauncher] Tests run: 4, Failures: 0, Aborted: 0, Skipped: 0, Time elapsed: 0.006000 sec
[junitlauncher]
[junitlauncher] Running org.apache.poi.ss.excelant.util.TestExcelAntWorkbookUtil
[junitlauncher] Tests run: 23, Failures: 0, Aborted: 0, Skipped: 0, Time elapsed: 1.108000 sec
[junitlauncher]
[junitlauncher] Running org.apache.poi.ss.excelant.util.TestExcelAntWorkbookUtilFactory
[junitlauncher] Tests run: 2, Failures: 0, Aborted: 0, Skipped: 0, Time elapsed: 0.002000 sec

-test-excelant-write-testfile:

test:

compile-integration:
    [javac] Compiling 28 source files to <https://ci-builds.apache.org/job/POI/job/POI-DSL-1.15/ws/build/integration-test-classes>
    [javac] Ignoring source, target and bootclasspath as release has been set
    [mkdir] Created dir: <https://ci-builds.apache.org/job/POI/job/POI-DSL-1.15/ws/build/integration-test-classes/META-INF/versions/9>
    [javac] Compiling 1 source file to <https://ci-builds.apache.org/job/POI/job/POI-DSL-1.15/ws/build/integration-test-classes/META-INF/versions/9>
      [jar] Building jar: <https://ci-builds.apache.org/job/POI/job/POI-DSL-1.15/ws/build/dist/maven/poi-integration/poi-integration-5.0.1-SNAPSHOT.jar>

-test-integration-check:

test-integration:
[junitlauncher]
[junitlauncher] Running org.apache.poi.stress.TestAllFiles
[junitlauncher]    Failed: #1306 spreadsheet/44958.xls HSSF
[junitlauncher]    Failed: #1307 spreadsheet/44958.xls HPSF
[junitlauncher]    Failed: #1795 spreadsheet/59074.xls HSSF
[junitlauncher]    Failed: #1796 spreadsheet/59074.xls HPSF
[junitlauncher]    Failed: #1870 spreadsheet/64130.xls HSSF
[junitlauncher]    Failed: #1871 spreadsheet/64130.xls HPSF
[junitlauncher]    Failed: #1306 spreadsheet/44958.xls HSSF
[junitlauncher]    Failed: #2475 spreadsheet/testEXCEL_5.xls HSSF
[junitlauncher]    Failed: #2477 spreadsheet/testEXCEL_95.xls HSSF
[junitlauncher]    Failed: #2476 spreadsheet/testEXCEL_5.xls HPSF
[junitlauncher]    Failed: #2478 spreadsheet/testEXCEL_95.xls HPSF
[junitlauncher]    Failed: #1685 spreadsheet/56450.xls HSSF
[junitlauncher] Tests run: 7683, Failures: 12, Aborted: 0, Skipped: 0, Time elapsed: 218.943000 sec

BUILD FAILED
<https://ci-builds.apache.org/job/POI/job/POI-DSL-1.15/ws/build.xml>:1704: The following error occurred while executing this line:
<https://ci-builds.apache.org/job/POI/job/POI-DSL-1.15/ws/build.xml>:1254: Some test(s) have failure(s)

Total time: 15 minutes 41 seconds
Build step 'Invoke Ant' marked build as failure
[SpotBugs] Skipping execution of recorder since overall result is 'FAILURE'
Archiving artifacts
[Fast Archiver] Compressed 7.45 MB of artifacts by 41.1% relative to #27
Skipping publisher since build result is FAILURE
Recording test results

---------------------------------------------------------------------
To unsubscribe, e-mail: [hidden email]
For additional commands, e-mail: [hidden email]

Reply | Threaded
Open this post in threaded view
|

Build failed in Jenkins: POI » POI-DSL-1.15 #32

Apache Jenkins Server
See <https://ci-builds.apache.org/job/POI/job/POI-DSL-1.15/32/display/redirect?page=changes>

Changes:

[PJ Fanning] add missing CTPhoneticRun

[PJ Fanning] fix typo

[PJ Fanning] small refactor

[PJ Fanning] allo XSSFReader to be sublclassed with implementation that allows OOXMl Strict files

[PJ Fanning] batik 1.14

[Marius Volkhart] Fix GitHub Action yaml for Gradle build

[Alain Béarez] Import slide notes when importing slide content

[Alain Béarez] Fix slide notes content import part from bug 57835


------------------------------------------
[...truncated 184.84 KB...]
[junitlauncher]
[junitlauncher] Running org.apache.poi.xssf.usermodel.TestXSSFUnicodeSurrogates
[junitlauncher] Tests run: 1, Failures: 0, Aborted: 0, Skipped: 0, Time elapsed: 0.007000 sec
[junitlauncher]
[junitlauncher] Running org.apache.poi.xssf.usermodel.TestXSSFVMLDrawing
[junitlauncher] Tests run: 5, Failures: 0, Aborted: 0, Skipped: 0, Time elapsed: 0.065000 sec
[junitlauncher]
[junitlauncher] Running org.apache.poi.xssf.usermodel.TestXSSFWorkbook
[junitlauncher] Tests run: 62, Failures: 0, Aborted: 0, Skipped: 0, Time elapsed: 0.769000 sec
[junitlauncher]
[junitlauncher] Running org.apache.poi.xssf.usermodel.charts.TestXDDFChartLegend
[junitlauncher] Tests run: 3, Failures: 0, Aborted: 0, Skipped: 0, Time elapsed: 0.014000 sec
[junitlauncher]
[junitlauncher] Running org.apache.poi.xssf.usermodel.charts.TestXDDFManualLayout
[junitlauncher] Tests run: 2, Failures: 0, Aborted: 0, Skipped: 0, Time elapsed: 0.012000 sec
[junitlauncher]
[junitlauncher] Running org.apache.poi.xssf.usermodel.charts.TestXSSF3DChartData
[junitlauncher] Tests run: 1, Failures: 0, Aborted: 0, Skipped: 0, Time elapsed: 0.026000 sec
[junitlauncher]
[junitlauncher] Running org.apache.poi.xssf.usermodel.charts.TestXSSFCategoryAxis
[junitlauncher] Tests run: 1, Failures: 0, Aborted: 0, Skipped: 0, Time elapsed: 0.007000 sec
[junitlauncher]
[junitlauncher] Running org.apache.poi.xssf.usermodel.charts.TestXSSFChartAxis
[junitlauncher] Tests run: 8, Failures: 0, Aborted: 0, Skipped: 0, Time elapsed: 0.034000 sec
[junitlauncher]
[junitlauncher] Running org.apache.poi.xssf.usermodel.charts.TestXSSFChartTitle
[junitlauncher] Tests run: 6, Failures: 0, Aborted: 0, Skipped: 0, Time elapsed: 0.051000 sec
[junitlauncher]
[junitlauncher] Running org.apache.poi.xssf.usermodel.charts.TestXSSFDateAxis
[junitlauncher] Tests run: 1, Failures: 0, Aborted: 0, Skipped: 0, Time elapsed: 0.014000 sec
[junitlauncher]
[junitlauncher] Running org.apache.poi.xssf.usermodel.charts.TestXSSFLineChartData
[junitlauncher] Tests run: 1, Failures: 0, Aborted: 0, Skipped: 0, Time elapsed: 0.005000 sec
[junitlauncher]
[junitlauncher] Running org.apache.poi.xssf.usermodel.charts.TestXSSFScatterChartData
[junitlauncher] Tests run: 1, Failures: 0, Aborted: 0, Skipped: 0, Time elapsed: 0.011000 sec
[junitlauncher]
[junitlauncher] Running org.apache.poi.xssf.usermodel.charts.TestXSSFValueAxis
[junitlauncher] Tests run: 1, Failures: 0, Aborted: 0, Skipped: 0, Time elapsed: 0.005000 sec
[junitlauncher]
[junitlauncher] Running org.apache.poi.xssf.usermodel.extensions.TestXSSFBorder
[junitlauncher] Tests run: 1, Failures: 0, Aborted: 0, Skipped: 0, Time elapsed: 0.001000 sec
[junitlauncher]
[junitlauncher] Running org.apache.poi.xssf.usermodel.extensions.TestXSSFCellFill
[junitlauncher] Tests run: 6, Failures: 0, Aborted: 0, Skipped: 0, Time elapsed: 0.045000 sec
[junitlauncher]
[junitlauncher] Running org.apache.poi.xssf.usermodel.extensions.TestXSSFHeaderFooter
[junitlauncher] Tests run: 10, Failures: 0, Aborted: 0, Skipped: 0, Time elapsed: 0.025000 sec
[junitlauncher]
[junitlauncher] Running org.apache.poi.xssf.usermodel.helpers.TestColumnHelper
[junitlauncher] Tests run: 16, Failures: 0, Aborted: 0, Skipped: 0, Time elapsed: 0.029000 sec
[junitlauncher]
[junitlauncher] Running org.apache.poi.xssf.usermodel.helpers.TestHeaderFooterHelper
[junitlauncher] Tests run: 2, Failures: 0, Aborted: 0, Skipped: 0, Time elapsed: 0.001000 sec
[junitlauncher]
[junitlauncher] Running org.apache.poi.xssf.usermodel.helpers.TestXSSFColumnShifting
[junitlauncher] Tests run: 2, Failures: 0, Aborted: 0, Skipped: 0, Time elapsed: 0.004000 sec
[junitlauncher]
[junitlauncher] Running org.apache.poi.xssf.util.TestCTColComparator
[junitlauncher] Tests run: 2, Failures: 0, Aborted: 0, Skipped: 0, Time elapsed: 0.000000 sec
[junitlauncher]
[junitlauncher] Running org.apache.poi.xssf.util.TestEvilUnclosedBRFixingInputStream
[junitlauncher] Tests run: 3, Failures: 0, Aborted: 0, Skipped: 0, Time elapsed: 0.002000 sec
[junitlauncher]
[junitlauncher] Running org.apache.poi.xssf.util.TestNumericRanges
[junitlauncher] Tests run: 2, Failures: 0, Aborted: 0, Skipped: 0, Time elapsed: 0.001000 sec
[junitlauncher]
[junitlauncher] Running org.apache.poi.xwpf.TestAllExtendedProperties
[junitlauncher] Tests run: 1, Failures: 0, Aborted: 0, Skipped: 0, Time elapsed: 0.037000 sec
[junitlauncher]
[junitlauncher] Running org.apache.poi.xwpf.TestDocumentProtection
[junitlauncher] Tests run: 10, Failures: 0, Aborted: 0, Skipped: 0, Time elapsed: 0.396000 sec
[junitlauncher]
[junitlauncher] Running org.apache.poi.xwpf.TestNecessaryOOXMLClasses
[junitlauncher] Tests run: 1, Failures: 0, Aborted: 0, Skipped: 0, Time elapsed: 0.013000 sec
[junitlauncher]
[junitlauncher] Running org.apache.poi.xwpf.TestPackageCorePropertiesGetKeywords
[junitlauncher] Tests run: 1, Failures: 0, Aborted: 0, Skipped: 0, Time elapsed: 0.018000 sec
[junitlauncher]
[junitlauncher] Running org.apache.poi.xwpf.TestXWPFBugs
[junitlauncher] Tests run: 4, Failures: 0, Aborted: 0, Skipped: 0, Time elapsed: 0.218000 sec
[junitlauncher]
[junitlauncher] Running org.apache.poi.xwpf.extractor.TestExternalEntities
[junitlauncher] Tests run: 1, Failures: 0, Aborted: 0, Skipped: 0, Time elapsed: 0.009000 sec
[junitlauncher]
[junitlauncher] Running org.apache.poi.xwpf.extractor.TestXWPFWordExtractor
[junitlauncher] Tests run: 24, Failures: 0, Aborted: 0, Skipped: 0, Time elapsed: 0.483000 sec
[junitlauncher]
[junitlauncher] Running org.apache.poi.xwpf.model.TestXWPFDecorators
[junitlauncher] Tests run: 2, Failures: 0, Aborted: 0, Skipped: 0, Time elapsed: 0.052000 sec
[junitlauncher]
[junitlauncher] Running org.apache.poi.xwpf.model.TestXWPFHeaderFooterPolicy
[junitlauncher] Tests run: 3, Failures: 0, Aborted: 0, Skipped: 0, Time elapsed: 0.127000 sec
[junitlauncher]
[junitlauncher] Running org.apache.poi.xwpf.usermodel.TestChangeTracking
[junitlauncher] Tests run: 3, Failures: 0, Aborted: 0, Skipped: 0, Time elapsed: 0.016000 sec
[junitlauncher]
[junitlauncher] Running org.apache.poi.xwpf.usermodel.TestColumn
[junitlauncher] Tests run: 4, Failures: 0, Aborted: 0, Skipped: 0, Time elapsed: 0.046000 sec
[junitlauncher]
[junitlauncher] Running org.apache.poi.xwpf.usermodel.TestXWPFAbstractNum
[junitlauncher] Tests run: 1, Failures: 0, Aborted: 0, Skipped: 0, Time elapsed: 0.000000 sec
[junitlauncher]
[junitlauncher] Running org.apache.poi.xwpf.usermodel.TestXWPFBugs
[junitlauncher] Tests run: 11, Failures: 0, Aborted: 0, Skipped: 0, Time elapsed: 0.193000 sec
[junitlauncher]
[junitlauncher] Running org.apache.poi.xwpf.usermodel.TestXWPFChart
[junitlauncher] Tests run: 4, Failures: 0, Aborted: 0, Skipped: 0, Time elapsed: 0.035000 sec
[junitlauncher]
[junitlauncher] Running org.apache.poi.xwpf.usermodel.TestXWPFComment
[junitlauncher] Tests run: 1, Failures: 0, Aborted: 0, Skipped: 0, Time elapsed: 0.024000 sec
[junitlauncher]
[junitlauncher] Running org.apache.poi.xwpf.usermodel.TestXWPFDocument
[junitlauncher] Tests run: 21, Failures: 0, Aborted: 0, Skipped: 1, Time elapsed: 0.251000 sec
[junitlauncher]
[junitlauncher] Running org.apache.poi.xwpf.usermodel.TestXWPFEndnote
[junitlauncher] Tests run: 4, Failures: 0, Aborted: 0, Skipped: 0, Time elapsed: 0.019000 sec
[junitlauncher]
[junitlauncher] Running org.apache.poi.xwpf.usermodel.TestXWPFEndnotes
[junitlauncher] Tests run: 2, Failures: 0, Aborted: 0, Skipped: 0, Time elapsed: 0.010000 sec
[junitlauncher]
[junitlauncher] Running org.apache.poi.xwpf.usermodel.TestXWPFFootnote
[junitlauncher] Tests run: 4, Failures: 0, Aborted: 0, Skipped: 0, Time elapsed: 0.015000 sec
[junitlauncher]
[junitlauncher] Running org.apache.poi.xwpf.usermodel.TestXWPFFootnotes
[junitlauncher] Tests run: 3, Failures: 0, Aborted: 0, Skipped: 0, Time elapsed: 0.018000 sec
[junitlauncher]
[junitlauncher] Running org.apache.poi.xwpf.usermodel.TestXWPFHeader
[junitlauncher] Tests run: 6, Failures: 0, Aborted: 0, Skipped: 0, Time elapsed: 0.075000 sec
[junitlauncher]
[junitlauncher] Running org.apache.poi.xwpf.usermodel.TestXWPFHeadings
[junitlauncher] Tests run: 1, Failures: 0, Aborted: 0, Skipped: 0, Time elapsed: 0.053000 sec
[junitlauncher]
[junitlauncher] Running org.apache.poi.xwpf.usermodel.TestXWPFNumbering
[junitlauncher] Tests run: 8, Failures: 0, Aborted: 0, Skipped: 0, Time elapsed: 0.073000 sec
[junitlauncher]
[junitlauncher] Running org.apache.poi.xwpf.usermodel.TestXWPFParagraph
[junitlauncher] Tests run: 29, Failures: 0, Aborted: 0, Skipped: 0, Time elapsed: 0.151000 sec
[junitlauncher]
[junitlauncher] Running org.apache.poi.xwpf.usermodel.TestXWPFPictureData
[junitlauncher] Tests run: 5, Failures: 0, Aborted: 0, Skipped: 0, Time elapsed: 0.106000 sec
[junitlauncher]
[junitlauncher] Running org.apache.poi.xwpf.usermodel.TestXWPFRun
[junitlauncher] Tests run: 34, Failures: 0, Aborted: 0, Skipped: 0, Time elapsed: 0.146000 sec
[junitlauncher]
[junitlauncher] Running org.apache.poi.xwpf.usermodel.TestXWPFSDT
[junitlauncher] Tests run: 7, Failures: 0, Aborted: 0, Skipped: 0, Time elapsed: 0.070000 sec
[junitlauncher]
[junitlauncher] Running org.apache.poi.xwpf.usermodel.TestXWPFSmartTag
[junitlauncher] Tests run: 1, Failures: 0, Aborted: 0, Skipped: 0, Time elapsed: 0.006000 sec
[junitlauncher]
[junitlauncher] Running org.apache.poi.xwpf.usermodel.TestXWPFStyles
[junitlauncher] Tests run: 10, Failures: 0, Aborted: 0, Skipped: 0, Time elapsed: 0.094000 sec
[junitlauncher]
[junitlauncher] Running org.apache.poi.xwpf.usermodel.TestXWPFTable
[junitlauncher] Tests run: 17, Failures: 0, Aborted: 0, Skipped: 0, Time elapsed: 0.099000 sec
[junitlauncher]
[junitlauncher] Running org.apache.poi.xwpf.usermodel.TestXWPFTableCell
[junitlauncher] Tests run: 11, Failures: 0, Aborted: 0, Skipped: 0, Time elapsed: 0.062000 sec
[junitlauncher]
[junitlauncher] Running org.apache.poi.xwpf.usermodel.TestXWPFTableRow
[junitlauncher] Tests run: 8, Failures: 0, Aborted: 0, Skipped: 0, Time elapsed: 0.044000 sec

-test-ooxml-write-testfile:

compile-ooxml-lite:
     [echo] Create ooxml-lite schemas
    [javac] Compiling 1 source file to <https://ci-builds.apache.org/job/POI/job/POI-DSL-1.15/ws/src/multimodule/ooxml-lite/java9>
    [javac] <https://ci-builds.apache.org/job/POI/job/POI-DSL-1.15/ws/src/multimodule/ooxml-lite/java9/module-info.java>:22: warning: requires transitive directive for an automatic module
    [javac]     requires transitive org.apache.xmlbeans;
    [javac]                                   ^
    [javac] 1 warning
     [copy] Copying 1 file to <https://ci-builds.apache.org/job/POI/job/POI-DSL-1.15/ws/build>
     [copy] Copying 1 file to <https://ci-builds.apache.org/job/POI/job/POI-DSL-1.15/ws/build>
     [copy] Copying 1 file to <https://ci-builds.apache.org/job/POI/job/POI-DSL-1.15/ws/build>
    [mkdir] Created dir: <https://ci-builds.apache.org/job/POI/job/POI-DSL-1.15/ws/build/dist/maven/poi-ooxml-lite>
      [jar] Building jar: <https://ci-builds.apache.org/job/POI/job/POI-DSL-1.15/ws/build/dist/maven/poi-ooxml-lite/poi-ooxml-lite-5.0.1-SNAPSHOT.jar>

-test-excelant-check:

test-excelant:
[junitlauncher]
[junitlauncher] Running org.apache.poi.ss.excelant.TestBuildFile
[junitlauncher] Tests run: 14, Failures: 0, Aborted: 0, Skipped: 0, Time elapsed: 2.909000 sec
[junitlauncher]
[junitlauncher] Running org.apache.poi.ss.excelant.TestExcelAntPrecision
[junitlauncher] Tests run: 1, Failures: 0, Aborted: 0, Skipped: 0, Time elapsed: 0.004000 sec
[junitlauncher]
[junitlauncher] Running org.apache.poi.ss.excelant.TestExcelAntSet
[junitlauncher] Tests run: 2, Failures: 0, Aborted: 0, Skipped: 0, Time elapsed: 0.023000 sec
[junitlauncher]
[junitlauncher] Running org.apache.poi.ss.excelant.TestExcelAntSetDoubleCell
[junitlauncher] Tests run: 1, Failures: 0, Aborted: 0, Skipped: 0, Time elapsed: 0.003000 sec
[junitlauncher]
[junitlauncher] Running org.apache.poi.ss.excelant.TestExcelAntUserDefinedFunction
[junitlauncher] Tests run: 2, Failures: 0, Aborted: 0, Skipped: 0, Time elapsed: 0.003000 sec
[junitlauncher]
[junitlauncher] Running org.apache.poi.ss.excelant.util.TestExcelAntEvaluationResult
[junitlauncher] Tests run: 4, Failures: 0, Aborted: 0, Skipped: 0, Time elapsed: 0.008000 sec
[junitlauncher]
[junitlauncher] Running org.apache.poi.ss.excelant.util.TestExcelAntWorkbookUtil
[junitlauncher] Tests run: 23, Failures: 0, Aborted: 0, Skipped: 0, Time elapsed: 1.193000 sec
[junitlauncher]
[junitlauncher] Running org.apache.poi.ss.excelant.util.TestExcelAntWorkbookUtilFactory
[junitlauncher] Tests run: 2, Failures: 0, Aborted: 0, Skipped: 0, Time elapsed: 0.002000 sec

-test-excelant-write-testfile:

test:

compile-integration:
    [javac] Compiling 28 source files to <https://ci-builds.apache.org/job/POI/job/POI-DSL-1.15/ws/build/integration-test-classes>
    [javac] Ignoring source, target and bootclasspath as release has been set
    [mkdir] Created dir: <https://ci-builds.apache.org/job/POI/job/POI-DSL-1.15/ws/build/integration-test-classes/META-INF/versions/9>
    [javac] Compiling 1 source file to <https://ci-builds.apache.org/job/POI/job/POI-DSL-1.15/ws/build/integration-test-classes/META-INF/versions/9>
      [jar] Building jar: <https://ci-builds.apache.org/job/POI/job/POI-DSL-1.15/ws/build/dist/maven/poi-integration/poi-integration-5.0.1-SNAPSHOT.jar>

-test-integration-check:

test-integration:
[junitlauncher]
[junitlauncher] Running org.apache.poi.stress.TestAllFiles
[junitlauncher]    Failed: #1306 spreadsheet/44958.xls HSSF
[junitlauncher]    Failed: #1307 spreadsheet/44958.xls HPSF
[junitlauncher]    Failed: #1795 spreadsheet/59074.xls HSSF
[junitlauncher]    Failed: #1796 spreadsheet/59074.xls HPSF
[junitlauncher]    Failed: #1870 spreadsheet/64130.xls HSSF
[junitlauncher]    Failed: #1871 spreadsheet/64130.xls HPSF
[junitlauncher]    Failed: #1306 spreadsheet/44958.xls HSSF
[junitlauncher]    Failed: #2469 spreadsheet/testArraysAndTables.xls HSSF
[junitlauncher]    Failed: #2470 spreadsheet/testArraysAndTables.xls HPSF
[junitlauncher]    Failed: #2475 spreadsheet/testEXCEL_5.xls HSSF
[junitlauncher]    Failed: #2476 spreadsheet/testEXCEL_5.xls HPSF
[junitlauncher]    Failed: #2477 spreadsheet/testEXCEL_95.xls HSSF
[junitlauncher]    Failed: #2478 spreadsheet/testEXCEL_95.xls HPSF
[junitlauncher]    Failed: #1685 spreadsheet/56450.xls HSSF
[junitlauncher] Tests run: 7683, Failures: 14, Aborted: 0, Skipped: 0, Time elapsed: 195.147000 sec

BUILD FAILED
<https://ci-builds.apache.org/job/POI/job/POI-DSL-1.15/ws/build.xml>:1703: The following error occurred while executing this line:
<https://ci-builds.apache.org/job/POI/job/POI-DSL-1.15/ws/build.xml>:1253: Some test(s) have failure(s)

Total time: 15 minutes 15 seconds
Build step 'Invoke Ant' marked build as failure
[SpotBugs] Skipping execution of recorder since overall result is 'FAILURE'
Archiving artifacts
[Fast Archiver] Compressed 7.67 MB of artifacts by 39.9% relative to #27
Skipping publisher since build result is FAILURE
Recording test results

---------------------------------------------------------------------
To unsubscribe, e-mail: [hidden email]
For additional commands, e-mail: [hidden email]

Reply | Threaded
Open this post in threaded view
|

Jenkins build is back to normal : POI » POI-DSL-1.15 #33

Apache Jenkins Server
See <https://ci-builds.apache.org/job/POI/job/POI-DSL-1.15/33/display/redirect?page=changes>


---------------------------------------------------------------------
To unsubscribe, e-mail: [hidden email]
For additional commands, e-mail: [hidden email]