Build failed in Jenkins: POI » POI-DSL-1.11 #38

classic Classic list List threaded Threaded
2 messages Options
Reply | Threaded
Open this post in threaded view
|

Build failed in Jenkins: POI » POI-DSL-1.11 #38

Apache Jenkins Server
See <https://ci-builds.apache.org/job/POI/job/POI-DSL-1.11/38/display/redirect?page=changes>

Changes:

[PJ Fanning] fix typo

[PJ Fanning] small refactor

[PJ Fanning] allo XSSFReader to be sublclassed with implementation that allows OOXMl Strict files

[PJ Fanning] batik 1.14

[Marius Volkhart] Fix GitHub Action yaml for Gradle build

[Alain Béarez] Import slide notes when importing slide content

[Alain Béarez] Fix slide notes content import part from bug 57835


------------------------------------------
[...truncated 217.89 KB...]
[junitlauncher] Running org.apache.poi.xssf.TestXSSFCloneSheet
[junitlauncher] Tests run: 8, Failures: 0, Aborted: 0, Skipped: 0, Time elapsed: 0.150000 sec
[junitlauncher]
[junitlauncher] Running org.apache.poi.xssf.TestXSSFMemoryLeak
[junitlauncher] Tests run: 6, Failures: 0, Aborted: 0, Skipped: 0, Time elapsed: 1.985000 sec
[junitlauncher]
[junitlauncher] Running org.apache.poi.xssf.TestXSSFOffset
[junitlauncher] Tests run: 1, Failures: 0, Aborted: 0, Skipped: 0, Time elapsed: 0.010000 sec
[junitlauncher]
[junitlauncher] Running org.apache.poi.xssf.binary.TestXSSFBSharedStringsTable
[junitlauncher] Tests run: 1, Failures: 0, Aborted: 0, Skipped: 0, Time elapsed: 0.006000 sec
[junitlauncher]
[junitlauncher] Running org.apache.poi.xssf.binary.TestXSSFBSheetHyperlinkManager
[junitlauncher] Tests run: 1, Failures: 0, Aborted: 0, Skipped: 0, Time elapsed: 0.009000 sec
[junitlauncher]
[junitlauncher] Running org.apache.poi.xssf.eventusermodel.TestReadOnlySharedStringsTable
[junitlauncher] Tests run: 4, Failures: 0, Aborted: 0, Skipped: 0, Time elapsed: 0.018000 sec
[junitlauncher]
[junitlauncher] Running org.apache.poi.xssf.eventusermodel.TestXSSFBReader
[junitlauncher] Tests run: 4, Failures: 0, Aborted: 0, Skipped: 0, Time elapsed: 0.033000 sec
[junitlauncher]
[junitlauncher] Running org.apache.poi.xssf.eventusermodel.TestXSSFReader
[junitlauncher] Tests run: 15, Failures: 0, Aborted: 0, Skipped: 0, Time elapsed: 0.084000 sec
[junitlauncher]
[junitlauncher] Running org.apache.poi.xssf.eventusermodel.TestXSSFSheetXMLHandler
[junitlauncher] Tests run: 1, Failures: 0, Aborted: 0, Skipped: 0, Time elapsed: 0.008000 sec
[junitlauncher]
[junitlauncher] Running org.apache.poi.xssf.extractor.TestXSSFBEventBasedExcelExtractor
[junitlauncher] Tests run: 4, Failures: 0, Aborted: 0, Skipped: 0, Time elapsed: 0.038000 sec
[junitlauncher]
[junitlauncher] Running org.apache.poi.xssf.extractor.TestXSSFEventBasedExcelExtractor
[junitlauncher] Tests run: 12, Failures: 0, Aborted: 0, Skipped: 0, Time elapsed: 0.275000 sec
[junitlauncher]
[junitlauncher] Running org.apache.poi.xssf.extractor.TestXSSFEventBasedExcelExtractorUsingFactory
[junitlauncher] Tests run: 12, Failures: 0, Aborted: 0, Skipped: 0, Time elapsed: 0.212000 sec
[junitlauncher]
[junitlauncher] Running org.apache.poi.xssf.extractor.TestXSSFExcelExtractor
[junitlauncher] Tests run: 8, Failures: 0, Aborted: 0, Skipped: 0, Time elapsed: 0.304000 sec
[junitlauncher]
[junitlauncher] Running org.apache.poi.xssf.extractor.TestXSSFExcelExtractorUsingFactory
[junitlauncher] Tests run: 8, Failures: 0, Aborted: 0, Skipped: 0, Time elapsed: 0.301000 sec
[junitlauncher]
[junitlauncher] Running org.apache.poi.xssf.extractor.TestXSSFExportToXML
[junitlauncher] Tests run: 18, Failures: 0, Aborted: 0, Skipped: 1, Time elapsed: 0.397000 sec
[junitlauncher]
[junitlauncher] Running org.apache.poi.xssf.extractor.TestXSSFImportFromXML
[junitlauncher] Tests run: 5, Failures: 0, Aborted: 0, Skipped: 0, Time elapsed: 5.354000 sec
[junitlauncher]
[junitlauncher] Running org.apache.poi.xssf.io.TestLoadSaveXSSF
[junitlauncher] Tests run: 3, Failures: 0, Aborted: 0, Skipped: 0, Time elapsed: 0.033000 sec
[junitlauncher]
[junitlauncher] Running org.apache.poi.xssf.model.TestCalculationChain
[junitlauncher] Tests run: 1, Failures: 0, Aborted: 0, Skipped: 0, Time elapsed: 0.271000 sec
[junitlauncher]
[junitlauncher] Running org.apache.poi.xssf.model.TestCommentsTable
[junitlauncher] Tests run: 7, Failures: 0, Aborted: 0, Skipped: 0, Time elapsed: 0.108000 sec
[junitlauncher]
[junitlauncher] Running org.apache.poi.xssf.model.TestExternalLinksTable
[junitlauncher] Tests run: 4, Failures: 0, Aborted: 0, Skipped: 0, Time elapsed: 0.054000 sec
[junitlauncher]
[junitlauncher] Running org.apache.poi.xssf.model.TestMapInfo
[junitlauncher] Tests run: 1, Failures: 0, Aborted: 0, Skipped: 0, Time elapsed: 0.012000 sec
[junitlauncher]
[junitlauncher] Running org.apache.poi.xssf.model.TestSharedStringsTable
[junitlauncher] Tests run: 4, Failures: 0, Aborted: 0, Skipped: 0, Time elapsed: 0.075000 sec
[junitlauncher]
[junitlauncher] Running org.apache.poi.xssf.model.TestStylesTable
[junitlauncher] Tests run: 13, Failures: 0, Aborted: 0, Skipped: 0, Time elapsed: 0.183000 sec
[junitlauncher]
[junitlauncher] Running org.apache.poi.xssf.model.TestThemesTable
[junitlauncher] Tests run: 3, Failures: 0, Aborted: 0, Skipped: 0, Time elapsed: 0.079000 sec
[junitlauncher]
[junitlauncher] Running org.apache.poi.xssf.streaming.TestAutoSizeColumnTracker
[junitlauncher] Tests run: 8, Failures: 0, Aborted: 0, Skipped: 0, Time elapsed: 0.071000 sec
[junitlauncher]
[junitlauncher] Running org.apache.poi.xssf.streaming.TestDeferredSXSSFWorkbook
[junitlauncher] Tests run: 28, Failures: 0, Aborted: 0, Skipped: 0, Time elapsed: 0.669000 sec
[junitlauncher]
[junitlauncher] Running org.apache.poi.xssf.streaming.TestOutlining
[junitlauncher] Tests run: 6, Failures: 0, Aborted: 0, Skipped: 0, Time elapsed: 0.064000 sec
[junitlauncher]
[junitlauncher] Running org.apache.poi.xssf.streaming.TestSXSSFCell
[junitlauncher] Tests run: 53, Failures: 0, Aborted: 0, Skipped: 0, Time elapsed: 0.937000 sec
[junitlauncher]
[junitlauncher] Running org.apache.poi.xssf.streaming.TestSXSSFDataValidation
[junitlauncher] Tests run: 2, Failures: 0, Aborted: 0, Skipped: 0, Time elapsed: 0.102000 sec
[junitlauncher]
[junitlauncher] Running org.apache.poi.xssf.streaming.TestSXSSFEvaluationSheet
[junitlauncher] Tests run: 1, Failures: 0, Aborted: 0, Skipped: 0, Time elapsed: 0.004000 sec
[junitlauncher]
[junitlauncher] Running org.apache.poi.xssf.streaming.TestSXSSFFormulaEvaluation
[junitlauncher] Tests run: 28, Failures: 0, Aborted: 0, Skipped: 0, Time elapsed: 0.780000 sec
[junitlauncher]
[junitlauncher] Running org.apache.poi.xssf.streaming.TestSXSSFHyperlink
[junitlauncher] Tests run: 2, Failures: 0, Aborted: 0, Skipped: 0, Time elapsed: 0.022000 sec
[junitlauncher]
[junitlauncher] Running org.apache.poi.xssf.streaming.TestSXSSFRow
[junitlauncher] Tests run: 12, Failures: 0, Aborted: 0, Skipped: 0, Time elapsed: 0.238000 sec
[junitlauncher]
[junitlauncher] Running org.apache.poi.xssf.streaming.TestSXSSFSheet
[junitlauncher] Tests run: 49, Failures: 0, Aborted: 0, Skipped: 0, Time elapsed: 0.600000 sec
[junitlauncher]
[junitlauncher] Running org.apache.poi.xssf.streaming.TestSXSSFSheetAutoSizeColumn
[junitlauncher] Tests run: 25, Failures: 0, Aborted: 0, Skipped: 0, Time elapsed: 0.110000 sec
[junitlauncher]
[junitlauncher] Running org.apache.poi.xssf.streaming.TestSXSSFUnicodeSurrogates
[junitlauncher] Tests run: 1, Failures: 0, Aborted: 0, Skipped: 0, Time elapsed: 0.022000 sec
[junitlauncher]
[junitlauncher] Running org.apache.poi.xssf.streaming.TestSXSSFWorkbook
[junitlauncher] Tests run: 35, Failures: 0, Aborted: 0, Skipped: 1, Time elapsed: 0.916000 sec
[junitlauncher]
[junitlauncher] Running org.apache.poi.xssf.streaming.TestSXSSFWorkbookWithCustomZipEntrySource
[junitlauncher] Tests run: 3, Failures: 0, Aborted: 0, Skipped: 0, Time elapsed: 0.054000 sec
[junitlauncher]
[junitlauncher] Running org.apache.poi.xssf.streaming.TestSheetDataWriter
[junitlauncher] Tests run: 3, Failures: 0, Aborted: 0, Skipped: 0, Time elapsed: 0.002000 sec
[junitlauncher]
[junitlauncher] Running org.apache.poi.xssf.usermodel.TestFormulaEvaluatorOnXSSF
[junitlauncher]    Aborted: [7] IntersectionEval, 46, 47
[junitlauncher]    Aborted: [12] PercentEval, 66, 67
[junitlauncher]    Aborted: [14] RangeEval, 74, 75
[junitlauncher]    Aborted: [23] Addbar, 115, 116
[junitlauncher]    Aborted: [24] Addcommand, 119, 120
[junitlauncher]    Aborted: [25] Addmenu, 123, 124
[junitlauncher]    Aborted: [27] Addtoolbar, 131, 132
[junitlauncher]    Aborted: [29] Apptitle, 139, 140
[junitlauncher]    Aborted: [40] Averagea, 183, 184
[junitlauncher]    Aborted: [44] Call, 199, 200
[junitlauncher]    Aborted: [45] Caller, 203, 204
[junitlauncher]    Aborted: [50] Checkcommand, 223, 224
[junitlauncher]    Aborted: [57] Column, 251, 252
[junitlauncher]    Aborted: [70] Createobject, 303, 304
[junitlauncher]    Aborted: [73] Customundo, 315, 316
[junitlauncher]    Aborted: [74] Date, 319, 320
[junitlauncher]    Aborted: [80] Days360, 343, 344
[junitlauncher]    Aborted: [81] Db, 347, 348
[junitlauncher]    Aborted: [82] Dbcs, 351, 352
[junitlauncher]    Aborted: [87] Deletebar, 371, 372
[junitlauncher]    Aborted: [88] Deletecommand, 375, 376
[junitlauncher]    Aborted: [89] Deletemenu, 379, 380
[junitlauncher]    Aborted: [90] Deletetoolbar, 383, 384
[junitlauncher]    Aborted: [93] Dget, 395, 396
[junitlauncher]    Aborted: [94] Dialogbox, 399, 400
[junitlauncher]    Aborted: [98] Documents, 415, 416
[junitlauncher]    Aborted: [107] Enablecommand, 451, 452
[junitlauncher]    Aborted: [108] Enabletool, 455, 456
[junitlauncher]    Aborted: [114] Exec, 479, 480
[junitlauncher]    Aborted: [115] Execute, 483, 484
[junitlauncher]    Aborted: [118] Externalflag, 495, 496
[junitlauncher]    Aborted: [119] Fact, 499, 500
[junitlauncher]    Aborted: [121] Fclose, 507, 508
[junitlauncher]    Aborted: [123] Files, 515, 516
[junitlauncher]    Aborted: [131] Fopen, 547, 548
[junitlauncher]    Aborted: [135] Fread, 563, 564
[junitlauncher]    Aborted: [136] Freadln, 567, 568
[junitlauncher]    Aborted: [138] Fsize, 575, 576
[junitlauncher]    Aborted: [147] Getbar, 611, 612
[junitlauncher]    Aborted: [148] Getcell, 615, 616
[junitlauncher]    Aborted: [149] Getchartitem, 619, 620
[junitlauncher]    Aborted: [150] Getdef, 623, 624
[junitlauncher]    Aborted: [151] Getdocument, 627, 628
[junitlauncher]    Aborted: [152] Getformula, 631, 632
[junitlauncher]    Aborted: [153] Getlinkinfo, 635, 636
[junitlauncher]    Aborted: [154] Getmovie, 639, 640
[junitlauncher]    Aborted: [155] Getname, 643, 644
[junitlauncher]    Aborted: [156] Getnote, 647, 648
[junitlauncher]    Aborted: [157] Getobject, 651, 652
[junitlauncher]    Aborted: [162] Gettool, 671, 672
[junitlauncher]    Aborted: [163] Gettoolbar, 675, 676
[junitlauncher]    Aborted: [164] Getwindow, 679, 680
[junitlauncher]    Aborted: [165] Getworkbook, 683, 684
[junitlauncher]    Aborted: [166] Getworkspace, 687, 688
[junitlauncher]    Aborted: [230] Moviecommand, 943, 944
[junitlauncher]    Aborted: [247] Opendialog, 1011, 1012
[junitlauncher]    Aborted: [248] Optionslistsget, 1015, 1016
[junitlauncher]    Aborted: [250] Pause, 1023, 1024
[junitlauncher]    Aborted: [255] Phonetic, 1043, 1044
[junitlauncher]    Aborted: [257] Pivotadddata, 1051, 1052
[junitlauncher]    Aborted: [260] Poke, 1063, 1064
[junitlauncher]    Aborted: [263] Presstool, 1075, 1076
[junitlauncher]    Aborted: [270] Rand, 1103, 1104
[junitlauncher]    Aborted: [273] Reftext, 1115, 1116
[junitlauncher]    Aborted: [274] Register, 1119, 1120
[junitlauncher]    Aborted: [275] Registerid, 1123, 1124
[junitlauncher]    Aborted: [276] Relref, 1127, 1128
[junitlauncher]    Aborted: [277] Renamecommand, 1131, 1132
[junitlauncher]    Aborted: [282] Resettoolbar, 1151, 1152
[junitlauncher]    Aborted: [283] Restart, 1155, 1156
[junitlauncher]    Aborted: [285] Resume, 1163, 1164
[junitlauncher]    Aborted: [292] Row, 1191, 1192
[junitlauncher]    Aborted: [295] Savedialog, 1203, 1204
[junitlauncher]    Aborted: [296] Savetoolbar, 1207, 1208
[junitlauncher]    Aborted: [297] Scenarioget, 1211, 1212
[junitlauncher]    Aborted: [303] Setname, 1235, 1236
[junitlauncher]    Aborted: [304] Setvalue, 1239, 1240
[junitlauncher]    Aborted: [305] Showbar, 1243, 1244
[junitlauncher]    Aborted: [313] Spellingcheck, 1275, 1276
[junitlauncher]    Aborted: [322] Substitute, 1311, 1312
[junitlauncher]    Aborted: [336] Terminate, 1367, 1368
[junitlauncher]    Aborted: [338] Textbox, 1375, 1376
[junitlauncher]    Aborted: [339] Textref, 1379, 1380
[junitlauncher]    Aborted: [340] Time, 1383, 1384
[junitlauncher]    Aborted: [346] Trim, 1407, 1408
[junitlauncher]    Aborted: [352] Unregister, 1431, 1432
[junitlauncher]    Aborted: [355] Value, 1443, 1444
[junitlauncher]    Aborted: [361] Viewget, 1467, 1468
[junitlauncher]    Aborted: [366] Windows, 1487, 1488
[junitlauncher]    Aborted: [367] Windowtitle, 1491, 1492
[junitlauncher] Tests run: 369, Failures: 0, Aborted: 90, Skipped: 0, Time elapsed: 4.334000 sec
[junitlauncher]
[junitlauncher] Running org.apache.poi.xssf.usermodel.TestMatrixFormulasFromXMLSpreadsheet
[junitlauncher] Tests run: 34, Failures: 0, Aborted: 0, Skipped: 0, Time elapsed: 0.139000 sec
[junitlauncher]
[junitlauncher] Running org.apache.poi.xssf.usermodel.TestMissingWorkbookOnXSSF
[junitlauncher] Tests run: 3, Failures: 0, Aborted: 0, Skipped: 0, Time elapsed: 0.028000 sec
[junitlauncher]
[junitlauncher] Running org.apache.poi.xssf.usermodel.TestMultiSheetFormulaEvaluatorOnXSSF
[junitlauncher] Tests run: 2, Failures: 0, Aborted: 0, Skipped: 0, Time elapsed: 0.016000 sec
[junitlauncher]
[junitlauncher] Running org.apache.poi.xssf.usermodel.TestSXSSFBugs
[junitlauncher]    Aborted: bug59393_commentsCanHaveSameAnchor()
[junitlauncher] Tests run: 39, Failures: 0, Aborted: 1, Skipped: 2, Time elapsed: 3.600000 sec
[junitlauncher]
[junitlauncher] Running org.apache.poi.xssf.usermodel.TestSXSSFSheetAutosizeColumn
[junitlauncher] Tests run: 8, Failures: 0, Aborted: 0, Skipped: 0, Time elapsed: 0.044000 sec
[junitlauncher]
[junitlauncher] Running org.apache.poi.xssf.usermodel.TestSheetHiding
[junitlauncher] Tests run: 5, Failures: 0, Aborted: 0, Skipped: 0, Time elapsed: 0.063000 sec
[junitlauncher]
[junitlauncher] Running org.apache.poi.xssf.usermodel.TestTableStyles
[junitlauncher] Tests run: 2, Failures: 0, Aborted: 0, Skipped: 0, Time elapsed: 0.268000 sec
[junitlauncher]
[junitlauncher] Running org.apache.poi.xssf.usermodel.TestXSSFBugs
[junitlauncher]    Aborted: bug59393_commentsCanHaveSameAnchor()
[junitlauncher]    Failed: testWriteDocumentTwice()
[junitlauncher] Tests run: 167, Failures: 1, Aborted: 1, Skipped: 6, Time elapsed: 13.894000 sec

BUILD FAILED
<https://ci-builds.apache.org/job/POI/job/POI-DSL-1.11/ws/build.xml>:1824: The following error occurred while executing this line:
<https://ci-builds.apache.org/job/POI/job/POI-DSL-1.11/ws/build.xml>:1639: The following error occurred while executing this line:
<https://ci-builds.apache.org/job/POI/job/POI-DSL-1.11/ws/build.xml>:1253: Some test(s) have failure(s)

Total time: 20 minutes 26 seconds
Build step 'Invoke Ant' marked build as failure
[SpotBugs] Skipping execution of recorder since overall result is 'FAILURE'
Archiving artifacts
[Fast Archiver] Compressed 8.04 MB of artifacts by 62.2% relative to #37
Skipping publisher since build result is FAILURE
Recording test results

---------------------------------------------------------------------
To unsubscribe, e-mail: [hidden email]
For additional commands, e-mail: [hidden email]

Reply | Threaded
Open this post in threaded view
|

Jenkins build is back to normal : POI » POI-DSL-1.11 #39

Apache Jenkins Server
See <https://ci-builds.apache.org/job/POI/job/POI-DSL-1.11/39/display/redirect?page=changes>


---------------------------------------------------------------------
To unsubscribe, e-mail: [hidden email]
For additional commands, e-mail: [hidden email]