Build failed in Jenkins: POI-DSL-old-Xerces #96

classic Classic list List threaded Threaded
6 messages Options
Reply | Threaded
Open this post in threaded view
|

Build failed in Jenkins: POI-DSL-old-Xerces #96

Apache Jenkins Server
See <https://builds.apache.org/job/POI-DSL-old-Xerces/96/display/redirect?page=changes>

Changes:

[centic] Use different directory for xerces-jar so we do not remove it again as part of check-jars

[kiwiwings] update 3.17 leftovers and provide a new build target to update those in the next release
remove final / beta tags, as we (try to) use semver now

[fanningpj] [bug-62692] issue when using widlfy xml parser

[kiwiwings] update docs to 4.0.0 - fix 3.17 leftovers

[kiwiwings] update docs to 4.0.0

[abearez] import existing chart on current drawing

------------------------------------------
[...truncated 412.90 KB...]
     [java] .I...................................................................................................
     [java] 144/243: listLiteralsQuotesAreStripped_arrayConstructor(org.apache.poi.xssf.usermodel.TestXSSFDataValidationConstraint)
     [java] ....................................................................................................
     [java] 156/243: testSetLeftToRight(org.apache.poi.xssf.usermodel.TestXSSFPrintSetup)
     [java] ...............................................................................................III.I..I..
     [java] 165/243: bug22568(org.apache.poi.xssf.usermodel.TestSXSSFBugs)
     [java] .....I.......I.....I...................................................................................
     [java] 168/243: testCloneStyleSameWB(org.apache.poi.xssf.usermodel.TestXSSFCellStyle)
     [java] ............................................................................E........................
     [java] 179/243: mergedCells(org.apache.poi.xssf.usermodel.TestXSSFSheetAutosizeColumn)
     [java] [Fatal Error] :-1:-1: The parser has encountered more than "1" entity expansions in this document; this is the limit imposed by the application.
     [java] Cleaning up unclosed ZipFile for archive <https://builds.apache.org/job/POI-DSL-old-Xerces/ws/test-data/spreadsheet/54764.xlsx>
     [java] ..........................................I..........................................................
     [java] 184/243: bug56468(org.apache.poi.xssf.usermodel.TestXSSFBugs)
     [java] Cleaning up unclosed ZipFile for archive <https://builds.apache.org/job/POI-DSL-old-Xerces/ws/test-data/spreadsheet/54764.xlsx>
     [java] ....................I......II............I...I........................I.........I.....I.....................
     [java] 185/243: testSetTextSingleParagraph(org.apache.poi.xssf.usermodel.TestXSSFDrawing)
     [java] ...............................................................................................I.I....I
     [java] 191/243: testReferencesToOtherWorkbooks(org.apache.poi.xssf.usermodel.TestXSSFFormulaEvaluation)
     [java] ........................................................I............................................
     [java] 206/243: testCreatePivotTableInOtherSheetThanDataSheet(org.apache.poi.xssf.usermodel.TestXSSFSheet)
     [java] ....................................................................................................
     [java] 208/243: processFunctionRow[LessEqualEval](org.apache.poi.xssf.usermodel.TestFormulaEvaluatorOnXSSF)
     [java] ....................................................................................................
     [java] 208/243: processFunctionRow[Enabletool](org.apache.poi.xssf.usermodel.TestFormulaEvaluatorOnXSSF)
     [java] ....................................................................................................
     [java] 208/243: processFunctionRow[Log10](org.apache.poi.xssf.usermodel.TestFormulaEvaluatorOnXSSF)
     [java] ....................................................................................................
     [java] 208/243: processFunctionRow[Sinh](org.apache.poi.xssf.usermodel.TestFormulaEvaluatorOnXSSF)
     [java] ....................................................................................................
     [java] 216/243: testGetXmlColumnPrs(org.apache.poi.xssf.usermodel.TestXSSFTableColumn)
     [java] .........................I.............................................................E..............
     [java] 232/243: saveToOutputStream(org.apache.poi.openxml4j.opc.TestPackage)
     [java] Cleaning up unclosed ZipFile for archive <https://builds.apache.org/job/POI-DSL-old-Xerces/ws/test-data/openxml4j/TestPackageCommon.docx>
     [java] Exception in thread "main" java.lang.RuntimeException: Tests did not succeed, cannot build ooxml-lite jar
     [java] at org.apache.poi.ooxml.util.OOXMLLite.build(OOXMLLite.java:191)
     [java] at org.apache.poi.ooxml.util.OOXMLLite.main(OOXMLLite.java:107)
     [java] ......I............................................
     [java] Time: 140.013
     [java] There were 4 failures:
     [java] 1) testXMLReader(org.apache.poi.ooxml.util.TestSAXHelper)
     [java] org.xml.sax.SAXNotRecognizedException: http://javax.xml.XMLConstants/feature/secure-processing
     [java] at org.apache.xerces.parsers.AbstractSAXParser.getFeature(Unknown Source)
     [java] at org.apache.poi.ooxml.util.TestSAXHelper.testXMLReader(TestSAXHelper.java:34)
     [java] at sun.reflect.NativeMethodAccessorImpl.invoke0(Native Method)
     [java] at sun.reflect.NativeMethodAccessorImpl.invoke(NativeMethodAccessorImpl.java:62)
     [java] at sun.reflect.DelegatingMethodAccessorImpl.invoke(DelegatingMethodAccessorImpl.java:43)
     [java] at java.lang.reflect.Method.invoke(Method.java:498)
     [java] at org.junit.runners.model.FrameworkMethod$1.runReflectiveCall(FrameworkMethod.java:50)
     [java] at org.junit.internal.runners.model.ReflectiveCallable.run(ReflectiveCallable.java:12)
     [java] at org.junit.runners.model.FrameworkMethod.invokeExplosively(FrameworkMethod.java:47)
     [java] at org.junit.internal.runners.statements.InvokeMethod.evaluate(InvokeMethod.java:17)
     [java] at org.junit.runners.ParentRunner.runLeaf(ParentRunner.java:325)
     [java] at org.junit.runners.BlockJUnit4ClassRunner.runChild(BlockJUnit4ClassRunner.java:78)
     [java] at org.junit.runners.BlockJUnit4ClassRunner.runChild(BlockJUnit4ClassRunner.java:57)
     [java] at org.junit.runners.ParentRunner$3.run(ParentRunner.java:290)
     [java] at org.junit.runners.ParentRunner$1.schedule(ParentRunner.java:71)
     [java] at org.junit.runners.ParentRunner.runChildren(ParentRunner.java:288)
     [java] at org.junit.runners.ParentRunner.access$000(ParentRunner.java:58)
     [java] at org.junit.runners.ParentRunner$2.evaluate(ParentRunner.java:268)
     [java] at org.junit.runners.ParentRunner.run(ParentRunner.java:363)
     [java] at org.junit.runners.Suite.runChild(Suite.java:128)
     [java] at org.junit.runners.Suite.runChild(Suite.java:27)
     [java] at org.junit.runners.ParentRunner$3.run(ParentRunner.java:290)
     [java] at org.junit.runners.ParentRunner$1.schedule(ParentRunner.java:71)
     [java] at org.junit.runners.ParentRunner.runChildren(ParentRunner.java:288)
     [java] at org.junit.runners.ParentRunner.access$000(ParentRunner.java:58)
     [java] at org.junit.runners.ParentRunner$2.evaluate(ParentRunner.java:268)
     [java] at org.junit.runners.ParentRunner.run(ParentRunner.java:363)
     [java] at org.junit.runner.JUnitCore.run(JUnitCore.java:137)
     [java] at org.junit.runner.JUnitCore.run(JUnitCore.java:115)
     [java] at org.junit.runner.JUnitCore.run(JUnitCore.java:105)
     [java] at org.junit.runner.JUnitCore.run(JUnitCore.java:94)
     [java] at org.apache.poi.ooxml.util.OOXMLLite.build(OOXMLLite.java:189)
     [java] at org.apache.poi.ooxml.util.OOXMLLite.main(OOXMLLite.java:107)
     [java] 2) testDocumentBuilderFactory(org.apache.poi.ooxml.util.TestDocumentHelper)
     [java] java.lang.AbstractMethodError: javax.xml.parsers.DocumentBuilderFactory.getFeature(Ljava/lang/String;)Z
     [java] at org.apache.poi.ooxml.util.TestDocumentHelper.testDocumentBuilderFactory(TestDocumentHelper.java:40)
     [java] at sun.reflect.NativeMethodAccessorImpl.invoke0(Native Method)
     [java] at sun.reflect.NativeMethodAccessorImpl.invoke(NativeMethodAccessorImpl.java:62)
     [java] at sun.reflect.DelegatingMethodAccessorImpl.invoke(DelegatingMethodAccessorImpl.java:43)
     [java] at java.lang.reflect.Method.invoke(Method.java:498)
     [java] at org.junit.runners.model.FrameworkMethod$1.runReflectiveCall(FrameworkMethod.java:50)
     [java] at org.junit.internal.runners.model.ReflectiveCallable.run(ReflectiveCallable.java:12)
     [java] at org.junit.runners.model.FrameworkMethod.invokeExplosively(FrameworkMethod.java:47)
     [java] at org.junit.internal.runners.statements.InvokeMethod.evaluate(InvokeMethod.java:17)
     [java] at org.junit.runners.ParentRunner.runLeaf(ParentRunner.java:325)
     [java] at org.junit.runners.BlockJUnit4ClassRunner.runChild(BlockJUnit4ClassRunner.java:78)
     [java] at org.junit.runners.BlockJUnit4ClassRunner.runChild(BlockJUnit4ClassRunner.java:57)
     [java] at org.junit.runners.ParentRunner$3.run(ParentRunner.java:290)
     [java] at org.junit.runners.ParentRunner$1.schedule(ParentRunner.java:71)
     [java] at org.junit.runners.ParentRunner.runChildren(ParentRunner.java:288)
     [java] at org.junit.runners.ParentRunner.access$000(ParentRunner.java:58)
     [java] at org.junit.runners.ParentRunner$2.evaluate(ParentRunner.java:268)
     [java] at org.junit.runners.ParentRunner.run(ParentRunner.java:363)
     [java] at org.junit.runners.Suite.runChild(Suite.java:128)
     [java] at org.junit.runners.Suite.runChild(Suite.java:27)
     [java] at org.junit.runners.ParentRunner$3.run(ParentRunner.java:290)
     [java] at org.junit.runners.ParentRunner$1.schedule(ParentRunner.java:71)
     [java] at org.junit.runners.ParentRunner.runChildren(ParentRunner.java:288)
     [java] at org.junit.runners.ParentRunner.access$000(ParentRunner.java:58)
     [java] at org.junit.runners.ParentRunner$2.evaluate(ParentRunner.java:268)
     [java] at org.junit.runners.ParentRunner.run(ParentRunner.java:363)
     [java] at org.junit.runner.JUnitCore.run(JUnitCore.java:137)
     [java] at org.junit.runner.JUnitCore.run(JUnitCore.java:115)
     [java] at org.junit.runner.JUnitCore.run(JUnitCore.java:105)
     [java] at org.junit.runner.JUnitCore.run(JUnitCore.java:94)
     [java] at org.apache.poi.ooxml.util.OOXMLLite.build(OOXMLLite.java:189)
     [java] at org.apache.poi.ooxml.util.OOXMLLite.main(OOXMLLite.java:107)
     [java] 3) testBuiltinStyleInit(org.apache.poi.xssf.usermodel.TestTableStyles)
     [java] java.lang.AbstractMethodError: org.apache.xml.serialize.DOMSerializerImpl.getDomConfig()Lorg/w3c/dom/DOMConfiguration;
     [java] at org.apache.poi.xssf.usermodel.XSSFBuiltinTableStyle.styleXML(XSSFBuiltinTableStyle.java:424)
     [java] at org.apache.poi.xssf.usermodel.XSSFBuiltinTableStyle.init(XSSFBuiltinTableStyle.java:406)
     [java] at org.apache.poi.xssf.usermodel.XSSFBuiltinTableStyle.getStyle(XSSFBuiltinTableStyle.java:346)
     [java] at org.apache.poi.xssf.usermodel.TestTableStyles.testBuiltinStyleInit(TestTableStyles.java:45)
     [java] at sun.reflect.NativeMethodAccessorImpl.invoke0(Native Method)
     [java] at sun.reflect.NativeMethodAccessorImpl.invoke(NativeMethodAccessorImpl.java:62)
     [java] at sun.reflect.DelegatingMethodAccessorImpl.invoke(DelegatingMethodAccessorImpl.java:43)
     [java] at java.lang.reflect.Method.invoke(Method.java:498)
     [java] at org.junit.runners.model.FrameworkMethod$1.runReflectiveCall(FrameworkMethod.java:50)
     [java] at org.junit.internal.runners.model.ReflectiveCallable.run(ReflectiveCallable.java:12)
     [java] at org.junit.runners.model.FrameworkMethod.invokeExplosively(FrameworkMethod.java:47)
     [java] at org.junit.internal.runners.statements.InvokeMethod.evaluate(InvokeMethod.java:17)
     [java] at org.junit.runners.ParentRunner.runLeaf(ParentRunner.java:325)
     [java] at org.junit.runners.BlockJUnit4ClassRunner.runChild(BlockJUnit4ClassRunner.java:78)
     [java] at org.junit.runners.BlockJUnit4ClassRunner.runChild(BlockJUnit4ClassRunner.java:57)
     [java] at org.junit.runners.ParentRunner$3.run(ParentRunner.java:290)
     [java] at org.junit.runners.ParentRunner$1.schedule(ParentRunner.java:71)
     [java] at org.junit.runners.ParentRunner.runChildren(ParentRunner.java:288)
     [java] at org.junit.runners.ParentRunner.access$000(ParentRunner.java:58)
     [java] at org.junit.runners.ParentRunner$2.evaluate(ParentRunner.java:268)
     [java] at org.junit.runners.ParentRunner.run(ParentRunner.java:363)
     [java] at org.junit.runners.Suite.runChild(Suite.java:128)
     [java] at org.junit.runners.Suite.runChild(Suite.java:27)
     [java] at org.junit.runners.ParentRunner$3.run(ParentRunner.java:290)
     [java] at org.junit.runners.ParentRunner$1.schedule(ParentRunner.java:71)
     [java] at org.junit.runners.ParentRunner.runChildren(ParentRunner.java:288)
     [java] at org.junit.runners.ParentRunner.access$000(ParentRunner.java:58)
     [java] at org.junit.runners.ParentRunner$2.evaluate(ParentRunner.java:268)
     [java] at org.junit.runners.ParentRunner.run(ParentRunner.java:363)
     [java] at org.junit.runner.JUnitCore.run(JUnitCore.java:137)
     [java] at org.junit.runner.JUnitCore.run(JUnitCore.java:115)
     [java] at org.junit.runner.JUnitCore.run(JUnitCore.java:105)
     [java] at org.junit.runner.JUnitCore.run(JUnitCore.java:94)
     [java] at org.apache.poi.ooxml.util.OOXMLLite.build(OOXMLLite.java:189)
     [java] at org.apache.poi.ooxml.util.OOXMLLite.main(OOXMLLite.java:107)
     [java] 4) zipBombCheckSizesWithinLimits(org.apache.poi.openxml4j.opc.TestPackage)
     [java] org.apache.poi.ooxml.POIXMLException: Zip bomb detected! The file would exceed the max size of the expanded data in the zip-file.
     [java] This may indicates that the file is used to inflate memory usage and thus could pose a security risk.
     [java] You can adjust this limit via ZipSecureFile.setMaxEntrySize() if you need to work with files which are very large.
     [java] Uncompressed size: 1048807, Raw/compressed size: 57587
     [java] Limits: MAX_ENTRY_SIZE: 1048783, Entry: xl/sharedStrings.xml
     [java] at org.apache.poi.ooxml.POIXMLFactory.createDocumentPart(POIXMLFactory.java:66)
     [java] at org.apache.poi.ooxml.POIXMLDocumentPart.read(POIXMLDocumentPart.java:648)
     [java] at org.apache.poi.ooxml.POIXMLDocument.load(POIXMLDocument.java:180)
     [java] at org.apache.poi.xssf.usermodel.XSSFWorkbook.<init>(XSSFWorkbook.java:286)
     [java] at org.apache.poi.xssf.usermodel.XSSFWorkbookFactory.createWorkbook(XSSFWorkbookFactory.java:83)
     [java] at org.apache.poi.xssf.usermodel.XSSFWorkbookFactory.createWorkbook(XSSFWorkbookFactory.java:111)
     [java] at sun.reflect.NativeMethodAccessorImpl.invoke0(Native Method)
     [java] at sun.reflect.NativeMethodAccessorImpl.invoke(NativeMethodAccessorImpl.java:62)
     [java] at sun.reflect.DelegatingMethodAccessorImpl.invoke(DelegatingMethodAccessorImpl.java:43)
     [java] at java.lang.reflect.Method.invoke(Method.java:498)
     [java] at org.apache.poi.ss.usermodel.WorkbookFactory.createWorkbook(WorkbookFactory.java:314)
     [java] at org.apache.poi.ss.usermodel.WorkbookFactory.createXSSFWorkbook(WorkbookFactory.java:296)
     [java] at org.apache.poi.ss.usermodel.WorkbookFactory.create(WorkbookFactory.java:284)
     [java] at org.apache.poi.openxml4j.opc.TestPackage.getZipStatsAndConsume(TestPackage.java:938)
     [java] at org.apache.poi.openxml4j.opc.TestPackage.zipBombCheckSizesWithinLimits(TestPackage.java:884)
     [java] at sun.reflect.NativeMethodAccessorImpl.invoke0(Native Method)
     [java] at sun.reflect.NativeMethodAccessorImpl.invoke(NativeMethodAccessorImpl.java:62)
     [java] at sun.reflect.DelegatingMethodAccessorImpl.invoke(DelegatingMethodAccessorImpl.java:43)
     [java] at java.lang.reflect.Method.invoke(Method.java:498)
     [java] at org.junit.runners.model.FrameworkMethod$1.runReflectiveCall(FrameworkMethod.java:50)
     [java] at org.junit.internal.runners.model.ReflectiveCallable.run(ReflectiveCallable.java:12)
     [java] at org.junit.runners.model.FrameworkMethod.invokeExplosively(FrameworkMethod.java:47)
     [java] at org.junit.internal.runners.statements.InvokeMethod.evaluate(InvokeMethod.java:17)
     [java] at org.junit.rules.ExpectedException$ExpectedExceptionStatement.evaluate(ExpectedException.java:239)
     [java] at org.junit.rules.RunRules.evaluate(RunRules.java:20)
     [java] at org.junit.runners.ParentRunner.runLeaf(ParentRunner.java:325)
     [java] at org.junit.runners.BlockJUnit4ClassRunner.runChild(BlockJUnit4ClassRunner.java:78)
     [java] at org.junit.runners.BlockJUnit4ClassRunner.runChild(BlockJUnit4ClassRunner.java:57)
     [java] at org.junit.runners.ParentRunner$3.run(ParentRunner.java:290)
     [java] at org.junit.runners.ParentRunner$1.schedule(ParentRunner.java:71)
     [java] at org.junit.runners.ParentRunner.runChildren(ParentRunner.java:288)
     [java] at org.junit.runners.ParentRunner.access$000(ParentRunner.java:58)
     [java] at org.junit.runners.ParentRunner$2.evaluate(ParentRunner.java:268)
     [java] at org.junit.runners.ParentRunner.run(ParentRunner.java:363)
     [java] at org.junit.runners.Suite.runChild(Suite.java:128)
     [java] at org.junit.runners.Suite.runChild(Suite.java:27)
     [java] at org.junit.runners.ParentRunner$3.run(ParentRunner.java:290)
     [java] at org.junit.runners.ParentRunner$1.schedule(ParentRunner.java:71)
     [java] at org.junit.runners.ParentRunner.runChildren(ParentRunner.java:288)
     [java] at org.junit.runners.ParentRunner.access$000(ParentRunner.java:58)
     [java] at org.junit.runners.ParentRunner$2.evaluate(ParentRunner.java:268)
     [java] at org.junit.runners.ParentRunner.run(ParentRunner.java:363)
     [java] at org.junit.runner.JUnitCore.run(JUnitCore.java:137)
     [java] at org.junit.runner.JUnitCore.run(JUnitCore.java:115)
     [java] at org.junit.runner.JUnitCore.run(JUnitCore.java:105)
     [java] at org.junit.runner.JUnitCore.run(JUnitCore.java:94)
     [java] at org.apache.poi.ooxml.util.OOXMLLite.build(OOXMLLite.java:189)
     [java] at org.apache.poi.ooxml.util.OOXMLLite.main(OOXMLLite.java:107)
     [java] Caused by: java.lang.reflect.InvocationTargetException
     [java] at sun.reflect.GeneratedConstructorAccessor304.newInstance(Unknown Source)
     [java] at sun.reflect.DelegatingConstructorAccessorImpl.newInstance(DelegatingConstructorAccessorImpl.java:45)
     [java] at java.lang.reflect.Constructor.newInstance(Constructor.java:423)
     [java] at org.apache.poi.xssf.usermodel.XSSFFactory.createDocumentPart(XSSFFactory.java:56)
     [java] at org.apache.poi.ooxml.POIXMLFactory.createDocumentPart(POIXMLFactory.java:63)
     [java] ... 47 more
     [java] Caused by: java.io.IOException: Zip bomb detected! The file would exceed the max size of the expanded data in the zip-file.
     [java] This may indicates that the file is used to inflate memory usage and thus could pose a security risk.
     [java] You can adjust this limit via ZipSecureFile.setMaxEntrySize() if you need to work with files which are very large.
     [java] Uncompressed size: 1048807, Raw/compressed size: 57587
     [java] Limits: MAX_ENTRY_SIZE: 1048783, Entry: xl/sharedStrings.xml
     [java] at org.apache.poi.openxml4j.util.ZipArchiveThresholdInputStream.checkThreshold(ZipArchiveThresholdInputStream.java:116)
     [java] at org.apache.poi.openxml4j.util.ZipArchiveThresholdInputStream.read(ZipArchiveThresholdInputStream.java:80)
     [java] at org.apache.xerces.impl.XMLEntityManager$RewindableInputStream.read(Unknown Source)
     [java] at org.apache.xerces.impl.io.UTF8Reader.read(Unknown Source)
     [java] at org.apache.xerces.impl.XMLEntityScanner.load(Unknown Source)
     [java] at org.apache.xerces.impl.XMLEntityScanner.scanContent(Unknown Source)
     [java] at org.apache.xerces.impl.XMLDocumentFragmentScannerImpl.scanContent(Unknown Source)
     [java] at org.apache.xerces.impl.XMLDocumentFragmentScannerImpl$FragmentContentDispatcher.dispatch(Unknown Source)
     [java] at org.apache.xerces.impl.XMLDocumentFragmentScannerImpl.scanDocument(Unknown Source)
     [java] at org.apache.xerces.parsers.XML11Configuration.parse(Unknown Source)
     [java] at org.apache.xerces.parsers.XML11Configuration.parse(Unknown Source)
     [java] at org.apache.xerces.parsers.XMLParser.parse(Unknown Source)
     [java] at org.apache.xerces.parsers.AbstractSAXParser.parse(Unknown Source)
     [java] at org.apache.xmlbeans.impl.store.Locale$SaxLoader.load(Locale.java:3414)
     [java] at org.apache.xmlbeans.impl.store.Locale.parseToXmlObject(Locale.java:1272)
     [java] at org.apache.xmlbeans.impl.store.Locale.parseToXmlObject(Locale.java:1259)
     [java] at org.apache.xmlbeans.impl.schema.SchemaTypeLoaderBase.parse(SchemaTypeLoaderBase.java:345)
     [java] at org.openxmlformats.schemas.spreadsheetml.x2006.main.SstDocument$Factory.parse(Unknown Source)
     [java] at org.apache.poi.xssf.model.SharedStringsTable.readFrom(SharedStringsTable.java:123)
     [java] at org.apache.poi.xssf.model.SharedStringsTable.<init>(SharedStringsTable.java:111)
     [java] ... 52 more
     [java]
     [java] FAILURES!!!
     [java] Tests run: 2449,  Failures: 4
     [java]

BUILD FAILED
<https://builds.apache.org/job/POI-DSL-old-Xerces/ws/build.xml>:1677: Java returned: 1

Total time: 5 minutes 15 seconds
Build step 'Invoke Ant' marked build as failure
Skipping publisher since build result is FAILURE
Archiving artifacts
[Fast Archiver] Compressed 59.98 MB of artifacts by 59.5% relative to #95
Skipping publisher since build result is FAILURE
Recording test results
ERROR: Step ?Publish JUnit test result report? failed: No test report files were found. Configuration error?

---------------------------------------------------------------------
To unsubscribe, e-mail: [hidden email]
For additional commands, e-mail: [hidden email]

Reply | Threaded
Open this post in threaded view
|

Build failed in Jenkins: POI-DSL-old-Xerces #97

Apache Jenkins Server
See <https://builds.apache.org/job/POI-DSL-old-Xerces/97/display/redirect?page=changes>

Changes:

[fanningpj] handle test issues when running with old xerces

[kiwiwings] #62699 - Download page must link to https://www.apache.org/dist/poi/KEYS

------------------------------------------
[...truncated 28.57 KB...]
     [java] thread: 8, iter: 30: build/tmp/poifiles/TestTempFileThreaded/26/TestTempFile-8-30-2850813234404991688.xlsx
     [java] thread: 6, iter: 30: build/tmp/poifiles/TestTempFileThreaded/24/TestTempFile-6-30-4040412128119042475.xlsx
     [java] thread: 4, iter: 30: build/tmp/poifiles/TestTempFileThreaded/22/TestTempFile-4-30-4077467008898258081.xlsx
     [java] thread: 7, iter: 60: build/tmp/poifiles/TestTempFileThreaded/25/TestTempFile-7-60-1127683456122713099.xlsx
     [java] thread: 9, iter: 60: build/tmp/poifiles/TestTempFileThreaded/27/TestTempFile-9-60-1560301501819235714.xlsx
     [java] thread: 2, iter: 60: build/tmp/poifiles/TestTempFileThreaded/20/TestTempFile-2-60-5091924461163332712.xlsx
     [java] thread: 0, iter: 60: build/tmp/poifiles/TestTempFileThreaded/18/TestTempFile-0-60-1266562805172346488.xlsx
     [java] thread: 1, iter: 60: build/tmp/poifiles/TestTempFileThreaded/19/TestTempFile-1-60-8737293401170475450.xlsx
     [java] thread: 3, iter: 60: build/tmp/poifiles/TestTempFileThreaded/21/TestTempFile-3-60-9074508611898956082.xlsx
     [java] thread: 5, iter: 60: build/tmp/poifiles/TestTempFileThreaded/23/TestTempFile-5-60-72850952631821580.xlsx
     [java] thread: 8, iter: 60: build/tmp/poifiles/TestTempFileThreaded/26/TestTempFile-8-60-3039103377993778102.xlsx
     [java] thread: 6, iter: 60: build/tmp/poifiles/TestTempFileThreaded/24/TestTempFile-6-60-8443625112153918858.xlsx
     [java] thread: 4, iter: 60: build/tmp/poifiles/TestTempFileThreaded/22/TestTempFile-4-60-9045004586306367038.xlsx
     [java] thread: 9, iter: 90: build/tmp/poifiles/TestTempFileThreaded/27/TestTempFile-9-90-2960184071347525148.xlsx
     [java] thread: 7, iter: 90: build/tmp/poifiles/TestTempFileThreaded/25/TestTempFile-7-90-3966952475489351710.xlsx
     [java] thread: 1, iter: 90: build/tmp/poifiles/TestTempFileThreaded/19/TestTempFile-1-90-46359397637591180.xlsx
     [java] thread: 0, iter: 90: build/tmp/poifiles/TestTempFileThreaded/18/TestTempFile-0-90-2121313045566044450.xlsx
     [java] thread: 2, iter: 90: build/tmp/poifiles/TestTempFileThreaded/20/TestTempFile-2-90-8847557287646069544.xlsx
     [java] thread: 5, iter: 90: build/tmp/poifiles/TestTempFileThreaded/23/TestTempFile-5-90-8115671755610008372.xlsx
     [java] thread: 3, iter: 90: build/tmp/poifiles/TestTempFileThreaded/21/TestTempFile-3-90-649095990008662205.xlsx
     [java] thread: 6, iter: 90: build/tmp/poifiles/TestTempFileThreaded/24/TestTempFile-6-90-1103429525435735315.xlsx
     [java] thread: 4, iter: 90: build/tmp/poifiles/TestTempFileThreaded/22/TestTempFile-4-90-8368019546426459338.xlsx
     [java] thread: 8, iter: 90: build/tmp/poifiles/TestTempFileThreaded/26/TestTempFile-8-90-675643936861716446.xlsx
     [java] thread: 0, iter: 120: build/tmp/poifiles/TestTempFileThreaded/18/TestTempFile-0-120-8559410537900004733.xlsx
     [java] thread: 9, iter: 120: build/tmp/poifiles/TestTempFileThreaded/27/TestTempFile-9-120-1057790711827360345.xlsx
     [java] thread: 7, iter: 120: build/tmp/poifiles/TestTempFileThreaded/25/TestTempFile-7-120-7695037568646901197.xlsx
     [java] thread: 6, iter: 120: build/tmp/poifiles/TestTempFileThreaded/24/TestTempFile-6-120-295743862183928797.xlsx
     [java] thread: 1, iter: 120: build/tmp/poifiles/TestTempFileThreaded/19/TestTempFile-1-120-8480498003228263589.xlsx
     [java] thread: 2, iter: 120: build/tmp/poifiles/TestTempFileThreaded/20/TestTempFile-2-120-2259030933607741070.xlsx
     [java] thread: 4, iter: 120: build/tmp/poifiles/TestTempFileThreaded/22/TestTempFile-4-120-5732820358123449468.xlsx
     [java] thread: 5, iter: 120: build/tmp/poifiles/TestTempFileThreaded/23/TestTempFile-5-120-3775925119865792781.xlsx
     [java] thread: 3, iter: 120: build/tmp/poifiles/TestTempFileThreaded/21/TestTempFile-3-120-3791816885895357697.xlsx
     [java] thread: 8, iter: 120: build/tmp/poifiles/TestTempFileThreaded/26/TestTempFile-8-120-6823771472456449123.xlsx
     [java] thread: 6, iter: 150: build/tmp/poifiles/TestTempFileThreaded/24/TestTempFile-6-150-2866065056454838481.xlsx
     [java] thread: 0, iter: 150: build/tmp/poifiles/TestTempFileThreaded/18/TestTempFile-0-150-2907064464195037353.xlsx
     [java] thread: 9, iter: 150: build/tmp/poifiles/TestTempFileThreaded/27/TestTempFile-9-150-3185561164425345878.xlsx
     [java] thread: 7, iter: 150: build/tmp/poifiles/TestTempFileThreaded/25/TestTempFile-7-150-1933820927858347239.xlsx
     [java] thread: 2, iter: 150: build/tmp/poifiles/TestTempFileThreaded/20/TestTempFile-2-150-7199766502729647242.xlsx
     [java] thread: 5, iter: 150: build/tmp/poifiles/TestTempFileThreaded/23/TestTempFile-5-150-9099361590248754609.xlsx
     [java] thread: 4, iter: 150: build/tmp/poifiles/TestTempFileThreaded/22/TestTempFile-4-150-8346362531361755810.xlsx
     [java] thread: 3, iter: 150: build/tmp/poifiles/TestTempFileThreaded/21/TestTempFile-3-150-8362207121002825766.xlsx
     [java] thread: 1, iter: 150: build/tmp/poifiles/TestTempFileThreaded/19/TestTempFile-1-150-2264417740700792064.xlsx
     [java] thread: 8, iter: 150: build/tmp/poifiles/TestTempFileThreaded/26/TestTempFile-8-150-6169992689572053655.xlsx
     [java] thread: 6, iter: 180: build/tmp/poifiles/TestTempFileThreaded/24/TestTempFile-6-180-8230412625152643206.xlsx
     [java] thread: 0, iter: 180: build/tmp/poifiles/TestTempFileThreaded/18/TestTempFile-0-180-5010418592507256673.xlsx
     [java] thread: 9, iter: 180: build/tmp/poifiles/TestTempFileThreaded/27/TestTempFile-9-180-5059291639734523795.xlsx
     [java] thread: 1, iter: 180: build/tmp/poifiles/TestTempFileThreaded/19/TestTempFile-1-180-1195559309059384272.xlsx
     [java] thread: 2, iter: 180: build/tmp/poifiles/TestTempFileThreaded/20/TestTempFile-2-180-1336639708253769621.xlsx
     [java] thread: 7, iter: 180: build/tmp/poifiles/TestTempFileThreaded/25/TestTempFile-7-180-8753088222803129561.xlsx
     [java] thread: 5, iter: 180: build/tmp/poifiles/TestTempFileThreaded/23/TestTempFile-5-180-4129400727589635118.xlsx
     [java] thread: 3, iter: 180: build/tmp/poifiles/TestTempFileThreaded/21/TestTempFile-3-180-2445039720406258467.xlsx
     [java] thread: 4, iter: 180: build/tmp/poifiles/TestTempFileThreaded/22/TestTempFile-4-180-7380032263507360893.xlsx
     [java] thread: 8, iter: 180: build/tmp/poifiles/TestTempFileThreaded/26/TestTempFile-8-180-8303758253210968644.xlsx
     [java] ...................................................I...........................
     [java] 29/243: testCreateRow(org.apache.poi.xwpf.usermodel.TestXWPFTable)
     [java] ......................I..............................................................................
     [java] 43/243: testAddPicture(org.apache.poi.xwpf.usermodel.TestXWPFRun)
     [java] ....................................................................................................
     [java] 65/243: testWriteSelectEnableLocking(org.apache.poi.xssf.TestSheetProtection)
     [java] ............I........................................................................................
     [java] 73/243: bug55723(org.apache.poi.xssf.streaming.TestSXSSFSheet)
     [java] ..................................II........................................................I..I..I......
     [java] 79/243: useSharedStringsTable(org.apache.poi.xssf.streaming.TestSXSSFWorkbook)
     [java] ....................................................................................................
     [java] 87/243: testGetErrorCellValueFromFormulaCell(org.apache.poi.xssf.usermodel.TestXSSFCell)
     [java] ....................................................................................................
     [java] 92/243: getNumCellStyles(org.apache.poi.xssf.usermodel.TestXSSFWorkbook)
     [java] ....................................................................................................
     [java] 95/243: bug58996_UsedToWorkIn3_11_ButNotIn3_13(org.apache.poi.xssf.usermodel.TestXSSFCellStyle)
     [java] ....................................................................................................
     [java] 110/243: test53568(org.apache.poi.xssf.usermodel.TestXSSFPictureData)
     [java] .................................................................I.I....I..............................
     [java] 118/243: test55640_VerifyCasesSpec(org.apache.poi.xssf.usermodel.TestXSSFSheetRowGrouping)
     [java] ......I.................................................................I.............................
     [java] 135/243: testCreateDialogSheet(org.apache.poi.xssf.usermodel.TestXSSFDialogSheet)
     [java] [Fatal Error] :-1:-1: The parser has encountered more than "1" entity expansions in this document; this is the limit imposed by the application.
     [java] Cleaning up unclosed ZipFile for archive <https://builds.apache.org/job/POI-DSL-old-Xerces/ws/test-data/spreadsheet/54764.xlsx>
     [java] ...................................................................................................I.
     [java] 141/243: test56467(org.apache.poi.xssf.usermodel.TestXSSFBugs)
     [java] Cleaning up unclosed ZipFile for archive <https://builds.apache.org/job/POI-DSL-old-Xerces/ws/test-data/spreadsheet/54764.xlsx>
     [java] .....II............I...I........................I.........I.....I.............E.III.I..I.......I.......I.....I......
     [java] 143/243: bug50681_testAutoSize(org.apache.poi.xssf.usermodel.TestSXSSFBugs)
     [java] ....................................................................................................
     [java] 156/243: stringCells(org.apache.poi.xssf.usermodel.TestXSSFSheetAutosizeColumn)
     [java] ....................................................................................................
     [java] 157/243: processFunctionRow[Dialogbox](org.apache.poi.xssf.usermodel.TestFormulaEvaluatorOnXSSF)
     [java] ....................................................................................................
     [java] 157/243: processFunctionRow[Ispmt](org.apache.poi.xssf.usermodel.TestFormulaEvaluatorOnXSSF)
     [java] ....................................................................................................
     [java] 157/243: processFunctionRow[Rsq](org.apache.poi.xssf.usermodel.TestFormulaEvaluatorOnXSSF)
     [java] ....................................................................................................
     [java] 158/243: protectSheet_emptyPassword(org.apache.poi.xssf.usermodel.TestXSSFSheet)
     [java] ....................................................................................................
     [java] 164/243: populateNew(org.apache.poi.xssf.model.TestStylesTable)
     [java] ...............................I.....................................................................
     [java] 176/243: setCellStyleProperty(org.apache.poi.ss.util.TestSXSSFCellUtil)
     [java] ....................................................................I................................
     [java] 199/243: createGetsContentTypes(org.apache.poi.openxml4j.opc.TestPackage)
     [java] ....E....................I..........................I..................................................
     [java] 212/243: testProblemClasses(org.apache.poi.xslf.TestNecessaryOOXMLClasses)
     [java] Cleaning up unclosed ZipFile for archive <https://builds.apache.org/job/POI-DSL-old-Xerces/ws/test-data/openxml4j/TestPackageCommon.docx>
     [java] ....................................................................................................
     [java] 236/243: getXmlObject(org.apache.poi.xslf.usermodel.TestXSLFTableRow)
     [java] Exception in thread "main" java.lang.RuntimeException: Tests did not succeed, cannot build ooxml-lite jar
     [java] at org.apache.poi.ooxml.util.OOXMLLite.build(OOXMLLite.java:191)
     [java] at org.apache.poi.ooxml.util.OOXMLLite.main(OOXMLLite.java:107)
     [java] ................I.I.................................
     [java] Time: 165.946
     [java] There were 2 failures:
     [java] 1) testBuiltinStyleInit(org.apache.poi.xssf.usermodel.TestTableStyles)
     [java] java.lang.AbstractMethodError: org.apache.xml.serialize.DOMSerializerImpl.getDomConfig()Lorg/w3c/dom/DOMConfiguration;
     [java] at org.apache.poi.xssf.usermodel.XSSFBuiltinTableStyle.styleXML(XSSFBuiltinTableStyle.java:424)
     [java] at org.apache.poi.xssf.usermodel.XSSFBuiltinTableStyle.init(XSSFBuiltinTableStyle.java:406)
     [java] at org.apache.poi.xssf.usermodel.XSSFBuiltinTableStyle.getStyle(XSSFBuiltinTableStyle.java:346)
     [java] at org.apache.poi.xssf.usermodel.TestTableStyles.testBuiltinStyleInit(TestTableStyles.java:45)
     [java] at sun.reflect.NativeMethodAccessorImpl.invoke0(Native Method)
     [java] at sun.reflect.NativeMethodAccessorImpl.invoke(NativeMethodAccessorImpl.java:62)
     [java] at sun.reflect.DelegatingMethodAccessorImpl.invoke(DelegatingMethodAccessorImpl.java:43)
     [java] at java.lang.reflect.Method.invoke(Method.java:498)
     [java] at org.junit.runners.model.FrameworkMethod$1.runReflectiveCall(FrameworkMethod.java:50)
     [java] at org.junit.internal.runners.model.ReflectiveCallable.run(ReflectiveCallable.java:12)
     [java] at org.junit.runners.model.FrameworkMethod.invokeExplosively(FrameworkMethod.java:47)
     [java] at org.junit.internal.runners.statements.InvokeMethod.evaluate(InvokeMethod.java:17)
     [java] at org.junit.runners.ParentRunner.runLeaf(ParentRunner.java:325)
     [java] at org.junit.runners.BlockJUnit4ClassRunner.runChild(BlockJUnit4ClassRunner.java:78)
     [java] at org.junit.runners.BlockJUnit4ClassRunner.runChild(BlockJUnit4ClassRunner.java:57)
     [java] at org.junit.runners.ParentRunner$3.run(ParentRunner.java:290)
     [java] at org.junit.runners.ParentRunner$1.schedule(ParentRunner.java:71)
     [java] at org.junit.runners.ParentRunner.runChildren(ParentRunner.java:288)
     [java] at org.junit.runners.ParentRunner.access$000(ParentRunner.java:58)
     [java] at org.junit.runners.ParentRunner$2.evaluate(ParentRunner.java:268)
     [java] at org.junit.runners.ParentRunner.run(ParentRunner.java:363)
     [java] at org.junit.runners.Suite.runChild(Suite.java:128)
     [java] at org.junit.runners.Suite.runChild(Suite.java:27)
     [java] at org.junit.runners.ParentRunner$3.run(ParentRunner.java:290)
     [java] at org.junit.runners.ParentRunner$1.schedule(ParentRunner.java:71)
     [java] at org.junit.runners.ParentRunner.runChildren(ParentRunner.java:288)
     [java] at org.junit.runners.ParentRunner.access$000(ParentRunner.java:58)
     [java] at org.junit.runners.ParentRunner$2.evaluate(ParentRunner.java:268)
     [java] at org.junit.runners.ParentRunner.run(ParentRunner.java:363)
     [java] at org.junit.runner.JUnitCore.run(JUnitCore.java:137)
     [java] at org.junit.runner.JUnitCore.run(JUnitCore.java:115)
     [java] at org.junit.runner.JUnitCore.run(JUnitCore.java:105)
     [java] at org.junit.runner.JUnitCore.run(JUnitCore.java:94)
     [java] at org.apache.poi.ooxml.util.OOXMLLite.build(OOXMLLite.java:189)
     [java] at org.apache.poi.ooxml.util.OOXMLLite.main(OOXMLLite.java:107)
     [java] 2) zipBombCheckSizesWithinLimits(org.apache.poi.openxml4j.opc.TestPackage)
     [java] org.apache.poi.ooxml.POIXMLException: Zip bomb detected! The file would exceed the max size of the expanded data in the zip-file.
     [java] This may indicates that the file is used to inflate memory usage and thus could pose a security risk.
     [java] You can adjust this limit via ZipSecureFile.setMaxEntrySize() if you need to work with files which are very large.
     [java] Uncompressed size: 1048807, Raw/compressed size: 57587
     [java] Limits: MAX_ENTRY_SIZE: 1048783, Entry: xl/sharedStrings.xml
     [java] at org.apache.poi.ooxml.POIXMLFactory.createDocumentPart(POIXMLFactory.java:66)
     [java] at org.apache.poi.ooxml.POIXMLDocumentPart.read(POIXMLDocumentPart.java:648)
     [java] at org.apache.poi.ooxml.POIXMLDocument.load(POIXMLDocument.java:180)
     [java] at org.apache.poi.xssf.usermodel.XSSFWorkbook.<init>(XSSFWorkbook.java:286)
     [java] at org.apache.poi.xssf.usermodel.XSSFWorkbookFactory.createWorkbook(XSSFWorkbookFactory.java:83)
     [java] at org.apache.poi.xssf.usermodel.XSSFWorkbookFactory.createWorkbook(XSSFWorkbookFactory.java:111)
     [java] at sun.reflect.NativeMethodAccessorImpl.invoke0(Native Method)
     [java] at sun.reflect.NativeMethodAccessorImpl.invoke(NativeMethodAccessorImpl.java:62)
     [java] at sun.reflect.DelegatingMethodAccessorImpl.invoke(DelegatingMethodAccessorImpl.java:43)
     [java] at java.lang.reflect.Method.invoke(Method.java:498)
     [java] at org.apache.poi.ss.usermodel.WorkbookFactory.createWorkbook(WorkbookFactory.java:314)
     [java] at org.apache.poi.ss.usermodel.WorkbookFactory.createXSSFWorkbook(WorkbookFactory.java:296)
     [java] at org.apache.poi.ss.usermodel.WorkbookFactory.create(WorkbookFactory.java:284)
     [java] at org.apache.poi.openxml4j.opc.TestPackage.getZipStatsAndConsume(TestPackage.java:938)
     [java] at org.apache.poi.openxml4j.opc.TestPackage.zipBombCheckSizesWithinLimits(TestPackage.java:884)
     [java] at sun.reflect.NativeMethodAccessorImpl.invoke0(Native Method)
     [java] at sun.reflect.NativeMethodAccessorImpl.invoke(NativeMethodAccessorImpl.java:62)
     [java] at sun.reflect.DelegatingMethodAccessorImpl.invoke(DelegatingMethodAccessorImpl.java:43)
     [java] at java.lang.reflect.Method.invoke(Method.java:498)
     [java] at org.junit.runners.model.FrameworkMethod$1.runReflectiveCall(FrameworkMethod.java:50)
     [java] at org.junit.internal.runners.model.ReflectiveCallable.run(ReflectiveCallable.java:12)
     [java] at org.junit.runners.model.FrameworkMethod.invokeExplosively(FrameworkMethod.java:47)
     [java] at org.junit.internal.runners.statements.InvokeMethod.evaluate(InvokeMethod.java:17)
     [java] at org.junit.rules.ExpectedException$ExpectedExceptionStatement.evaluate(ExpectedException.java:239)
     [java] at org.junit.rules.RunRules.evaluate(RunRules.java:20)
     [java] at org.junit.runners.ParentRunner.runLeaf(ParentRunner.java:325)
     [java] at org.junit.runners.BlockJUnit4ClassRunner.runChild(BlockJUnit4ClassRunner.java:78)
     [java] at org.junit.runners.BlockJUnit4ClassRunner.runChild(BlockJUnit4ClassRunner.java:57)
     [java] at org.junit.runners.ParentRunner$3.run(ParentRunner.java:290)
     [java] at org.junit.runners.ParentRunner$1.schedule(ParentRunner.java:71)
     [java] at org.junit.runners.ParentRunner.runChildren(ParentRunner.java:288)
     [java] at org.junit.runners.ParentRunner.access$000(ParentRunner.java:58)
     [java] at org.junit.runners.ParentRunner$2.evaluate(ParentRunner.java:268)
     [java] at org.junit.runners.ParentRunner.run(ParentRunner.java:363)
     [java] at org.junit.runners.Suite.runChild(Suite.java:128)
     [java] at org.junit.runners.Suite.runChild(Suite.java:27)
     [java] at org.junit.runners.ParentRunner$3.run(ParentRunner.java:290)
     [java] at org.junit.runners.ParentRunner$1.schedule(ParentRunner.java:71)
     [java] at org.junit.runners.ParentRunner.runChildren(ParentRunner.java:288)
     [java] at org.junit.runners.ParentRunner.access$000(ParentRunner.java:58)
     [java] at org.junit.runners.ParentRunner$2.evaluate(ParentRunner.java:268)
     [java] at org.junit.runners.ParentRunner.run(ParentRunner.java:363)
     [java] at org.junit.runner.JUnitCore.run(JUnitCore.java:137)
     [java] at org.junit.runner.JUnitCore.run(JUnitCore.java:115)
     [java] at org.junit.runner.JUnitCore.run(JUnitCore.java:105)
     [java] at org.junit.runner.JUnitCore.run(JUnitCore.java:94)
     [java] at org.apache.poi.ooxml.util.OOXMLLite.build(OOXMLLite.java:189)
     [java] at org.apache.poi.ooxml.util.OOXMLLite.main(OOXMLLite.java:107)
     [java] Caused by: java.lang.reflect.InvocationTargetException
     [java] at sun.reflect.GeneratedConstructorAccessor444.newInstance(Unknown Source)
     [java] at sun.reflect.DelegatingConstructorAccessorImpl.newInstance(DelegatingConstructorAccessorImpl.java:45)
     [java] at java.lang.reflect.Constructor.newInstance(Constructor.java:423)
     [java] at org.apache.poi.xssf.usermodel.XSSFFactory.createDocumentPart(XSSFFactory.java:56)
     [java] at org.apache.poi.ooxml.POIXMLFactory.createDocumentPart(POIXMLFactory.java:63)
     [java] ... 47 more
     [java] Caused by: java.io.IOException: Zip bomb detected! The file would exceed the max size of the expanded data in the zip-file.
     [java] This may indicates that the file is used to inflate memory usage and thus could pose a security risk.
     [java] You can adjust this limit via ZipSecureFile.setMaxEntrySize() if you need to work with files which are very large.
     [java] Uncompressed size: 1048807, Raw/compressed size: 57587
     [java] Limits: MAX_ENTRY_SIZE: 1048783, Entry: xl/sharedStrings.xml
     [java] at org.apache.poi.openxml4j.util.ZipArchiveThresholdInputStream.checkThreshold(ZipArchiveThresholdInputStream.java:116)
     [java] at org.apache.poi.openxml4j.util.ZipArchiveThresholdInputStream.read(ZipArchiveThresholdInputStream.java:80)
     [java] at org.apache.xerces.impl.XMLEntityManager$RewindableInputStream.read(Unknown Source)
     [java] at org.apache.xerces.impl.io.UTF8Reader.read(Unknown Source)
     [java] at org.apache.xerces.impl.XMLEntityScanner.load(Unknown Source)
     [java] at org.apache.xerces.impl.XMLEntityScanner.scanContent(Unknown Source)
     [java] at org.apache.xerces.impl.XMLDocumentFragmentScannerImpl.scanContent(Unknown Source)
     [java] at org.apache.xerces.impl.XMLDocumentFragmentScannerImpl$FragmentContentDispatcher.dispatch(Unknown Source)
     [java] at org.apache.xerces.impl.XMLDocumentFragmentScannerImpl.scanDocument(Unknown Source)
     [java] at org.apache.xerces.parsers.XML11Configuration.parse(Unknown Source)
     [java] at org.apache.xerces.parsers.XML11Configuration.parse(Unknown Source)
     [java] at org.apache.xerces.parsers.XMLParser.parse(Unknown Source)
     [java] at org.apache.xerces.parsers.AbstractSAXParser.parse(Unknown Source)
     [java] at org.apache.xmlbeans.impl.store.Locale$SaxLoader.load(Locale.java:3414)
     [java] at org.apache.xmlbeans.impl.store.Locale.parseToXmlObject(Locale.java:1272)
     [java] at org.apache.xmlbeans.impl.store.Locale.parseToXmlObject(Locale.java:1259)
     [java] at org.apache.xmlbeans.impl.schema.SchemaTypeLoaderBase.parse(SchemaTypeLoaderBase.java:345)
     [java] at org.openxmlformats.schemas.spreadsheetml.x2006.main.SstDocument$Factory.parse(Unknown Source)
     [java] at org.apache.poi.xssf.model.SharedStringsTable.readFrom(SharedStringsTable.java:123)
     [java] at org.apache.poi.xssf.model.SharedStringsTable.<init>(SharedStringsTable.java:111)
     [java] ... 52 more
     [java]
     [java] FAILURES!!!
     [java] Tests run: 2449,  Failures: 2
     [java]

BUILD FAILED
<https://builds.apache.org/job/POI-DSL-old-Xerces/ws/build.xml>:1677: Java returned: 1

Total time: 5 minutes 55 seconds
Build step 'Invoke Ant' marked build as failure
Skipping publisher since build result is FAILURE
Archiving artifacts
[Fast Archiver] Compressed 59.98 MB of artifacts by 59.5% relative to #95
Skipping publisher since build result is FAILURE
Recording test results
ERROR: Step ?Publish JUnit test result report? failed: No test report files were found. Configuration error?

---------------------------------------------------------------------
To unsubscribe, e-mail: [hidden email]
For additional commands, e-mail: [hidden email]

Reply | Threaded
Open this post in threaded view
|

Build failed in Jenkins: POI-DSL-old-Xerces #98

Apache Jenkins Server
See <https://builds.apache.org/job/POI-DSL-old-Xerces/98/display/redirect?page=changes>

Changes:

[fanningpj] [bug-62747] bouncycastle 1.60

[fanningpj] [bug-62747] bouncycastle 1.60

[fanningpj] update related projects

[fanningpj] [bug-62742] add commons-compress jar to bin zip

[gwoolsey] Bug 62740 - XSSFTable constructor automatically assigns invalid (non-unique) column IDs

fix the logic and update the unit test to check for and catch the problem.

[Nick] Mention Commons Compress is needed for OOXML, bump xmlbeans and ooxml-schemas versions referenced

[fanningpj] [bug-62738] make int cast a long cast in randbetween

[fanningpj] add reflections jar to mvn sonar build

[fanningpj] fix forbidden-apis check

[fanningpj] add ooxml-schemas enum classes to poi-ooxml-schemas

[fanningpj] [bug-62730] include all inner list classes in poi-ooxml-schemas.jar

[fanningpj] update commons-codec dependency in pom.xml to 1.11 (to match compile time)

[fanningpj] move commons-math3 dependency to poi pom.xml

[fanningpj] [bug-62690] change poi-ooxml pom.xml to have explicit dependency on commons-math3 3.6.1

[fanningpj] [bug-62735] change poi-ooxml pom.xml to have dependency on curvesapi 1.05

[fanningpj] [bug-62733] XSLFBackground setFill() can corrupt the document

------------------------------------------
[...truncated 406.00 KB...]
     [java] thread: 7, iter: 30: build/tmp/poifiles/TestTempFileThreaded/16/TestTempFile-7-30-8322784279651667754.xlsx
     [java] thread: 4, iter: 30: build/tmp/poifiles/TestTempFileThreaded/13/TestTempFile-4-30-7351968951314109013.xlsx
     [java] thread: 0, iter: 30: build/tmp/poifiles/TestTempFileThreaded/9/TestTempFile-0-30-2425712272619465722.xlsx
     [java] thread: 3, iter: 30: build/tmp/poifiles/TestTempFileThreaded/12/TestTempFile-3-30-6011371082317379266.xlsx
     [java] thread: 1, iter: 60: build/tmp/poifiles/TestTempFileThreaded/10/TestTempFile-1-60-7497859756952356470.xlsx
     [java] thread: 9, iter: 60: build/tmp/poifiles/TestTempFileThreaded/18/TestTempFile-9-60-7712632403540272946.xlsx
     [java] thread: 6, iter: 60: build/tmp/poifiles/TestTempFileThreaded/15/TestTempFile-6-60-7594114785686599581.xlsx
     [java] thread: 7, iter: 60: build/tmp/poifiles/TestTempFileThreaded/16/TestTempFile-7-60-4224588574470651496.xlsx
     [java] thread: 5, iter: 60: build/tmp/poifiles/TestTempFileThreaded/14/TestTempFile-5-60-5703123311087436425.xlsx
     [java] thread: 0, iter: 60: build/tmp/poifiles/TestTempFileThreaded/9/TestTempFile-0-60-2185447300895416999.xlsx
     [java] thread: 2, iter: 60: build/tmp/poifiles/TestTempFileThreaded/11/TestTempFile-2-60-5679932327805696075.xlsx
     [java] thread: 4, iter: 60: build/tmp/poifiles/TestTempFileThreaded/13/TestTempFile-4-60-6086962110591456979.xlsx
     [java] thread: 8, iter: 60: build/tmp/poifiles/TestTempFileThreaded/17/TestTempFile-8-60-5728383470879777536.xlsx
     [java] thread: 3, iter: 60: build/tmp/poifiles/TestTempFileThreaded/12/TestTempFile-3-60-8417557934816612962.xlsx
     [java] thread: 1, iter: 90: build/tmp/poifiles/TestTempFileThreaded/10/TestTempFile-1-90-844690758610048615.xlsx
     [java] thread: 6, iter: 90: build/tmp/poifiles/TestTempFileThreaded/15/TestTempFile-6-90-2070610624879319423.xlsx
     [java] thread: 7, iter: 90: build/tmp/poifiles/TestTempFileThreaded/16/TestTempFile-7-90-4701408825603073034.xlsx
     [java] thread: 9, iter: 90: build/tmp/poifiles/TestTempFileThreaded/18/TestTempFile-9-90-7495051603456509777.xlsx
     [java] thread: 2, iter: 90: build/tmp/poifiles/TestTempFileThreaded/11/TestTempFile-2-90-4571833315163144222.xlsx
     [java] thread: 0, iter: 90: build/tmp/poifiles/TestTempFileThreaded/9/TestTempFile-0-90-3316104621009023313.xlsx
     [java] thread: 8, iter: 90: build/tmp/poifiles/TestTempFileThreaded/17/TestTempFile-8-90-2899958764448183807.xlsx
     [java] thread: 3, iter: 90: build/tmp/poifiles/TestTempFileThreaded/12/TestTempFile-3-90-2847385646979741389.xlsx
     [java] thread: 5, iter: 90: build/tmp/poifiles/TestTempFileThreaded/14/TestTempFile-5-90-8249236832000808192.xlsx
     [java] thread: 4, iter: 90: build/tmp/poifiles/TestTempFileThreaded/13/TestTempFile-4-90-7181154290057935425.xlsx
     [java] thread: 1, iter: 120: build/tmp/poifiles/TestTempFileThreaded/10/TestTempFile-1-120-2946407813046009195.xlsx
     [java] thread: 6, iter: 120: build/tmp/poifiles/TestTempFileThreaded/15/TestTempFile-6-120-1614373086304948513.xlsx
     [java] thread: 9, iter: 120: build/tmp/poifiles/TestTempFileThreaded/18/TestTempFile-9-120-4659918481963943860.xlsx
     [java] thread: 0, iter: 120: build/tmp/poifiles/TestTempFileThreaded/9/TestTempFile-0-120-1004519956442637495.xlsx
     [java] thread: 7, iter: 120: build/tmp/poifiles/TestTempFileThreaded/16/TestTempFile-7-120-8656321693561798038.xlsx
     [java] thread: 8, iter: 120: build/tmp/poifiles/TestTempFileThreaded/17/TestTempFile-8-120-1911200787001504576.xlsx
     [java] thread: 3, iter: 120: build/tmp/poifiles/TestTempFileThreaded/12/TestTempFile-3-120-5069479698983547723.xlsx
     [java] thread: 2, iter: 120: build/tmp/poifiles/TestTempFileThreaded/11/TestTempFile-2-120-715112747335843469.xlsx
     [java] thread: 5, iter: 120: build/tmp/poifiles/TestTempFileThreaded/14/TestTempFile-5-120-1127060140122098970.xlsx
     [java] thread: 1, iter: 150: build/tmp/poifiles/TestTempFileThreaded/10/TestTempFile-1-150-6168023705741989311.xlsx
     [java] thread: 4, iter: 120: build/tmp/poifiles/TestTempFileThreaded/13/TestTempFile-4-120-1470025005723648921.xlsx
     [java] thread: 7, iter: 150: build/tmp/poifiles/TestTempFileThreaded/16/TestTempFile-7-150-5551388985053220150.xlsx
     [java] thread: 9, iter: 150: build/tmp/poifiles/TestTempFileThreaded/18/TestTempFile-9-150-173571792997652624.xlsx
     [java] thread: 6, iter: 150: build/tmp/poifiles/TestTempFileThreaded/15/TestTempFile-6-150-4590211339482604139.xlsx
     [java] thread: 8, iter: 150: build/tmp/poifiles/TestTempFileThreaded/17/TestTempFile-8-150-2029196016143989084.xlsx
     [java] thread: 0, iter: 150: build/tmp/poifiles/TestTempFileThreaded/9/TestTempFile-0-150-6724606671291514659.xlsx
     [java] thread: 2, iter: 150: build/tmp/poifiles/TestTempFileThreaded/11/TestTempFile-2-150-6926920734033621038.xlsx
     [java] thread: 3, iter: 150: build/tmp/poifiles/TestTempFileThreaded/12/TestTempFile-3-150-3111375917556078793.xlsx
     [java] thread: 1, iter: 180: build/tmp/poifiles/TestTempFileThreaded/10/TestTempFile-1-180-556847878363936708.xlsx
     [java] thread: 4, iter: 150: build/tmp/poifiles/TestTempFileThreaded/13/TestTempFile-4-150-4071091171954743164.xlsx
     [java] thread: 5, iter: 150: build/tmp/poifiles/TestTempFileThreaded/14/TestTempFile-5-150-6625670625174874185.xlsx
     [java] thread: 7, iter: 180: build/tmp/poifiles/TestTempFileThreaded/16/TestTempFile-7-180-7535837237250241148.xlsx
     [java] thread: 6, iter: 180: build/tmp/poifiles/TestTempFileThreaded/15/TestTempFile-6-180-7708566512733859411.xlsx
     [java] thread: 9, iter: 180: build/tmp/poifiles/TestTempFileThreaded/18/TestTempFile-9-180-3679493504865599412.xlsx
     [java] thread: 2, iter: 180: build/tmp/poifiles/TestTempFileThreaded/11/TestTempFile-2-180-7335446753137648541.xlsx
     [java] thread: 8, iter: 180: build/tmp/poifiles/TestTempFileThreaded/17/TestTempFile-8-180-7717915416290520023.xlsx
     [java] thread: 0, iter: 180: build/tmp/poifiles/TestTempFileThreaded/9/TestTempFile-0-180-8717996988013694502.xlsx
     [java] thread: 3, iter: 180: build/tmp/poifiles/TestTempFileThreaded/12/TestTempFile-3-180-1595791514314776161.xlsx
     [java] thread: 5, iter: 180: build/tmp/poifiles/TestTempFileThreaded/14/TestTempFile-5-180-6893628286259992862.xlsx
     [java] thread: 4, iter: 180: build/tmp/poifiles/TestTempFileThreaded/13/TestTempFile-4-180-2336322000391611673.xlsx
     [java] ......................................E....................I...................I.....
     [java] 44/244: withZipOutputStream(org.apache.poi.openxml4j.opc.internal.marshallers.TestZipPackagePropertiesMarshaller)
     [java] Cleaning up unclosed ZipFile for archive <https://builds.apache.org/job/POI-DSL-old-Xerces/ws/test-data/openxml4j/TestPackageCommon.docx>
     [java] ....................................................................................................
     [java] 58/244: testAgileEncryptionModes[rc2 sha256 cbc](org.apache.poi.poifs.crypt.TestAgileEncryptionParameters)
     [java] ..............................I..I....................................................................
     [java] 76/244: testThemesTableColors(org.apache.poi.xssf.model.TestThemesTable)
     [java] .....................................I..I..I...........................................................
     [java] 84/244: testBug55843e(org.apache.poi.xssf.streaming.TestSXSSFFormulaEvaluation)
     [java] ...............................................................................................II.....
     [java] 89/244: testRemoveCell(org.apache.poi.xssf.streaming.TestSXSSFRow)
     [java] ....................................................................................................
     [java] 98/244: testGetFooter(org.apache.poi.xssf.usermodel.TestXSSFDialogSheet)
     [java] ....................................................................................................
     [java] 103/244: processFunctionRow[Addbar](org.apache.poi.xssf.usermodel.TestFormulaEvaluatorOnXSSF)
     [java] ....................................................................................................
     [java] 103/244: processFunctionRow[Files](org.apache.poi.xssf.usermodel.TestFormulaEvaluatorOnXSSF)
     [java] ....................................................................................................
     [java] 103/244: processFunctionRow[Minute](org.apache.poi.xssf.usermodel.TestFormulaEvaluatorOnXSSF)
     [java] ....................................................................................................
     [java] 103/244: processFunctionRow[Subtotal](org.apache.poi.xssf.usermodel.TestFormulaEvaluatorOnXSSF)
     [java] [Fatal Error] :-1:-1: The parser has encountered more than "1" entity expansions in this document; this is the limit imposed by the application.
     [java] Cleaning up unclosed ZipFile for archive <https://builds.apache.org/job/POI-DSL-old-Xerces/ws/test-data/spreadsheet/54764.xlsx>
     [java] ...................................................................I.................................
     [java] 108/244: bug48877(org.apache.poi.xssf.usermodel.TestXSSFBugs)
     [java] Cleaning up unclosed ZipFile for archive <https://builds.apache.org/job/POI-DSL-old-Xerces/ws/test-data/spreadsheet/54764.xlsx>
     [java] ..................................................I......II............I...I........................I.....
     [java] 108/244: bug56981(org.apache.poi.xssf.usermodel.TestXSSFBugs)
     [java] ....I.....I...........................................................................................
     [java] 117/244: bug49966(org.apache.poi.xssf.usermodel.TestXSSFSheet)
     [java] ....................................................................................................
     [java] 118/244: testColumnLabelSetCustomName(org.apache.poi.xssf.usermodel.TestXSSFPivotTableName)
     [java] ..............................................................................I......................
     [java] 131/244: testExistingWorkbook(org.apache.poi.xssf.usermodel.TestMissingWorkbookOnXSSF)
     [java] ....III.I..I.......I.......I.....I........................................................I.I....I.............
     [java] 136/244: testBug61532(org.apache.poi.xssf.usermodel.TestXSSFFormulaEvaluation)
     [java] ....................................................................................................
     [java] 144/244: shiftMergedRowsToMergedRowsOverlappingMergedRegion(org.apache.poi.xssf.usermodel.TestXSSFSheetShiftRows)
     [java] ....................................................................................................
     [java] 160/244: testCreateColumn(org.apache.poi.xssf.usermodel.TestXSSFTable)
     [java] .....................................................E...............................................
     [java] 173/244: testFile56278_event(org.apache.poi.xssf.extractor.TestXSSFEventBasedExcelExtractorUsingFactory)
     [java] ............I.....................I...................................I.I...............................
     [java] 186/244: testSolidFillBackground(org.apache.poi.xslf.usermodel.TestXSLFBackground)
     [java] ....................................................................................................
     [java] 210/244: testRead(org.apache.poi.xslf.usermodel.TestXSLFTheme)
     [java] ....................................I................................................................
     [java] 229/244: testCreateGeneric(org.apache.poi.ss.TestWorkbookFactory)
     [java] Exception in thread "main" java.lang.RuntimeException: Tests did not succeed, cannot build ooxml-lite jar
     [java] at org.apache.poi.ooxml.util.OOXMLLite.build(OOXMLLite.java:185)
     [java] at org.apache.poi.ooxml.util.OOXMLLite.main(OOXMLLite.java:101)
     [java] ......................................................
     [java] Time: 123.97
     [java] There were 2 failures:
     [java] 1) zipBombCheckSizesWithinLimits(org.apache.poi.openxml4j.opc.TestPackage)
     [java] org.apache.poi.ooxml.POIXMLException: Zip bomb detected! The file would exceed the max size of the expanded data in the zip-file.
     [java] This may indicates that the file is used to inflate memory usage and thus could pose a security risk.
     [java] You can adjust this limit via ZipSecureFile.setMaxEntrySize() if you need to work with files which are very large.
     [java] Uncompressed size: 1048807, Raw/compressed size: 57587
     [java] Limits: MAX_ENTRY_SIZE: 1048783, Entry: xl/sharedStrings.xml
     [java] at org.apache.poi.ooxml.POIXMLFactory.createDocumentPart(POIXMLFactory.java:66)
     [java] at org.apache.poi.ooxml.POIXMLDocumentPart.read(POIXMLDocumentPart.java:648)
     [java] at org.apache.poi.ooxml.POIXMLDocument.load(POIXMLDocument.java:180)
     [java] at org.apache.poi.xssf.usermodel.XSSFWorkbook.<init>(XSSFWorkbook.java:286)
     [java] at org.apache.poi.xssf.usermodel.XSSFWorkbookFactory.createWorkbook(XSSFWorkbookFactory.java:83)
     [java] at org.apache.poi.xssf.usermodel.XSSFWorkbookFactory.createWorkbook(XSSFWorkbookFactory.java:111)
     [java] at sun.reflect.NativeMethodAccessorImpl.invoke0(Native Method)
     [java] at sun.reflect.NativeMethodAccessorImpl.invoke(NativeMethodAccessorImpl.java:62)
     [java] at sun.reflect.DelegatingMethodAccessorImpl.invoke(DelegatingMethodAccessorImpl.java:43)
     [java] at java.lang.reflect.Method.invoke(Method.java:498)
     [java] at org.apache.poi.ss.usermodel.WorkbookFactory.createWorkbook(WorkbookFactory.java:314)
     [java] at org.apache.poi.ss.usermodel.WorkbookFactory.createXSSFWorkbook(WorkbookFactory.java:296)
     [java] at org.apache.poi.ss.usermodel.WorkbookFactory.create(WorkbookFactory.java:284)
     [java] at org.apache.poi.openxml4j.opc.TestPackage.getZipStatsAndConsume(TestPackage.java:938)
     [java] at org.apache.poi.openxml4j.opc.TestPackage.zipBombCheckSizesWithinLimits(TestPackage.java:884)
     [java] at sun.reflect.NativeMethodAccessorImpl.invoke0(Native Method)
     [java] at sun.reflect.NativeMethodAccessorImpl.invoke(NativeMethodAccessorImpl.java:62)
     [java] at sun.reflect.DelegatingMethodAccessorImpl.invoke(DelegatingMethodAccessorImpl.java:43)
     [java] at java.lang.reflect.Method.invoke(Method.java:498)
     [java] at org.junit.runners.model.FrameworkMethod$1.runReflectiveCall(FrameworkMethod.java:50)
     [java] at org.junit.internal.runners.model.ReflectiveCallable.run(ReflectiveCallable.java:12)
     [java] at org.junit.runners.model.FrameworkMethod.invokeExplosively(FrameworkMethod.java:47)
     [java] at org.junit.internal.runners.statements.InvokeMethod.evaluate(InvokeMethod.java:17)
     [java] at org.junit.rules.ExpectedException$ExpectedExceptionStatement.evaluate(ExpectedException.java:239)
     [java] at org.junit.rules.RunRules.evaluate(RunRules.java:20)
     [java] at org.junit.runners.ParentRunner.runLeaf(ParentRunner.java:325)
     [java] at org.junit.runners.BlockJUnit4ClassRunner.runChild(BlockJUnit4ClassRunner.java:78)
     [java] at org.junit.runners.BlockJUnit4ClassRunner.runChild(BlockJUnit4ClassRunner.java:57)
     [java] at org.junit.runners.ParentRunner$3.run(ParentRunner.java:290)
     [java] at org.junit.runners.ParentRunner$1.schedule(ParentRunner.java:71)
     [java] at org.junit.runners.ParentRunner.runChildren(ParentRunner.java:288)
     [java] at org.junit.runners.ParentRunner.access$000(ParentRunner.java:58)
     [java] at org.junit.runners.ParentRunner$2.evaluate(ParentRunner.java:268)
     [java] at org.junit.runners.ParentRunner.run(ParentRunner.java:363)
     [java] at org.junit.runners.Suite.runChild(Suite.java:128)
     [java] at org.junit.runners.Suite.runChild(Suite.java:27)
     [java] at org.junit.runners.ParentRunner$3.run(ParentRunner.java:290)
     [java] at org.junit.runners.ParentRunner$1.schedule(ParentRunner.java:71)
     [java] at org.junit.runners.ParentRunner.runChildren(ParentRunner.java:288)
     [java] at org.junit.runners.ParentRunner.access$000(ParentRunner.java:58)
     [java] at org.junit.runners.ParentRunner$2.evaluate(ParentRunner.java:268)
     [java] at org.junit.runners.ParentRunner.run(ParentRunner.java:363)
     [java] at org.junit.runner.JUnitCore.run(JUnitCore.java:137)
     [java] at org.junit.runner.JUnitCore.run(JUnitCore.java:115)
     [java] at org.junit.runner.JUnitCore.run(JUnitCore.java:105)
     [java] at org.junit.runner.JUnitCore.run(JUnitCore.java:94)
     [java] at org.apache.poi.ooxml.util.OOXMLLite.build(OOXMLLite.java:183)
     [java] at org.apache.poi.ooxml.util.OOXMLLite.main(OOXMLLite.java:101)
     [java] Caused by: java.lang.reflect.InvocationTargetException
     [java] at sun.reflect.NativeConstructorAccessorImpl.newInstance0(Native Method)
     [java] at sun.reflect.NativeConstructorAccessorImpl.newInstance(NativeConstructorAccessorImpl.java:62)
     [java] at sun.reflect.DelegatingConstructorAccessorImpl.newInstance(DelegatingConstructorAccessorImpl.java:45)
     [java] at java.lang.reflect.Constructor.newInstance(Constructor.java:423)
     [java] at org.apache.poi.xssf.usermodel.XSSFFactory.createDocumentPart(XSSFFactory.java:56)
     [java] at org.apache.poi.ooxml.POIXMLFactory.createDocumentPart(POIXMLFactory.java:63)
     [java] ... 47 more
     [java] Caused by: java.io.IOException: Zip bomb detected! The file would exceed the max size of the expanded data in the zip-file.
     [java] This may indicates that the file is used to inflate memory usage and thus could pose a security risk.
     [java] You can adjust this limit via ZipSecureFile.setMaxEntrySize() if you need to work with files which are very large.
     [java] Uncompressed size: 1048807, Raw/compressed size: 57587
     [java] Limits: MAX_ENTRY_SIZE: 1048783, Entry: xl/sharedStrings.xml
     [java] at org.apache.poi.openxml4j.util.ZipArchiveThresholdInputStream.checkThreshold(ZipArchiveThresholdInputStream.java:116)
     [java] at org.apache.poi.openxml4j.util.ZipArchiveThresholdInputStream.read(ZipArchiveThresholdInputStream.java:80)
     [java] at org.apache.xerces.impl.XMLEntityManager$RewindableInputStream.read(Unknown Source)
     [java] at org.apache.xerces.impl.io.UTF8Reader.read(Unknown Source)
     [java] at org.apache.xerces.impl.XMLEntityScanner.load(Unknown Source)
     [java] at org.apache.xerces.impl.XMLEntityScanner.scanContent(Unknown Source)
     [java] at org.apache.xerces.impl.XMLDocumentFragmentScannerImpl.scanContent(Unknown Source)
     [java] at org.apache.xerces.impl.XMLDocumentFragmentScannerImpl$FragmentContentDispatcher.dispatch(Unknown Source)
     [java] at org.apache.xerces.impl.XMLDocumentFragmentScannerImpl.scanDocument(Unknown Source)
     [java] at org.apache.xerces.parsers.XML11Configuration.parse(Unknown Source)
     [java] at org.apache.xerces.parsers.XML11Configuration.parse(Unknown Source)
     [java] at org.apache.xerces.parsers.XMLParser.parse(Unknown Source)
     [java] at org.apache.xerces.parsers.AbstractSAXParser.parse(Unknown Source)
     [java] at org.apache.xmlbeans.impl.store.Locale$SaxLoader.load(Locale.java:3414)
     [java] at org.apache.xmlbeans.impl.store.Locale.parseToXmlObject(Locale.java:1272)
     [java] at org.apache.xmlbeans.impl.store.Locale.parseToXmlObject(Locale.java:1259)
     [java] at org.apache.xmlbeans.impl.schema.SchemaTypeLoaderBase.parse(SchemaTypeLoaderBase.java:345)
     [java] at org.openxmlformats.schemas.spreadsheetml.x2006.main.SstDocument$Factory.parse(Unknown Source)
     [java] at org.apache.poi.xssf.model.SharedStringsTable.readFrom(SharedStringsTable.java:123)
     [java] at org.apache.poi.xssf.model.SharedStringsTable.<init>(SharedStringsTable.java:111)
     [java] ... 53 more
     [java] 2) testBuiltinStyleInit(org.apache.poi.xssf.usermodel.TestTableStyles)
     [java] java.lang.AbstractMethodError: org.apache.xml.serialize.DOMSerializerImpl.getDomConfig()Lorg/w3c/dom/DOMConfiguration;
     [java] at org.apache.poi.xssf.usermodel.XSSFBuiltinTableStyle.styleXML(XSSFBuiltinTableStyle.java:424)
     [java] at org.apache.poi.xssf.usermodel.XSSFBuiltinTableStyle.init(XSSFBuiltinTableStyle.java:406)
     [java] at org.apache.poi.xssf.usermodel.XSSFBuiltinTableStyle.getStyle(XSSFBuiltinTableStyle.java:346)
     [java] at org.apache.poi.xssf.usermodel.TestTableStyles.testBuiltinStyleInit(TestTableStyles.java:45)
     [java] at sun.reflect.NativeMethodAccessorImpl.invoke0(Native Method)
     [java] at sun.reflect.NativeMethodAccessorImpl.invoke(NativeMethodAccessorImpl.java:62)
     [java] at sun.reflect.DelegatingMethodAccessorImpl.invoke(DelegatingMethodAccessorImpl.java:43)
     [java] at java.lang.reflect.Method.invoke(Method.java:498)
     [java] at org.junit.runners.model.FrameworkMethod$1.runReflectiveCall(FrameworkMethod.java:50)
     [java] at org.junit.internal.runners.model.ReflectiveCallable.run(ReflectiveCallable.java:12)
     [java] at org.junit.runners.model.FrameworkMethod.invokeExplosively(FrameworkMethod.java:47)
     [java] at org.junit.internal.runners.statements.InvokeMethod.evaluate(InvokeMethod.java:17)
     [java] at org.junit.runners.ParentRunner.runLeaf(ParentRunner.java:325)
     [java] at org.junit.runners.BlockJUnit4ClassRunner.runChild(BlockJUnit4ClassRunner.java:78)
     [java] at org.junit.runners.BlockJUnit4ClassRunner.runChild(BlockJUnit4ClassRunner.java:57)
     [java] at org.junit.runners.ParentRunner$3.run(ParentRunner.java:290)
     [java] at org.junit.runners.ParentRunner$1.schedule(ParentRunner.java:71)
     [java] at org.junit.runners.ParentRunner.runChildren(ParentRunner.java:288)
     [java] at org.junit.runners.ParentRunner.access$000(ParentRunner.java:58)
     [java] at org.junit.runners.ParentRunner$2.evaluate(ParentRunner.java:268)
     [java] at org.junit.runners.ParentRunner.run(ParentRunner.java:363)
     [java] at org.junit.runners.Suite.runChild(Suite.java:128)
     [java] at org.junit.runners.Suite.runChild(Suite.java:27)
     [java] at org.junit.runners.ParentRunner$3.run(ParentRunner.java:290)
     [java] at org.junit.runners.ParentRunner$1.schedule(ParentRunner.java:71)
     [java] at org.junit.runners.ParentRunner.runChildren(ParentRunner.java:288)
     [java] at org.junit.runners.ParentRunner.access$000(ParentRunner.java:58)
     [java] at org.junit.runners.ParentRunner$2.evaluate(ParentRunner.java:268)
     [java] at org.junit.runners.ParentRunner.run(ParentRunner.java:363)
     [java] at org.junit.runner.JUnitCore.run(JUnitCore.java:137)
     [java] at org.junit.runner.JUnitCore.run(JUnitCore.java:115)
     [java] at org.junit.runner.JUnitCore.run(JUnitCore.java:105)
     [java] at org.junit.runner.JUnitCore.run(JUnitCore.java:94)
     [java] at org.apache.poi.ooxml.util.OOXMLLite.build(OOXMLLite.java:183)
     [java] at org.apache.poi.ooxml.util.OOXMLLite.main(OOXMLLite.java:101)
     [java]
     [java] FAILURES!!!
     [java] Tests run: 2453,  Failures: 2
     [java]

BUILD FAILED
<https://builds.apache.org/job/POI-DSL-old-Xerces/ws/build.xml>:1702: Java returned: 1

Total time: 4 minutes 57 seconds
Build step 'Invoke Ant' marked build as failure
Skipping publisher since build result is FAILURE
Archiving artifacts
[Fast Archiver] Compressed 59.98 MB of artifacts by 59.5% relative to #95
Skipping publisher since build result is FAILURE
Recording test results
ERROR: Step ‘Publish JUnit test result report’ failed: No test report files were found. Configuration error?

---------------------------------------------------------------------
To unsubscribe, e-mail: [hidden email]
For additional commands, e-mail: [hidden email]

Reply | Threaded
Open this post in threaded view
|

Build failed in Jenkins: POI-DSL-old-Xerces #99

Apache Jenkins Server
See <https://builds.apache.org/job/POI-DSL-old-Xerces/99/display/redirect?page=changes>

Changes:

[fanningpj] lgtm issues

[centic] Jenkins DSL: Remove JDK 9 and adjust location of image for the project-logo

[centic] Remove outdated comment for japicmp

[fanningpj] fix lgtm issues

[fanningpj] fix gradle build issue

[fanningpj] fix lgtm issues

[fanningpj] make OPCPackage#close() unsynchronized and add javadoc note saying method is not thread-safe

[fanningpj] [bug-62768] synchronize OPCPackage#close()

[fanningpj] [bug-62736] Relations on XSLFPictureShape are removed unconditionally. Thanks to Mate Borcsok

[abearez] register XDDF changes for 4.0.1

[abearez] adapting some contributions by Axel Richter on SO

[fanningpj] fix javadoc

[fanningpj] add some 4.0.1 doc

[fanningpj] lgtm warnings

[fanningpj] update grammar in related projects text

[centic] Adjust wording of takeover by Apache POI as discussed on the board-mailing list

------------------------------------------
[...truncated 27.75 KB...]
     [java] thread: 4, iter: 30: build/tmp/poifiles/TestTempFileThreaded/13/TestTempFile-4-30-4697616580996662200.xlsx
     [java] thread: 3, iter: 30: build/tmp/poifiles/TestTempFileThreaded/12/TestTempFile-3-30-7477179853522975463.xlsx
     [java] thread: 1, iter: 30: build/tmp/poifiles/TestTempFileThreaded/10/TestTempFile-1-30-7800176706169753286.xlsx
     [java] thread: 9, iter: 30: build/tmp/poifiles/TestTempFileThreaded/18/TestTempFile-9-30-4704977885480680632.xlsx
     [java] thread: 7, iter: 60: build/tmp/poifiles/TestTempFileThreaded/16/TestTempFile-7-60-3443124061358444107.xlsx
     [java] thread: 8, iter: 60: build/tmp/poifiles/TestTempFileThreaded/17/TestTempFile-8-60-1147616088246093874.xlsx
     [java] thread: 0, iter: 60: build/tmp/poifiles/TestTempFileThreaded/9/TestTempFile-0-60-8032684093360853628.xlsx
     [java] thread: 4, iter: 60: build/tmp/poifiles/TestTempFileThreaded/13/TestTempFile-4-60-1340906272487259424.xlsx
     [java] thread: 5, iter: 60: build/tmp/poifiles/TestTempFileThreaded/14/TestTempFile-5-60-7741204028414755950.xlsx
     [java] thread: 6, iter: 60: build/tmp/poifiles/TestTempFileThreaded/15/TestTempFile-6-60-7220914883438194151.xlsx
     [java] thread: 9, iter: 60: build/tmp/poifiles/TestTempFileThreaded/18/TestTempFile-9-60-506237218848166880.xlsx
     [java] thread: 2, iter: 60: build/tmp/poifiles/TestTempFileThreaded/11/TestTempFile-2-60-3460017301121852924.xlsx
     [java] thread: 1, iter: 60: build/tmp/poifiles/TestTempFileThreaded/10/TestTempFile-1-60-4660513436727926649.xlsx
     [java] thread: 3, iter: 60: build/tmp/poifiles/TestTempFileThreaded/12/TestTempFile-3-60-3219835429323985864.xlsx
     [java] thread: 7, iter: 90: build/tmp/poifiles/TestTempFileThreaded/16/TestTempFile-7-90-3017715193893909123.xlsx
     [java] thread: 5, iter: 90: build/tmp/poifiles/TestTempFileThreaded/14/TestTempFile-5-90-4755171911658147904.xlsx
     [java] thread: 9, iter: 90: build/tmp/poifiles/TestTempFileThreaded/18/TestTempFile-9-90-8740864511964774954.xlsx
     [java] thread: 1, iter: 90: build/tmp/poifiles/TestTempFileThreaded/10/TestTempFile-1-90-8791332247622125442.xlsx
     [java] thread: 6, iter: 90: build/tmp/poifiles/TestTempFileThreaded/15/TestTempFile-6-90-5363424690657370905.xlsx
     [java] thread: 8, iter: 90: build/tmp/poifiles/TestTempFileThreaded/17/TestTempFile-8-90-185599062726064970.xlsx
     [java] thread: 0, iter: 90: build/tmp/poifiles/TestTempFileThreaded/9/TestTempFile-0-90-6696652418319707285.xlsx
     [java] thread: 2, iter: 90: build/tmp/poifiles/TestTempFileThreaded/11/TestTempFile-2-90-2606536912598475137.xlsx
     [java] thread: 4, iter: 90: build/tmp/poifiles/TestTempFileThreaded/13/TestTempFile-4-90-4631103795172625321.xlsx
     [java] thread: 3, iter: 90: build/tmp/poifiles/TestTempFileThreaded/12/TestTempFile-3-90-7715316521729197758.xlsx
     [java] thread: 7, iter: 120: build/tmp/poifiles/TestTempFileThreaded/16/TestTempFile-7-120-5168222164742360843.xlsx
     [java] thread: 5, iter: 120: build/tmp/poifiles/TestTempFileThreaded/14/TestTempFile-5-120-814390498394827721.xlsx
     [java] thread: 2, iter: 120: build/tmp/poifiles/TestTempFileThreaded/11/TestTempFile-2-120-1694647130054673193.xlsx
     [java] thread: 1, iter: 120: build/tmp/poifiles/TestTempFileThreaded/10/TestTempFile-1-120-330847820259768980.xlsx
     [java] thread: 6, iter: 120: build/tmp/poifiles/TestTempFileThreaded/15/TestTempFile-6-120-5362075331013029288.xlsx
     [java] thread: 9, iter: 120: build/tmp/poifiles/TestTempFileThreaded/18/TestTempFile-9-120-2536283393368075630.xlsx
     [java] thread: 4, iter: 120: build/tmp/poifiles/TestTempFileThreaded/13/TestTempFile-4-120-5028525626457561287.xlsx
     [java] thread: 8, iter: 120: build/tmp/poifiles/TestTempFileThreaded/17/TestTempFile-8-120-5748434793616289522.xlsx
     [java] thread: 0, iter: 120: build/tmp/poifiles/TestTempFileThreaded/9/TestTempFile-0-120-3039661878408381238.xlsx
     [java] thread: 3, iter: 120: build/tmp/poifiles/TestTempFileThreaded/12/TestTempFile-3-120-7980554285450034660.xlsx
     [java] thread: 5, iter: 150: build/tmp/poifiles/TestTempFileThreaded/14/TestTempFile-5-150-653631795869548784.xlsx
     [java] thread: 7, iter: 150: build/tmp/poifiles/TestTempFileThreaded/16/TestTempFile-7-150-705976882567170662.xlsx
     [java] thread: 6, iter: 150: build/tmp/poifiles/TestTempFileThreaded/15/TestTempFile-6-150-4721086736376092470.xlsx
     [java] thread: 8, iter: 150: build/tmp/poifiles/TestTempFileThreaded/17/TestTempFile-8-150-2867007058279794229.xlsx
     [java] thread: 2, iter: 150: build/tmp/poifiles/TestTempFileThreaded/11/TestTempFile-2-150-618785049114143859.xlsx
     [java] thread: 9, iter: 150: build/tmp/poifiles/TestTempFileThreaded/18/TestTempFile-9-150-405368758542500891.xlsx
     [java] thread: 1, iter: 150: build/tmp/poifiles/TestTempFileThreaded/10/TestTempFile-1-150-8557221807430490531.xlsx
     [java] thread: 0, iter: 150: build/tmp/poifiles/TestTempFileThreaded/9/TestTempFile-0-150-5182371862142361873.xlsx
     [java] thread: 4, iter: 150: build/tmp/poifiles/TestTempFileThreaded/13/TestTempFile-4-150-3300914987496158225.xlsx
     [java] thread: 7, iter: 180: build/tmp/poifiles/TestTempFileThreaded/16/TestTempFile-7-180-1922145880656863841.xlsx
     [java] thread: 3, iter: 150: build/tmp/poifiles/TestTempFileThreaded/12/TestTempFile-3-150-5421006139282123177.xlsx
     [java] thread: 5, iter: 180: build/tmp/poifiles/TestTempFileThreaded/14/TestTempFile-5-180-1199236492332607861.xlsx
     [java] thread: 2, iter: 180: build/tmp/poifiles/TestTempFileThreaded/11/TestTempFile-2-180-6075496972268781317.xlsx
     [java] thread: 6, iter: 180: build/tmp/poifiles/TestTempFileThreaded/15/TestTempFile-6-180-1943300657390340893.xlsx
     [java] thread: 8, iter: 180: build/tmp/poifiles/TestTempFileThreaded/17/TestTempFile-8-180-1004716485066393405.xlsx
     [java] thread: 0, iter: 180: build/tmp/poifiles/TestTempFileThreaded/9/TestTempFile-0-180-4458269280467347338.xlsx
     [java] thread: 9, iter: 180: build/tmp/poifiles/TestTempFileThreaded/18/TestTempFile-9-180-2722151218785219398.xlsx
     [java] thread: 1, iter: 180: build/tmp/poifiles/TestTempFileThreaded/10/TestTempFile-1-180-4321172630789881435.xlsx
     [java] thread: 4, iter: 180: build/tmp/poifiles/TestTempFileThreaded/13/TestTempFile-4-180-5336261573289778235.xlsx
     [java] thread: 3, iter: 180: build/tmp/poifiles/TestTempFileThreaded/12/TestTempFile-3-180-2328566899007419410.xlsx
     [java] ......................................E....................I...................I.....
     [java] 44/244: withZipOutputStream(org.apache.poi.openxml4j.opc.internal.marshallers.TestZipPackagePropertiesMarshaller)
     [java] Cleaning up unclosed ZipFile for archive <https://builds.apache.org/job/POI-DSL-old-Xerces/ws/test-data/openxml4j/TestPackageCommon.docx>
     [java] ....................................................................................................
     [java] 58/244: testAgileEncryptionModes[rc2 sha256 cbc](org.apache.poi.poifs.crypt.TestAgileEncryptionParameters)
     [java] ..............................I..I....................................................................
     [java] 76/244: testThemesTableColors(org.apache.poi.xssf.model.TestThemesTable)
     [java] .....................................I..I..I...........................................................
     [java] 84/244: testBug55843e(org.apache.poi.xssf.streaming.TestSXSSFFormulaEvaluation)
     [java] ...............................................................................................II.....
     [java] 89/244: testRemoveCell(org.apache.poi.xssf.streaming.TestSXSSFRow)
     [java] ....................................................................................................
     [java] 98/244: testGetFooter(org.apache.poi.xssf.usermodel.TestXSSFDialogSheet)
     [java] ....................................................................................................
     [java] 103/244: processFunctionRow[Addbar](org.apache.poi.xssf.usermodel.TestFormulaEvaluatorOnXSSF)
     [java] ....................................................................................................
     [java] 103/244: processFunctionRow[Files](org.apache.poi.xssf.usermodel.TestFormulaEvaluatorOnXSSF)
     [java] ....................................................................................................
     [java] 103/244: processFunctionRow[Minute](org.apache.poi.xssf.usermodel.TestFormulaEvaluatorOnXSSF)
     [java] ....................................................................................................
     [java] 103/244: processFunctionRow[Subtotal](org.apache.poi.xssf.usermodel.TestFormulaEvaluatorOnXSSF)
     [java] [Fatal Error] :-1:-1: The parser has encountered more than "1" entity expansions in this document; this is the limit imposed by the application.
     [java] Cleaning up unclosed ZipFile for archive <https://builds.apache.org/job/POI-DSL-old-Xerces/ws/test-data/spreadsheet/54764.xlsx>
     [java] ...................................................................I.................................
     [java] 108/244: bug48877(org.apache.poi.xssf.usermodel.TestXSSFBugs)
     [java] Cleaning up unclosed ZipFile for archive <https://builds.apache.org/job/POI-DSL-old-Xerces/ws/test-data/spreadsheet/54764.xlsx>
     [java] ..................................................I......II............I...I........................I.....
     [java] 108/244: bug56981(org.apache.poi.xssf.usermodel.TestXSSFBugs)
     [java] ....I.....I...........................................................................................
     [java] 117/244: bug49966(org.apache.poi.xssf.usermodel.TestXSSFSheet)
     [java] ....................................................................................................
     [java] 118/244: testColumnLabelSetCustomName(org.apache.poi.xssf.usermodel.TestXSSFPivotTableName)
     [java] ..............................................................................I......................
     [java] 131/244: testExistingWorkbook(org.apache.poi.xssf.usermodel.TestMissingWorkbookOnXSSF)
     [java] ....III.I..I.......I.......I.....I........................................................I.I....I.............
     [java] 136/244: testBug61532(org.apache.poi.xssf.usermodel.TestXSSFFormulaEvaluation)
     [java] ....................................................................................................
     [java] 144/244: shiftMergedRowsToMergedRowsOverlappingMergedRegion(org.apache.poi.xssf.usermodel.TestXSSFSheetShiftRows)
     [java] ....................................................................................................
     [java] 160/244: testCreateColumn(org.apache.poi.xssf.usermodel.TestXSSFTable)
     [java] .....................................................E...............................................
     [java] 173/244: testFile56278_event(org.apache.poi.xssf.extractor.TestXSSFEventBasedExcelExtractorUsingFactory)
     [java] ............I.....................I...................................I.I...............................
     [java] 186/244: testBlipFillBackground(org.apache.poi.xslf.usermodel.TestXSLFBackground)
     [java] ....................................................................................................
     [java] 209/244: testDefaultProperties(org.apache.poi.xslf.usermodel.TestXSLFSimpleShape)
     [java] .....................................I...............................................................
     [java] 229/244: testEmptyInputStream(org.apache.poi.ss.TestWorkbookFactory)
     [java] .......................................................
     [java] Exception in thread "main" java.lang.RuntimeException: Tests did not succeed, cannot build ooxml-lite jar
     [java] at org.apache.poi.ooxml.util.OOXMLLite.build(OOXMLLite.java:185)
     [java] at org.apache.poi.ooxml.util.OOXMLLite.main(OOXMLLite.java:101)
     [java] Time: 129.526
     [java] There were 2 failures:
     [java] 1) zipBombCheckSizesWithinLimits(org.apache.poi.openxml4j.opc.TestPackage)
     [java] org.apache.poi.ooxml.POIXMLException: Zip bomb detected! The file would exceed the max size of the expanded data in the zip-file.
     [java] This may indicates that the file is used to inflate memory usage and thus could pose a security risk.
     [java] You can adjust this limit via ZipSecureFile.setMaxEntrySize() if you need to work with files which are very large.
     [java] Uncompressed size: 1048807, Raw/compressed size: 57587
     [java] Limits: MAX_ENTRY_SIZE: 1048783, Entry: xl/sharedStrings.xml
     [java] at org.apache.poi.ooxml.POIXMLFactory.createDocumentPart(POIXMLFactory.java:66)
     [java] at org.apache.poi.ooxml.POIXMLDocumentPart.read(POIXMLDocumentPart.java:648)
     [java] at org.apache.poi.ooxml.POIXMLDocument.load(POIXMLDocument.java:180)
     [java] at org.apache.poi.xssf.usermodel.XSSFWorkbook.<init>(XSSFWorkbook.java:286)
     [java] at org.apache.poi.xssf.usermodel.XSSFWorkbookFactory.createWorkbook(XSSFWorkbookFactory.java:83)
     [java] at org.apache.poi.xssf.usermodel.XSSFWorkbookFactory.createWorkbook(XSSFWorkbookFactory.java:111)
     [java] at sun.reflect.NativeMethodAccessorImpl.invoke0(Native Method)
     [java] at sun.reflect.NativeMethodAccessorImpl.invoke(NativeMethodAccessorImpl.java:62)
     [java] at sun.reflect.DelegatingMethodAccessorImpl.invoke(DelegatingMethodAccessorImpl.java:43)
     [java] at java.lang.reflect.Method.invoke(Method.java:498)
     [java] at org.apache.poi.ss.usermodel.WorkbookFactory.createWorkbook(WorkbookFactory.java:314)
     [java] at org.apache.poi.ss.usermodel.WorkbookFactory.createXSSFWorkbook(WorkbookFactory.java:296)
     [java] at org.apache.poi.ss.usermodel.WorkbookFactory.create(WorkbookFactory.java:284)
     [java] at org.apache.poi.openxml4j.opc.TestPackage.getZipStatsAndConsume(TestPackage.java:938)
     [java] at org.apache.poi.openxml4j.opc.TestPackage.zipBombCheckSizesWithinLimits(TestPackage.java:884)
     [java] at sun.reflect.NativeMethodAccessorImpl.invoke0(Native Method)
     [java] at sun.reflect.NativeMethodAccessorImpl.invoke(NativeMethodAccessorImpl.java:62)
     [java] at sun.reflect.DelegatingMethodAccessorImpl.invoke(DelegatingMethodAccessorImpl.java:43)
     [java] at java.lang.reflect.Method.invoke(Method.java:498)
     [java] at org.junit.runners.model.FrameworkMethod$1.runReflectiveCall(FrameworkMethod.java:50)
     [java] at org.junit.internal.runners.model.ReflectiveCallable.run(ReflectiveCallable.java:12)
     [java] at org.junit.runners.model.FrameworkMethod.invokeExplosively(FrameworkMethod.java:47)
     [java] at org.junit.internal.runners.statements.InvokeMethod.evaluate(InvokeMethod.java:17)
     [java] at org.junit.rules.ExpectedException$ExpectedExceptionStatement.evaluate(ExpectedException.java:239)
     [java] at org.junit.rules.RunRules.evaluate(RunRules.java:20)
     [java] at org.junit.runners.ParentRunner.runLeaf(ParentRunner.java:325)
     [java] at org.junit.runners.BlockJUnit4ClassRunner.runChild(BlockJUnit4ClassRunner.java:78)
     [java] at org.junit.runners.BlockJUnit4ClassRunner.runChild(BlockJUnit4ClassRunner.java:57)
     [java] at org.junit.runners.ParentRunner$3.run(ParentRunner.java:290)
     [java] at org.junit.runners.ParentRunner$1.schedule(ParentRunner.java:71)
     [java] at org.junit.runners.ParentRunner.runChildren(ParentRunner.java:288)
     [java] at org.junit.runners.ParentRunner.access$000(ParentRunner.java:58)
     [java] at org.junit.runners.ParentRunner$2.evaluate(ParentRunner.java:268)
     [java] at org.junit.runners.ParentRunner.run(ParentRunner.java:363)
     [java] at org.junit.runners.Suite.runChild(Suite.java:128)
     [java] at org.junit.runners.Suite.runChild(Suite.java:27)
     [java] at org.junit.runners.ParentRunner$3.run(ParentRunner.java:290)
     [java] at org.junit.runners.ParentRunner$1.schedule(ParentRunner.java:71)
     [java] at org.junit.runners.ParentRunner.runChildren(ParentRunner.java:288)
     [java] at org.junit.runners.ParentRunner.access$000(ParentRunner.java:58)
     [java] at org.junit.runners.ParentRunner$2.evaluate(ParentRunner.java:268)
     [java] at org.junit.runners.ParentRunner.run(ParentRunner.java:363)
     [java] at org.junit.runner.JUnitCore.run(JUnitCore.java:137)
     [java] at org.junit.runner.JUnitCore.run(JUnitCore.java:115)
     [java] at org.junit.runner.JUnitCore.run(JUnitCore.java:105)
     [java] at org.junit.runner.JUnitCore.run(JUnitCore.java:94)
     [java] at org.apache.poi.ooxml.util.OOXMLLite.build(OOXMLLite.java:183)
     [java] at org.apache.poi.ooxml.util.OOXMLLite.main(OOXMLLite.java:101)
     [java] Caused by: java.lang.reflect.InvocationTargetException
     [java] at sun.reflect.NativeConstructorAccessorImpl.newInstance0(Native Method)
     [java] at sun.reflect.NativeConstructorAccessorImpl.newInstance(NativeConstructorAccessorImpl.java:62)
     [java] at sun.reflect.DelegatingConstructorAccessorImpl.newInstance(DelegatingConstructorAccessorImpl.java:45)
     [java] at java.lang.reflect.Constructor.newInstance(Constructor.java:423)
     [java] at org.apache.poi.xssf.usermodel.XSSFFactory.createDocumentPart(XSSFFactory.java:56)
     [java] at org.apache.poi.ooxml.POIXMLFactory.createDocumentPart(POIXMLFactory.java:63)
     [java] ... 47 more
     [java] Caused by: java.io.IOException: Zip bomb detected! The file would exceed the max size of the expanded data in the zip-file.
     [java] This may indicates that the file is used to inflate memory usage and thus could pose a security risk.
     [java] You can adjust this limit via ZipSecureFile.setMaxEntrySize() if you need to work with files which are very large.
     [java] Uncompressed size: 1048807, Raw/compressed size: 57587
     [java] Limits: MAX_ENTRY_SIZE: 1048783, Entry: xl/sharedStrings.xml
     [java] at org.apache.poi.openxml4j.util.ZipArchiveThresholdInputStream.checkThreshold(ZipArchiveThresholdInputStream.java:116)
     [java] at org.apache.poi.openxml4j.util.ZipArchiveThresholdInputStream.read(ZipArchiveThresholdInputStream.java:80)
     [java] at org.apache.xerces.impl.XMLEntityManager$RewindableInputStream.read(Unknown Source)
     [java] at org.apache.xerces.impl.io.UTF8Reader.read(Unknown Source)
     [java] at org.apache.xerces.impl.XMLEntityScanner.load(Unknown Source)
     [java] at org.apache.xerces.impl.XMLEntityScanner.scanContent(Unknown Source)
     [java] at org.apache.xerces.impl.XMLDocumentFragmentScannerImpl.scanContent(Unknown Source)
     [java] at org.apache.xerces.impl.XMLDocumentFragmentScannerImpl$FragmentContentDispatcher.dispatch(Unknown Source)
     [java] at org.apache.xerces.impl.XMLDocumentFragmentScannerImpl.scanDocument(Unknown Source)
     [java] at org.apache.xerces.parsers.XML11Configuration.parse(Unknown Source)
     [java] at org.apache.xerces.parsers.XML11Configuration.parse(Unknown Source)
     [java] at org.apache.xerces.parsers.XMLParser.parse(Unknown Source)
     [java] at org.apache.xerces.parsers.AbstractSAXParser.parse(Unknown Source)
     [java] at org.apache.xmlbeans.impl.store.Locale$SaxLoader.load(Locale.java:3414)
     [java] at org.apache.xmlbeans.impl.store.Locale.parseToXmlObject(Locale.java:1272)
     [java] at org.apache.xmlbeans.impl.store.Locale.parseToXmlObject(Locale.java:1259)
     [java] at org.apache.xmlbeans.impl.schema.SchemaTypeLoaderBase.parse(SchemaTypeLoaderBase.java:345)
     [java] at org.openxmlformats.schemas.spreadsheetml.x2006.main.SstDocument$Factory.parse(Unknown Source)
     [java] at org.apache.poi.xssf.model.SharedStringsTable.readFrom(SharedStringsTable.java:123)
     [java] at org.apache.poi.xssf.model.SharedStringsTable.<init>(SharedStringsTable.java:111)
     [java] ... 53 more
     [java] 2) testBuiltinStyleInit(org.apache.poi.xssf.usermodel.TestTableStyles)
     [java] java.lang.AbstractMethodError: org.apache.xml.serialize.DOMSerializerImpl.getDomConfig()Lorg/w3c/dom/DOMConfiguration;
     [java] at org.apache.poi.xssf.usermodel.XSSFBuiltinTableStyle.styleXML(XSSFBuiltinTableStyle.java:424)
     [java] at org.apache.poi.xssf.usermodel.XSSFBuiltinTableStyle.init(XSSFBuiltinTableStyle.java:406)
     [java] at org.apache.poi.xssf.usermodel.XSSFBuiltinTableStyle.getStyle(XSSFBuiltinTableStyle.java:346)
     [java] at org.apache.poi.xssf.usermodel.TestTableStyles.testBuiltinStyleInit(TestTableStyles.java:45)
     [java] at sun.reflect.NativeMethodAccessorImpl.invoke0(Native Method)
     [java] at sun.reflect.NativeMethodAccessorImpl.invoke(NativeMethodAccessorImpl.java:62)
     [java] at sun.reflect.DelegatingMethodAccessorImpl.invoke(DelegatingMethodAccessorImpl.java:43)
     [java] at java.lang.reflect.Method.invoke(Method.java:498)
     [java] at org.junit.runners.model.FrameworkMethod$1.runReflectiveCall(FrameworkMethod.java:50)
     [java] at org.junit.internal.runners.model.ReflectiveCallable.run(ReflectiveCallable.java:12)
     [java] at org.junit.runners.model.FrameworkMethod.invokeExplosively(FrameworkMethod.java:47)
     [java] at org.junit.internal.runners.statements.InvokeMethod.evaluate(InvokeMethod.java:17)
     [java] at org.junit.runners.ParentRunner.runLeaf(ParentRunner.java:325)
     [java] at org.junit.runners.BlockJUnit4ClassRunner.runChild(BlockJUnit4ClassRunner.java:78)
     [java] at org.junit.runners.BlockJUnit4ClassRunner.runChild(BlockJUnit4ClassRunner.java:57)
     [java] at org.junit.runners.ParentRunner$3.run(ParentRunner.java:290)
     [java] at org.junit.runners.ParentRunner$1.schedule(ParentRunner.java:71)
     [java] at org.junit.runners.ParentRunner.runChildren(ParentRunner.java:288)
     [java] at org.junit.runners.ParentRunner.access$000(ParentRunner.java:58)
     [java] at org.junit.runners.ParentRunner$2.evaluate(ParentRunner.java:268)
     [java] at org.junit.runners.ParentRunner.run(ParentRunner.java:363)
     [java] at org.junit.runners.Suite.runChild(Suite.java:128)
     [java] at org.junit.runners.Suite.runChild(Suite.java:27)
     [java] at org.junit.runners.ParentRunner$3.run(ParentRunner.java:290)
     [java] at org.junit.runners.ParentRunner$1.schedule(ParentRunner.java:71)
     [java] at org.junit.runners.ParentRunner.runChildren(ParentRunner.java:288)
     [java] at org.junit.runners.ParentRunner.access$000(ParentRunner.java:58)
     [java] at org.junit.runners.ParentRunner$2.evaluate(ParentRunner.java:268)
     [java] at org.junit.runners.ParentRunner.run(ParentRunner.java:363)
     [java] at org.junit.runner.JUnitCore.run(JUnitCore.java:137)
     [java] at org.junit.runner.JUnitCore.run(JUnitCore.java:115)
     [java] at org.junit.runner.JUnitCore.run(JUnitCore.java:105)
     [java] at org.junit.runner.JUnitCore.run(JUnitCore.java:94)
     [java] at org.apache.poi.ooxml.util.OOXMLLite.build(OOXMLLite.java:183)
     [java] at org.apache.poi.ooxml.util.OOXMLLite.main(OOXMLLite.java:101)
     [java]
     [java] FAILURES!!!
     [java] Tests run: 2454,  Failures: 2
     [java]

BUILD FAILED
<https://builds.apache.org/job/POI-DSL-old-Xerces/ws/build.xml>:1702: Java returned: 1

Total time: 4 minutes 31 seconds
Build step 'Invoke Ant' marked build as failure
Skipping publisher since build result is FAILURE
Archiving artifacts
[Fast Archiver] Compressed 59.98 MB of artifacts by 59.5% relative to #95
Skipping publisher since build result is FAILURE
Recording test results
ERROR: Step ‘Publish JUnit test result report’ failed: No test report files were found. Configuration error?

---------------------------------------------------------------------
To unsubscribe, e-mail: [hidden email]
For additional commands, e-mail: [hidden email]

Reply | Threaded
Open this post in threaded view
|

Build failed in Jenkins: POI-DSL-old-Xerces #100

Apache Jenkins Server
See <https://builds.apache.org/job/POI-DSL-old-Xerces/100/display/redirect?page=changes>

Changes:

[fanningpj] use jaxp transformer instead of dom serializer to try fix old-xerces test failure

[abearez] adding tricks from other answers on StackOverflow

[abearez] example from StackOverflow question 47065690

[abearez] more XDDF improvements based on SO examples

[fanningpj] [bug-62800] Fix null pointer exception if a picture shape has no blip id

[abearez] XDDF improvements based on StackOverflow examples

[abearez] fix lgtm alerts in examples

[abearez] fixed bug 59625

[abearez] change chart data to experiment diverse scripts

[fanningpj] deprecate unused Nullable class

[fanningpj] change method to get XMLEventFactory due to issues seen on Android SDK

[fanningpj] disable junit xml collection

[fanningpj] get xmlbeans job to build dist artifacts

[fanningpj] get xmlbeans job to build dist artifacts

[fanningpj] rename xmlbeans job

[fanningpj] [bug-62796] remove use of Stax Namespace class from PackagePropertiesMarshaller

[fanningpj] try to fix xmlbeans jenkins job

[fanningpj] try to set up xmlbeans build

[abearez] fix bug 60509

[abearez] extract valuable code from 54470 submitted patch

[fanningpj] use SAXHelper in example

[fanningpj] use StaxHelper to get event factory

------------------------------------------
[...truncated 402.64 KB...]
      [jar] Building jar: <https://builds.apache.org/job/POI-DSL-old-Xerces/ws/build/ooxml-lite-merged/ooxml-lite-merged.jar>
     [java] Free memory (bytes): 504063184
     [java] Maximum memory (bytes): 514850816
     [java] Total memory (bytes): 514850816
     [java] Collecting unit tests from <https://builds.apache.org/job/POI-DSL-old-Xerces/ws/build/ooxml-test-classes>
     [java] Inner class org.apache.poi.extractor.ooxml.TestExtractorFactory$FunctionEx.class not included
     [java] Inner class org.apache.poi.openxml4j.opc.TestPackage$1.class not included
     [java] Inner class org.apache.poi.openxml4j.opc.ZipFileAssert$1.class not included
     [java] Inner class org.apache.poi.openxml4j.opc.ZipFileAssert$IgnoreXMLDeclEvaluator.class not included
     [java] Inner class org.apache.poi.openxml4j.opc.TestPackage$AnyCauseMatcher.class not included
     [java] Inner class org.apache.poi.util.TestTempFileThreaded$1.class not included
     [java] Inner class org.apache.poi.util.TestTempFileThreaded$TestRunnable.class not included
     [java] Inner class org.apache.poi.ooxml.util.OOXMLLite$2.class not included
     [java] Class org.apache.poi.ooxml.util.OOXMLLite does not derive from TestCase and does not have a @Test annotation
     [java] Inner class org.apache.poi.ooxml.util.OOXMLLite$1.class not included
     [java] Class org.apache.poi.benchmark.generated.AddImageBench_jmhType does not derive from TestCase and does not have a @Test annotation
     [java] Inner class org.apache.poi.xslf.usermodel.TestXSLFFreeformShape$1.class not included
     [java] Found 244 classes
     [java] .......................................................................................I.....I.......
     [java] 9/244: testRgbBinary(org.apache.poi.xddf.usermodel.TestXDDFColor)
     [java] ................................................I.........................................I...........
     [java] 26/244: testPhoneticRuns(org.apache.poi.xssf.eventusermodel.TestReadOnlySharedStringsTable)
     [java] ....................................................................................................
     [java] 37/244: removeMerged(org.apache.poi.xssf.streaming.TestSXSSFSheet)
     [java] .........................................................................................I..I..I.......
     [java] 40/244: cloneSheet(org.apache.poi.xssf.streaming.TestSXSSFWorkbook)
     [java] ...............................II................................................III.I..I.......I.......I....
     [java] 54/244: test57034(org.apache.poi.xssf.usermodel.TestSXSSFBugs)
     [java] .I...................................................................................................
     [java] 59/244: testGetCenter(org.apache.poi.xssf.usermodel.extensions.TestXSSFHeaderFooter)
     [java] ...............................................................................................I.I....I
     [java] 70/244: testReferencesToOtherWorkbooks(org.apache.poi.xssf.usermodel.TestXSSFFormulaEvaluation)
     [java] ....................................................................................................
     [java] 81/244: processFunctionRow[Call](org.apache.poi.xssf.usermodel.TestFormulaEvaluatorOnXSSF)
     [java] ....................................................................................................
     [java] 81/244: processFunctionRow[Gammainv](org.apache.poi.xssf.usermodel.TestFormulaEvaluatorOnXSSF)
     [java] ....................................................................................................
     [java] 81/244: processFunctionRow[Numberstring](org.apache.poi.xssf.usermodel.TestFormulaEvaluatorOnXSSF)
     [java] ....................................................................................................
     [java] 81/244: processFunctionRow[Transpose](org.apache.poi.xssf.usermodel.TestFormulaEvaluatorOnXSSF)
     [java] ....................................................................................................
     [java] 83/244: shiftMergedRowsToMergedRowsOverlappingMergedRegion(org.apache.poi.xssf.usermodel.TestXSSFSheetShiftRows)
     [java] [Fatal Error] :-1:-1: The parser has encountered more than "1" entity expansions in this document; this is the limit imposed by the application.
     [java] Cleaning up unclosed ZipFile for archive <https://builds.apache.org/job/POI-DSL-old-Xerces/ws/test-data/spreadsheet/54764.xlsx>
     [java] .....................................I...............................................................
     [java] 93/244: bug51963(org.apache.poi.xssf.usermodel.TestXSSFBugs)
     [java] Cleaning up unclosed ZipFile for archive <https://builds.apache.org/job/POI-DSL-old-Xerces/ws/test-data/spreadsheet/54764.xlsx>
     [java] ............................I......II............I...I........................I.........I.....I.............
     [java] 94/244: testGetColumnIndex(org.apache.poi.xssf.usermodel.TestXSSFTableColumn)
     [java] .................I...................................................................................
     [java] 108/244: tabColor(org.apache.poi.xssf.usermodel.TestXSSFSheet)
     [java] ....................................................................................................
     [java] 110/244: basicParsing(org.apache.poi.xssf.usermodel.TestXSSFFormulaParser)
     [java] ....................................................................................................
     [java] 120/244: testAddPivotCache(org.apache.poi.xssf.usermodel.TestXSSFWorkbook)
     [java] ....................................................................................................
     [java] 127/244: testRowBounds(org.apache.poi.xssf.usermodel.TestXSSFRow)
     [java] .......................................................................E....................I.........
     [java] 138/244: NonOOXMLFileTypes(org.apache.poi.openxml4j.opc.TestPackage)
     [java] Cleaning up unclosed ZipFile for archive <https://builds.apache.org/job/POI-DSL-old-Xerces/ws/test-data/openxml4j/TestPackageCommon.docx>
     [java] .......................I......................................thread: 2, iter: 0: build/tmp/poifiles/TestTempFileThreaded/25/TestTempFile-2-0-6556215908268262082.xlsx
     [java] thread: 0, iter: 0: build/tmp/poifiles/TestTempFileThreaded/23/TestTempFile-0-0-5343782561563161546.xlsx
     [java] thread: 9, iter: 0: build/tmp/poifiles/TestTempFileThreaded/32/TestTempFile-9-0-3380877543378878645.xlsx
     [java] thread: 7, iter: 0: build/tmp/poifiles/TestTempFileThreaded/30/TestTempFile-7-0-2162610492743397559.xlsx
     [java] thread: 1, iter: 0: build/tmp/poifiles/TestTempFileThreaded/24/TestTempFile-1-0-4854318091930287237.xlsx
     [java] thread: 3, iter: 0: build/tmp/poifiles/TestTempFileThreaded/26/TestTempFile-3-0-1326596454391890163.xlsx
     [java] thread: 4, iter: 0: build/tmp/poifiles/TestTempFileThreaded/27/TestTempFile-4-0-705228104004237698.xlsx
     [java] thread: 5, iter: 0: build/tmp/poifiles/TestTempFileThreaded/28/TestTempFile-5-0-1420530865026418108.xlsx
     [java] thread: 6, iter: 0: build/tmp/poifiles/TestTempFileThreaded/29/TestTempFile-6-0-8591294600197740909.xlsx
     [java] thread: 8, iter: 0: build/tmp/poifiles/TestTempFileThreaded/31/TestTempFile-8-0-4799118145655626766.xlsx
     [java] thread: 1, iter: 30: build/tmp/poifiles/TestTempFileThreaded/24/TestTempFile-1-30-878229719693560949.xlsx
     [java] thread: 2, iter: 30: build/tmp/poifiles/TestTempFileThreaded/25/TestTempFile-2-30-2525260096658066716.xlsx
     [java] thread: 7, iter: 30: build/tmp/poifiles/TestTempFileThreaded/30/TestTempFile-7-30-6506074226363784927.xlsx
     [java] thread: 9, iter: 30: build/tmp/poifiles/TestTempFileThreaded/32/TestTempFile-9-30-1137168175565869361.xlsx
     [java] thread: 5, iter: 30: build/tmp/poifiles/TestTempFileThreaded/28/TestTempFile-5-30-2243886421180070666.xlsx
     [java] thread: 3, iter: 30: build/tmp/poifiles/TestTempFileThreaded/26/TestTempFile-3-30-1825908780268801309.xlsx
     [java] thread: 6, iter: 30: build/tmp/poifiles/TestTempFileThreaded/29/TestTempFile-6-30-1767828467985072230.xlsx
     [java] thread: 0, iter: 30: build/tmp/poifiles/TestTempFileThreaded/23/TestTempFile-0-30-6052662478264696925.xlsx
     [java] thread: 8, iter: 30: build/tmp/poifiles/TestTempFileThreaded/31/TestTempFile-8-30-5870976952562927371.xlsx
     [java] thread: 4, iter: 30: build/tmp/poifiles/TestTempFileThreaded/27/TestTempFile-4-30-8031587545166500624.xlsx
     [java] thread: 9, iter: 60: build/tmp/poifiles/TestTempFileThreaded/32/TestTempFile-9-60-1570854848971482165.xlsx
     [java] thread: 2, iter: 60: build/tmp/poifiles/TestTempFileThreaded/25/TestTempFile-2-60-5904998240068176110.xlsx
     [java] thread: 3, iter: 60: build/tmp/poifiles/TestTempFileThreaded/26/TestTempFile-3-60-3179677870681248798.xlsx
     [java] thread: 7, iter: 60: build/tmp/poifiles/TestTempFileThreaded/30/TestTempFile-7-60-6294845194292945779.xlsx
     [java] thread: 5, iter: 60: build/tmp/poifiles/TestTempFileThreaded/28/TestTempFile-5-60-6194958195424836520.xlsx
     [java] thread: 0, iter: 60: build/tmp/poifiles/TestTempFileThreaded/23/TestTempFile-0-60-7282480772918708280.xlsx
     [java] thread: 1, iter: 60: build/tmp/poifiles/TestTempFileThreaded/24/TestTempFile-1-60-7379491590737492966.xlsx
     [java] thread: 8, iter: 60: build/tmp/poifiles/TestTempFileThreaded/31/TestTempFile-8-60-4028753365885393453.xlsx
     [java] thread: 4, iter: 60: build/tmp/poifiles/TestTempFileThreaded/27/TestTempFile-4-60-2336123731978674292.xlsx
     [java] thread: 6, iter: 60: build/tmp/poifiles/TestTempFileThreaded/29/TestTempFile-6-60-4738194073737936334.xlsx
     [java] thread: 9, iter: 90: build/tmp/poifiles/TestTempFileThreaded/32/TestTempFile-9-90-2801725382191407655.xlsx
     [java] thread: 2, iter: 90: build/tmp/poifiles/TestTempFileThreaded/25/TestTempFile-2-90-1483212302747275695.xlsx
     [java] thread: 3, iter: 90: build/tmp/poifiles/TestTempFileThreaded/26/TestTempFile-3-90-3182185238064428296.xlsx
     [java] thread: 1, iter: 90: build/tmp/poifiles/TestTempFileThreaded/24/TestTempFile-1-90-2902789843221136515.xlsx
     [java] thread: 8, iter: 90: build/tmp/poifiles/TestTempFileThreaded/31/TestTempFile-8-90-6471905920527179042.xlsx
     [java] thread: 0, iter: 90: build/tmp/poifiles/TestTempFileThreaded/23/TestTempFile-0-90-7386676631555215584.xlsx
     [java] thread: 4, iter: 90: build/tmp/poifiles/TestTempFileThreaded/27/TestTempFile-4-90-5910332560270799022.xlsx
     [java] thread: 7, iter: 90: build/tmp/poifiles/TestTempFileThreaded/30/TestTempFile-7-90-6917118129716532802.xlsx
     [java] thread: 5, iter: 90: build/tmp/poifiles/TestTempFileThreaded/28/TestTempFile-5-90-4435551867751247542.xlsx
     [java] thread: 6, iter: 90: build/tmp/poifiles/TestTempFileThreaded/29/TestTempFile-6-90-5523925128966308453.xlsx
     [java] thread: 9, iter: 120: build/tmp/poifiles/TestTempFileThreaded/32/TestTempFile-9-120-6865540350259614884.xlsx
     [java] thread: 2, iter: 120: build/tmp/poifiles/TestTempFileThreaded/25/TestTempFile-2-120-6446359299033753697.xlsx
     [java] thread: 1, iter: 120: build/tmp/poifiles/TestTempFileThreaded/24/TestTempFile-1-120-3360487863881552387.xlsx
     [java] thread: 8, iter: 120: build/tmp/poifiles/TestTempFileThreaded/31/TestTempFile-8-120-744279397716950834.xlsx
     [java] thread: 3, iter: 120: build/tmp/poifiles/TestTempFileThreaded/26/TestTempFile-3-120-3413575344410469269.xlsx
     [java] thread: 4, iter: 120: build/tmp/poifiles/TestTempFileThreaded/27/TestTempFile-4-120-3857024346738201276.xlsx
     [java] thread: 5, iter: 120: build/tmp/poifiles/TestTempFileThreaded/28/TestTempFile-5-120-6391486013770838305.xlsx
     [java] thread: 7, iter: 120: build/tmp/poifiles/TestTempFileThreaded/30/TestTempFile-7-120-3351612723234345390.xlsx
     [java] thread: 0, iter: 120: build/tmp/poifiles/TestTempFileThreaded/23/TestTempFile-0-120-5235108156551171945.xlsx
     [java] thread: 6, iter: 120: build/tmp/poifiles/TestTempFileThreaded/29/TestTempFile-6-120-5338551410087471831.xlsx
     [java] thread: 9, iter: 150: build/tmp/poifiles/TestTempFileThreaded/32/TestTempFile-9-150-8429655160240371691.xlsx
     [java] thread: 2, iter: 150: build/tmp/poifiles/TestTempFileThreaded/25/TestTempFile-2-150-1667003405381378903.xlsx
     [java] thread: 3, iter: 150: build/tmp/poifiles/TestTempFileThreaded/26/TestTempFile-3-150-4608676212631045295.xlsx
     [java] thread: 1, iter: 150: build/tmp/poifiles/TestTempFileThreaded/24/TestTempFile-1-150-3773988013063773220.xlsx
     [java] thread: 8, iter: 150: build/tmp/poifiles/TestTempFileThreaded/31/TestTempFile-8-150-1070703701700117239.xlsx
     [java] thread: 5, iter: 150: build/tmp/poifiles/TestTempFileThreaded/28/TestTempFile-5-150-2063094188710095952.xlsx
     [java] thread: 7, iter: 150: build/tmp/poifiles/TestTempFileThreaded/30/TestTempFile-7-150-2297334715846689414.xlsx
     [java] thread: 4, iter: 150: build/tmp/poifiles/TestTempFileThreaded/27/TestTempFile-4-150-1574578970105284553.xlsx
     [java] thread: 0, iter: 150: build/tmp/poifiles/TestTempFileThreaded/23/TestTempFile-0-150-8770777887530265583.xlsx
     [java] thread: 6, iter: 150: build/tmp/poifiles/TestTempFileThreaded/29/TestTempFile-6-150-6257543360863462965.xlsx
     [java] thread: 9, iter: 180: build/tmp/poifiles/TestTempFileThreaded/32/TestTempFile-9-180-5169696488191580735.xlsx
     [java] thread: 2, iter: 180: build/tmp/poifiles/TestTempFileThreaded/25/TestTempFile-2-180-3697640924499267214.xlsx
     [java] thread: 3, iter: 180: build/tmp/poifiles/TestTempFileThreaded/26/TestTempFile-3-180-5042842737910962919.xlsx
     [java] thread: 1, iter: 180: build/tmp/poifiles/TestTempFileThreaded/24/TestTempFile-1-180-7839400486237945695.xlsx
     [java] thread: 5, iter: 180: build/tmp/poifiles/TestTempFileThreaded/28/TestTempFile-5-180-3556534772227972594.xlsx
     [java] thread: 8, iter: 180: build/tmp/poifiles/TestTempFileThreaded/31/TestTempFile-8-180-7250669999299406334.xlsx
     [java] thread: 0, iter: 180: build/tmp/poifiles/TestTempFileThreaded/23/TestTempFile-0-180-1851395060338197031.xlsx
     [java] thread: 7, iter: 180: build/tmp/poifiles/TestTempFileThreaded/30/TestTempFile-7-180-9121283602661164058.xlsx
     [java] thread: 4, iter: 180: build/tmp/poifiles/TestTempFileThreaded/27/TestTempFile-4-180-3099965391102396955.xlsx
     [java] thread: 6, iter: 180: build/tmp/poifiles/TestTempFileThreaded/29/TestTempFile-6-180-5246325644232423370.xlsx
     [java] .......................................
     [java] 163/244: test57829(org.apache.poi.xwpf.usermodel.TestXWPFBugs)
     [java] ....................................................................................................
     [java] 179/244: testAddParagraph(org.apache.poi.xwpf.usermodel.TestXWPFDocument)
     [java] ..I..................I............................................................................I....
     [java] 191/244: testVSDX(org.apache.poi.ooxml.TestPOIXMLDocument)
     [java] .....................I.I..............................................................................
     [java] 207/244: testImageCaching(org.apache.poi.xslf.usermodel.TestXSLFPictureShape)
     [java] ....................................................................................................
     [java] 233/244: setAlignment(org.apache.poi.ss.util.TestXSSFCellUtil)
     [java] ........................................................
     [java] Exception in thread "main" java.lang.RuntimeException: Tests did not succeed, cannot build ooxml-lite jar
     [java] at org.apache.poi.ooxml.util.OOXMLLite.build(OOXMLLite.java:185)
     [java] at org.apache.poi.ooxml.util.OOXMLLite.main(OOXMLLite.java:101)
     [java] Time: 102.864
     [java] There was 1 failure:
     [java] 1) zipBombCheckSizesWithinLimits(org.apache.poi.openxml4j.opc.TestPackage)
     [java] org.apache.poi.ooxml.POIXMLException: Zip bomb detected! The file would exceed the max size of the expanded data in the zip-file.
     [java] This may indicates that the file is used to inflate memory usage and thus could pose a security risk.
     [java] You can adjust this limit via ZipSecureFile.setMaxEntrySize() if you need to work with files which are very large.
     [java] Uncompressed size: 1048807, Raw/compressed size: 57587
     [java] Limits: MAX_ENTRY_SIZE: 1048783, Entry: xl/sharedStrings.xml
     [java] at org.apache.poi.ooxml.POIXMLFactory.createDocumentPart(POIXMLFactory.java:66)
     [java] at org.apache.poi.ooxml.POIXMLDocumentPart.read(POIXMLDocumentPart.java:648)
     [java] at org.apache.poi.ooxml.POIXMLDocument.load(POIXMLDocument.java:180)
     [java] at org.apache.poi.xssf.usermodel.XSSFWorkbook.<init>(XSSFWorkbook.java:286)
     [java] at org.apache.poi.xssf.usermodel.XSSFWorkbookFactory.createWorkbook(XSSFWorkbookFactory.java:83)
     [java] at org.apache.poi.xssf.usermodel.XSSFWorkbookFactory.createWorkbook(XSSFWorkbookFactory.java:111)
     [java] at sun.reflect.NativeMethodAccessorImpl.invoke0(Native Method)
     [java] at sun.reflect.NativeMethodAccessorImpl.invoke(NativeMethodAccessorImpl.java:62)
     [java] at sun.reflect.DelegatingMethodAccessorImpl.invoke(DelegatingMethodAccessorImpl.java:43)
     [java] at java.lang.reflect.Method.invoke(Method.java:498)
     [java] at org.apache.poi.ss.usermodel.WorkbookFactory.createWorkbook(WorkbookFactory.java:314)
     [java] at org.apache.poi.ss.usermodel.WorkbookFactory.createXSSFWorkbook(WorkbookFactory.java:296)
     [java] at org.apache.poi.ss.usermodel.WorkbookFactory.create(WorkbookFactory.java:284)
     [java] at org.apache.poi.openxml4j.opc.TestPackage.getZipStatsAndConsume(TestPackage.java:938)
     [java] at org.apache.poi.openxml4j.opc.TestPackage.zipBombCheckSizesWithinLimits(TestPackage.java:884)
     [java] at sun.reflect.NativeMethodAccessorImpl.invoke0(Native Method)
     [java] at sun.reflect.NativeMethodAccessorImpl.invoke(NativeMethodAccessorImpl.java:62)
     [java] at sun.reflect.DelegatingMethodAccessorImpl.invoke(DelegatingMethodAccessorImpl.java:43)
     [java] at java.lang.reflect.Method.invoke(Method.java:498)
     [java] at org.junit.runners.model.FrameworkMethod$1.runReflectiveCall(FrameworkMethod.java:50)
     [java] at org.junit.internal.runners.model.ReflectiveCallable.run(ReflectiveCallable.java:12)
     [java] at org.junit.runners.model.FrameworkMethod.invokeExplosively(FrameworkMethod.java:47)
     [java] at org.junit.internal.runners.statements.InvokeMethod.evaluate(InvokeMethod.java:17)
     [java] at org.junit.rules.ExpectedException$ExpectedExceptionStatement.evaluate(ExpectedException.java:239)
     [java] at org.junit.rules.RunRules.evaluate(RunRules.java:20)
     [java] at org.junit.runners.ParentRunner.runLeaf(ParentRunner.java:325)
     [java] at org.junit.runners.BlockJUnit4ClassRunner.runChild(BlockJUnit4ClassRunner.java:78)
     [java] at org.junit.runners.BlockJUnit4ClassRunner.runChild(BlockJUnit4ClassRunner.java:57)
     [java] at org.junit.runners.ParentRunner$3.run(ParentRunner.java:290)
     [java] at org.junit.runners.ParentRunner$1.schedule(ParentRunner.java:71)
     [java] at org.junit.runners.ParentRunner.runChildren(ParentRunner.java:288)
     [java] at org.junit.runners.ParentRunner.access$000(ParentRunner.java:58)
     [java] at org.junit.runners.ParentRunner$2.evaluate(ParentRunner.java:268)
     [java] at org.junit.runners.ParentRunner.run(ParentRunner.java:363)
     [java] at org.junit.runners.Suite.runChild(Suite.java:128)
     [java] at org.junit.runners.Suite.runChild(Suite.java:27)
     [java] at org.junit.runners.ParentRunner$3.run(ParentRunner.java:290)
     [java] at org.junit.runners.ParentRunner$1.schedule(ParentRunner.java:71)
     [java] at org.junit.runners.ParentRunner.runChildren(ParentRunner.java:288)
     [java] at org.junit.runners.ParentRunner.access$000(ParentRunner.java:58)
     [java] at org.junit.runners.ParentRunner$2.evaluate(ParentRunner.java:268)
     [java] at org.junit.runners.ParentRunner.run(ParentRunner.java:363)
     [java] at org.junit.runner.JUnitCore.run(JUnitCore.java:137)
     [java] at org.junit.runner.JUnitCore.run(JUnitCore.java:115)
     [java] at org.junit.runner.JUnitCore.run(JUnitCore.java:105)
     [java] at org.junit.runner.JUnitCore.run(JUnitCore.java:94)
     [java] at org.apache.poi.ooxml.util.OOXMLLite.build(OOXMLLite.java:183)
     [java] at org.apache.poi.ooxml.util.OOXMLLite.main(OOXMLLite.java:101)
     [java] Caused by: java.lang.reflect.InvocationTargetException
     [java] at sun.reflect.GeneratedConstructorAccessor221.newInstance(Unknown Source)
     [java] at sun.reflect.DelegatingConstructorAccessorImpl.newInstance(DelegatingConstructorAccessorImpl.java:45)
     [java] at java.lang.reflect.Constructor.newInstance(Constructor.java:423)
     [java] at org.apache.poi.xssf.usermodel.XSSFFactory.createDocumentPart(XSSFFactory.java:56)
     [java] at org.apache.poi.ooxml.POIXMLFactory.createDocumentPart(POIXMLFactory.java:63)
     [java] ... 47 more
     [java] Caused by: java.io.IOException: Zip bomb detected! The file would exceed the max size of the expanded data in the zip-file.
     [java] This may indicates that the file is used to inflate memory usage and thus could pose a security risk.
     [java] You can adjust this limit via ZipSecureFile.setMaxEntrySize() if you need to work with files which are very large.
     [java] Uncompressed size: 1048807, Raw/compressed size: 57587
     [java] Limits: MAX_ENTRY_SIZE: 1048783, Entry: xl/sharedStrings.xml
     [java] at org.apache.poi.openxml4j.util.ZipArchiveThresholdInputStream.checkThreshold(ZipArchiveThresholdInputStream.java:116)
     [java] at org.apache.poi.openxml4j.util.ZipArchiveThresholdInputStream.read(ZipArchiveThresholdInputStream.java:80)
     [java] at org.apache.xerces.impl.XMLEntityManager$RewindableInputStream.read(Unknown Source)
     [java] at org.apache.xerces.impl.io.UTF8Reader.read(Unknown Source)
     [java] at org.apache.xerces.impl.XMLEntityScanner.load(Unknown Source)
     [java] at org.apache.xerces.impl.XMLEntityScanner.scanContent(Unknown Source)
     [java] at org.apache.xerces.impl.XMLDocumentFragmentScannerImpl.scanContent(Unknown Source)
     [java] at org.apache.xerces.impl.XMLDocumentFragmentScannerImpl$FragmentContentDispatcher.dispatch(Unknown Source)
     [java] at org.apache.xerces.impl.XMLDocumentFragmentScannerImpl.scanDocument(Unknown Source)
     [java] at org.apache.xerces.parsers.XML11Configuration.parse(Unknown Source)
     [java] at org.apache.xerces.parsers.XML11Configuration.parse(Unknown Source)
     [java] at org.apache.xerces.parsers.XMLParser.parse(Unknown Source)
     [java] at org.apache.xerces.parsers.AbstractSAXParser.parse(Unknown Source)
     [java] at org.apache.xmlbeans.impl.store.Locale$SaxLoader.load(Locale.java:3414)
     [java] at org.apache.xmlbeans.impl.store.Locale.parseToXmlObject(Locale.java:1272)
     [java] at org.apache.xmlbeans.impl.store.Locale.parseToXmlObject(Locale.java:1259)
     [java] at org.apache.xmlbeans.impl.schema.SchemaTypeLoaderBase.parse(SchemaTypeLoaderBase.java:345)
     [java] at org.openxmlformats.schemas.spreadsheetml.x2006.main.SstDocument$Factory.parse(Unknown Source)
     [java] at org.apache.poi.xssf.model.SharedStringsTable.readFrom(SharedStringsTable.java:123)
     [java] at org.apache.poi.xssf.model.SharedStringsTable.<init>(SharedStringsTable.java:111)
     [java] ... 52 more
     [java]
     [java] FAILURES!!!
     [java] Tests run: 2455,  Failures: 1
     [java]

BUILD FAILED
<https://builds.apache.org/job/POI-DSL-old-Xerces/ws/build.xml>:1702: Java returned: 1

Total time: 3 minutes 47 seconds
Build step 'Invoke Ant' marked build as failure
Skipping publisher since build result is FAILURE
Archiving artifacts
[Fast Archiver] Compressed 59.98 MB of artifacts by 59.5% relative to #95
Skipping publisher since build result is FAILURE
Recording test results
ERROR: Step ‘Publish JUnit test result report’ failed: No test report files were found. Configuration error?

---------------------------------------------------------------------
To unsubscribe, e-mail: [hidden email]
For additional commands, e-mail: [hidden email]

Reply | Threaded
Open this post in threaded view
|

Jenkins build is back to normal : POI-DSL-old-Xerces #101

Apache Jenkins Server
See <https://builds.apache.org/job/POI-DSL-old-Xerces/101/display/redirect?page=changes>


---------------------------------------------------------------------
To unsubscribe, e-mail: [hidden email]
For additional commands, e-mail: [hidden email]