Build failed in Jenkins: POI-DSL-old-Xerces #63

classic Classic list List threaded Threaded
3 messages Options
Reply | Threaded
Open this post in threaded view
|

Build failed in Jenkins: POI-DSL-old-Xerces #63

Apache Jenkins Server
See <https://builds.apache.org/job/POI-DSL-old-Xerces/63/display/redirect?page=changes>

Changes:

[abearez] update status for closed github-72

[abearez] Revert "update javadocs for closed github-68"

[abearez] introduce XDDFShapeProperties as user model API (closes #72 from GitHub)

[fanningpj] [github-86] expose language for Text Runs. Thanks to Geoff Baskwill. This closes #86

[centic] Update changelog

[centic] Deprecate methods with typos and provide new ones.

[centic] Remove unused property in build.xml

[centic] Bug 61937: Add more javadoc

[centic] Bug 61543: do not fail with "part already exists" when tables are created/removed

[centic] Bug 61550: Add more information to exception text and verify that it is thrown

[centic] Add .gitattribute file and set lf for one sample-file, see bug 61609

[centic] Bug 61648: Test Sheet.setArrayFormula for SXSSF

[centic] Add test which verifies that bug 61652 is not appearing any more on latest trunk

[centic] Update some tests and IntelliJ warnings
Ignore disabled test instead of not listing it in the test-report at all

[fanningpj] Bug-61947 remove deprecated method

[fanningpj] Bug-61947 remove deprecated method

[fanningpj] Bug-61947 remove deprecated method

[fanningpj] Bug-61947 add back deprecated methods (removed by accident)

[fanningpj] Bug-61947 remove deprecated method

[fanningpj] Bug-61947 remove deprecated method

------------------------------------------
[...truncated 209.73 KB...]
    [junit] Reading document/Bug49933.doc with HWPFFileHandler
    [junit] Reading document/Bug49933.doc with HPSFFileHandler
    [junit] Reading document/Bug50075.doc with HWPFFileHandler
    [junit] Reading document/Bug50075.doc with HPSFFileHandler
    [junit] Reading document/Bug50936_1.doc with HWPFFileHandler
    [junit] Reading document/Bug50936_1.doc with HPSFFileHandler
    [junit] Reading document/Bug50936_2.doc with HWPFFileHandler
    [junit] Reading document/Bug50936_2.doc with HPSFFileHandler
    [junit] Reading document/Bug50936_3.doc with HWPFFileHandler
    [junit] Reading document/Bug50936_3.doc with HPSFFileHandler
    [junit] Reading document/Bug50955.doc with HWPFFileHandler
    [junit] Reading document/Bug50955.doc with HPSFFileHandler
    [junit] Reading document/Bug51170.docx with XWPFFileHandler
    [junit] Reading document/Bug51170.docx with OPCFileHandler
    [junit] Reading document/Bug51604.doc with HWPFFileHandler
    [junit] Reading document/Bug51604.doc with HPSFFileHandler
    [junit] Reading document/Bug51686.doc with HWPFFileHandler
    [junit] Reading document/Bug51686.doc with HPSFFileHandler
    [junit] Reading document/Bug51834.doc with HWPFFileHandler
    [junit] Reading document/Bug51834.doc with HPSFFileHandler
    [junit] Reading document/Bug51890.doc with HWPFFileHandler
    [junit] Reading document/Bug51890.doc with HPSFFileHandler
    [junit] Reading document/Bug51944.doc with HWPFFileHandler
    [junit] Reading document/Bug51944.doc with HPSFFileHandler
    [junit] Reading document/Bug52032_1.doc with HWPFFileHandler
    [junit] Reading document/Bug52032_1.doc with HPSFFileHandler
    [junit] Reading document/Bug52032_2.doc with HWPFFileHandler
    [junit] Reading document/Bug52032_2.doc with HPSFFileHandler
    [junit] Reading document/Bug52032_3.doc with HWPFFileHandler
    [junit] Reading document/Bug52032_3.doc with HPSFFileHandler
    [junit] Reading document/Bug52311.doc with HWPFFileHandler
    [junit] Reading document/Bug52311.doc with HPSFFileHandler
    [junit] Reading document/Bug52583.doc with HWPFFileHandler
    [junit] Reading document/Bug52583.doc with HPSFFileHandler
    [junit] Reading document/Bug53182.doc with HWPFFileHandler
    [junit] Reading document/Bug53182.doc with HPSFFileHandler
    [junit] Reading document/Bug53380_1.doc with HWPFFileHandler
    [junit] Reading document/Bug53380_1.doc with HPSFFileHandler
    [junit] Reading document/Bug53380_2.doc with HWPFFileHandler
    [junit] Reading document/Bug53380_2.doc with HPSFFileHandler
    [junit] Reading document/Bug53380_3.doc with HWPFFileHandler
    [junit] Reading document/Bug53380_3.doc with HPSFFileHandler
    [junit] Reading document/Bug53380_4.doc with HWPFFileHandler
    [junit] Reading document/Bug53380_4.doc with HPSFFileHandler
    [junit] Reading document/Bug53453Section.doc with HWPFFileHandler
    [junit] Reading document/Bug53453Section.doc with HPSFFileHandler
    [junit] Reading document/Bug54771a.docx with XWPFFileHandler
    [junit] Reading document/Bug54771a.docx with OPCFileHandler
    [junit] Reading document/Bug54771b.docx with XWPFFileHandler
    [junit] Reading document/Bug54771b.docx with OPCFileHandler
    [junit] Reading document/Bug54849.docx with XWPFFileHandler
    [junit] Reading document/Bug54849.docx with OPCFileHandler
    [junit] Reading document/Bug55142.docx with XWPFFileHandler
    [junit] Reading document/Bug55142.docx with OPCFileHandler
    [junit] Reading document/Bug60337.docx with XWPFFileHandler
    [junit] Reading document/Bug60337.docx with OPCFileHandler
    [junit] Reading document/Bug60341.docx with XWPFFileHandler
    [junit] Reading document/Bug60341.docx with OPCFileHandler
    [junit] Reading document/Bug60936.doc with HWPFFileHandler
    [junit] Reading document/Bug60936.doc with HPSFFileHandler
    [junit] Reading document/Bug60942.doc with HWPFFileHandler
    [junit] Reading document/Bug60942.doc with HPSFFileHandler
    [junit] Reading document/Bug60942b.doc with HWPFFileHandler
    [junit] Reading document/Bug60942b.doc with HPSFFileHandler
    [junit] Reading document/Bug61268.doc with HWPFFileHandler
    [junit] Attempt to output character of integral value 0 that is not represented in specified output encoding of UTF-8.
    [junit] Attempt to output character of integral value 0 that is not represented in specified output encoding of UTF-8.
    [junit] Attempt to output character of integral value 0 that is not represented in specified output encoding of UTF-8.
    [junit] Attempt to output character of integral value 0 that is not represented in specified output encoding of UTF-8.
    [junit] Reading document/Bug61268.doc with HPSFFileHandler
    [junit] Attempt to output character of integral value 0 that is not represented in specified output encoding of UTF-8.
    [junit] Attempt to output character of integral value 0 that is not represented in specified output encoding of UTF-8.
    [junit] Attempt to output character of integral value 0 that is not represented in specified output encoding of UTF-8.
    [junit] Attempt to output character of integral value 0 that is not represented in specified output encoding of UTF-8.
    [junit] Reading document/ComplexNumberedLists.docx with XWPFFileHandler
    [junit] Reading document/ComplexNumberedLists.docx with OPCFileHandler
    [junit] Reading document/DiffFirstPageHeadFoot.doc with HWPFFileHandler
    [junit] Reading document/DiffFirstPageHeadFoot.doc with HPSFFileHandler
    [junit] Reading document/DiffFirstPageHeadFoot.docx with XWPFFileHandler
    [junit] Reading document/DiffFirstPageHeadFoot.docx with OPCFileHandler
    [junit] Reading document/EmbeddedDocument.docx with XWPFFileHandler
    [junit] Reading document/EmbeddedDocument.docx with OPCFileHandler
    [junit] Reading document/EmptyDocumentWithHeaderFooter.docx with XWPFFileHandler
    [junit] Reading document/EmptyDocumentWithHeaderFooter.docx with OPCFileHandler
    [junit] Reading document/EnforcedWith.docx with XWPFFileHandler
    [junit] Reading document/EnforcedWith.docx with OPCFileHandler
    [junit] Reading document/ExternalEntityInText.docx with XWPFFileHandler
    [junit] Reading document/ExternalEntityInText.docx with OPCFileHandler
    [junit] Reading document/FancyFoot.doc with HWPFFileHandler
    [junit] Reading document/FancyFoot.doc with HPSFFileHandler
    [junit] Reading document/FancyFoot.docx with XWPFFileHandler
    [junit] Reading document/FancyFoot.docx with OPCFileHandler
    [junit] Reading document/FieldCodes.docx with XWPFFileHandler
    [junit] Reading document/FieldCodes.docx with OPCFileHandler
    [junit] Reading document/FldSimple.docx with XWPFFileHandler
    [junit] Reading document/FldSimple.docx with OPCFileHandler
    [junit] Reading document/FloatingPictures.doc with HWPFFileHandler
    [junit] Reading document/FloatingPictures.doc with HPSFFileHandler
    [junit] Reading document/GaiaTest.doc with HWPFFileHandler
    [junit] Reading document/GaiaTest.doc with HPSFFileHandler
    [junit] Reading document/GaiaTestImg.png with NullFileHandler
    [junit] Reading document/HeaderFooterProblematic.doc with HWPFFileHandler
    [junit] Reading document/HeaderFooterProblematic.doc with HPSFFileHandler
    [junit] Reading document/HeaderFooterUnicode.doc with HWPFFileHandler
    [junit] Reading document/HeaderFooterUnicode.doc with HPSFFileHandler
    [junit] Reading document/HeaderFooterUnicode.docx with XWPFFileHandler
    [junit] Reading document/HeaderFooterUnicode.docx with OPCFileHandler
    [junit] Reading document/HeaderWithMacros.doc with HWPFFileHandler
    [junit] Reading document/HeaderWithMacros.doc with HPSFFileHandler
    [junit] Reading document/Headers.docx with XWPFFileHandler
    [junit] Reading document/Headers.docx with OPCFileHandler
    [junit] Reading document/IllustrativeCases.docx with XWPFFileHandler
    [junit] Reading document/IllustrativeCases.docx with OPCFileHandler
    [junit] Reading document/ListEntryNoListTable.doc with HWPFFileHandler
    [junit] Reading document/ListEntryNoListTable.doc with HPSFFileHandler
    [junit] Reading document/Lists.doc with HWPFFileHandler
    [junit] Reading document/Lists.doc with HPSFFileHandler
    [junit] Reading document/MSWriteOld.wri with NullFileHandler
    [junit] Reading document/MarkAuthorsTable.doc with HWPFFileHandler
    [junit] Reading document/MarkAuthorsTable.doc with HPSFFileHandler
    [junit] Reading document/MultipleBodyBug.docx with XWPFFileHandler
    [junit] Reading document/MultipleBodyBug.docx with OPCFileHandler
    [junit] Reading document/NoHeadFoot.doc with HWPFFileHandler
    [junit] Reading document/NoHeadFoot.doc with HPSFFileHandler
    [junit] Reading document/NoHeadFoot.docx with XWPFFileHandler
    [junit] Reading document/NoHeadFoot.docx with OPCFileHandler
    [junit] Reading document/Numbering.docx with XWPFFileHandler
    [junit] Reading document/Numbering.docx with OPCFileHandler
    [junit] Reading document/NumberingWOverrides.docx with XWPFFileHandler
    [junit] Reading document/NumberingWOverrides.docx with OPCFileHandler
    [junit] Reading document/PageSpecificHeadFoot.doc with HWPFFileHandler
    [junit] Reading document/PageSpecificHeadFoot.doc with HPSFFileHandler
    [junit] Reading document/PageSpecificHeadFoot.docx with XWPFFileHandler
    [junit] Reading document/PageSpecificHeadFoot.docx with OPCFileHandler
    [junit] Reading document/PasswordProtected.doc with HWPFFileHandler
    [junit] Reading document/PasswordProtected.doc with HPSFFileHandler
    [junit] Reading document/Picture_Alternative_Text.doc with HWPFFileHandler
    [junit] Reading document/Picture_Alternative_Text.doc with HPSFFileHandler
    [junit] Reading document/PngPicture.doc with HWPFFileHandler
    [junit] Reading document/PngPicture.doc with HPSFFileHandler
    [junit] Reading document/ProblemExtracting.doc with HWPFFileHandler
    [junit] Reading document/ProblemExtracting.doc with HPSFFileHandler
    [junit] Reading document/SampleDoc.doc with HWPFFileHandler
    [junit] Reading document/SampleDoc.doc with HPSFFileHandler
    [junit] Reading document/SampleDoc.docx with XWPFFileHandler
    [junit] Reading document/SampleDoc.docx with OPCFileHandler
    [junit] Reading document/SampleDoc.txt with NullFileHandler
    [junit] Reading document/SimpleHeadThreeColFoot.doc with HWPFFileHandler
    [junit] Reading document/SimpleHeadThreeColFoot.doc with HPSFFileHandler
    [junit] Reading document/SimpleHeadThreeColFoot.docx with XWPFFileHandler
    [junit] Reading document/SimpleHeadThreeColFoot.docx with OPCFileHandler
    [junit] Reading document/SimpleMacro.doc with HWPFFileHandler
    [junit] Reading document/SimpleMacro.doc with HPSFFileHandler
    [junit] Reading document/SimpleMacro.docm with XWPFFileHandler
    [junit] Reading document/SimpleMacro.docm with OPCFileHandler
    [junit] Reading document/SimpleMacro.vba with NullFileHandler
    [junit] Reading document/Styles.docx with XWPFFileHandler
    [junit] Reading document/Styles.docx with OPCFileHandler
    [junit] Reading document/TestDocument.docx with XWPFFileHandler
    [junit] Reading document/TestDocument.docx with OPCFileHandler
    [junit] Reading document/TestPoiXMLDocumentCorePropertiesGetKeywords.docx with XWPFFileHandler
    [junit] Reading document/TestPoiXMLDocumentCorePropertiesGetKeywords.docx with OPCFileHandler
    [junit] Reading document/TestTableCellAlign.docx with XWPFFileHandler
    [junit] Reading document/TestTableCellAlign.docx with OPCFileHandler
    [junit] Reading document/ThreeColFoot.doc with HWPFFileHandler
    [junit] Reading document/ThreeColFoot.doc with HPSFFileHandler
    [junit] Reading document/ThreeColFoot.docx with XWPFFileHandler
    [junit] Reading document/ThreeColFoot.docx with OPCFileHandler
    [junit] Reading document/ThreeColHead.doc with HWPFFileHandler
    [junit] Reading document/ThreeColHead.doc with HPSFFileHandler
    [junit] Reading document/ThreeColHead.docx with XWPFFileHandler
    [junit] Reading document/ThreeColHead.docx with OPCFileHandler
    [junit] Reading document/ThreeColHeadFoot.doc with HWPFFileHandler
    [junit] Reading document/ThreeColHeadFoot.doc with HPSFFileHandler
    [junit] Reading document/ThreeColHeadFoot.docx with XWPFFileHandler
    [junit] Reading document/ThreeColHeadFoot.docx with OPCFileHandler
    [junit] Reading document/Tika-792.docx with XWPFFileHandler
    [junit] Reading document/Tika-792.docx with OPCFileHandler
    [junit] Reading document/VariousPictures.docx with XWPFFileHandler
    [junit] Reading document/VariousPictures.docx with OPCFileHandler
    [junit] Reading document/WithArtShapes.doc with HWPFFileHandler
    [junit] Reading document/WithArtShapes.doc with HPSFFileHandler
    [junit] Reading document/WithGIF.docx with XWPFFileHandler
    [junit] Reading document/WithGIF.docx with OPCFileHandler
    [junit] Reading document/WithTabs.docx with XWPFFileHandler
    [junit] Reading document/WithTabs.docx with OPCFileHandler
    [junit] Reading document/Word6.doc with HWPFFileHandler
    [junit] Reading document/Word6.doc with HPSFFileHandler
    [junit] Reading document/Word6_sections.doc with HWPFFileHandler
    [junit] Reading document/Word6_sections.doc with HPSFFileHandler
    [junit] Reading document/Word6_sections2.doc with HWPFFileHandler
    [junit] Reading document/Word6_sections2.doc with HPSFFileHandler
    [junit] Reading document/Word95.doc with HWPFFileHandler
    [junit] Reading document/Word95.doc with HPSFFileHandler
    [junit] Reading document/WordWithAttachments.docx with XWPFFileHandler
    [junit] Reading document/WordWithAttachments.docx with OPCFileHandler
    [junit] Reading document/abstract1.jpg with NullFileHandler
    [junit] Reading document/abstract2.jpg with NullFileHandler
    [junit] Reading document/abstract3.jpg with NullFileHandler
    [junit] Reading document/abstract4.jpg with NullFileHandler
    [junit] Reading document/au.edu.utas.www___data_assets_word_doc_0003_154335_International-Travel-Approval-Request-Form.doc with HWPFFileHandler
    [junit] Reading document/au.edu.utas.www___data_assets_word_doc_0003_154335_International-Travel-Approval-Request-Form.doc with HPSFFileHandler
    [junit] Reading document/bookmarks.docx with XWPFFileHandler
    [junit] Reading document/bookmarks.docx with OPCFileHandler
    [junit] Reading document/bug53475-password-is-pass.docx with XWPFFileHandler
    [junit] Reading document/bug53475-password-is-pass.docx with OPCFileHandler
    [junit] Reading document/bug53475-password-is-solrcell.docx with XWPFFileHandler
    [junit] #
    [junit] # A fatal error has been detected by the Java Runtime Environment:
    [junit] #
    [junit] #  SIGSEGV (0xb) at pc=0x00007fe0753e23a8, pid=2563, tid=0x00007fe08afed700
    [junit] #
    [junit] # JRE version: Java(TM) SE Runtime Environment (8.0_152-b16) (build 1.8.0_152-b16)
    [junit] # Java VM: Java HotSpot(TM) 64-Bit Server VM (25.152-b16 mixed mode linux-amd64 compressed oops)
    [junit] # Problematic frame:
    [junit] # J 9468 C1 com.sun.crypto.provider.AESCrypt.mul4(I[B)I (181 bytes) @ 0x00007fe0753e23a8 [0x00007fe0753e1d20+0x688]
    [junit] #
    [junit] # Failed to write core dump. Core dumps have been disabled. To enable core dumping, try "ulimit -c unlimited" before starting Java again
    [junit] #
    [junit] # An error report file with more information is saved as:
    [junit] # <https://builds.apache.org/job/POI-DSL-old-Xerces/ws/hs_err_pid2563.log>
    [junit] Compiled method (c1)   23777 9468       3       com.sun.crypto.provider.AESCrypt::mul4 (181 bytes)
    [junit]  total in heap  [0x00007fe0753e1b10,0x00007fe0753e2f70] = 5216
    [junit]  relocation     [0x00007fe0753e1c38,0x00007fe0753e1d10] = 216
    [junit]  main code      [0x00007fe0753e1d20,0x00007fe0753e2680] = 2400
    [junit]  stub code      [0x00007fe0753e2680,0x00007fe0753e2710] = 144
    [junit]  oops           [0x00007fe0753e2710,0x00007fe0753e2718] = 8
    [junit]  metadata       [0x00007fe0753e2718,0x00007fe0753e2720] = 8
    [junit]  scopes data    [0x00007fe0753e2720,0x00007fe0753e2b50] = 1072
    [junit]  scopes pcs     [0x00007fe0753e2b50,0x00007fe0753e2ea0] = 848
    [junit]  dependencies   [0x00007fe0753e2ea0,0x00007fe0753e2ea8] = 8
    [junit]  nul chk table  [0x00007fe0753e2ea8,0x00007fe0753e2f70] = 200
    [junit] #
    [junit] # If you would like to submit a bug report, please visit:
    [junit] #   http://bugreport.java.com/bugreport/crash.jsp
    [junit] #
    [junit] Running org.apache.poi.TestAllFiles
    [junit] Tests run: 1, Failures: 0, Errors: 1, Skipped: 0, Time elapsed: 0 sec

BUILD FAILED
<https://builds.apache.org/job/POI-DSL-old-Xerces/ws/build.xml>:1470: Test org.apache.poi.TestAllFiles failed (crashed)

Total time: 9 minutes 7 seconds
Build step 'Invoke Ant' marked build as failure
Skipping publisher since build result is FAILURE
Archiving artifacts
[Fast Archiver] Compressed 125.24 MB of artifacts by 94.3% relative to #62
Skipping publisher since build result is FAILURE
Recording test results

---------------------------------------------------------------------
To unsubscribe, e-mail: [hidden email]
For additional commands, e-mail: [hidden email]

Reply | Threaded
Open this post in threaded view
|

Build failed in Jenkins: POI-DSL-old-Xerces #64

Apache Jenkins Server
See <https://builds.apache.org/job/POI-DSL-old-Xerces/64/display/redirect?page=changes>

Changes:

[fanningpj] Remove use of xmlbeans 2.3.0 in build to simplify our build dependencies

[fanningpj] Remove use of xmlbeans 2.3.0 in build to simplify our build dependencies

[fanningpj] remove unnecessary test override

------------------------------------------
[...truncated 596.49 KB...]
     [echo]
     [echo] Notes: 1
     [echo] Binaries: 120
     [echo] Archives: 0
     [echo] Standards: 3738
     [echo]
     [echo] Apache Licensed: 3738
     [echo] Generated Documents: 0
     [echo]
     [echo] JavaDocs are generated, thus a license header is optional.
     [echo] Generated files do not require license headers.
     [echo]
     [echo] 0 Unknown Licenses
     [echo]
     [echo] *****************************************************
     [echo]   Files with Apache License headers will be marked AL
     [echo]   Binary files (which do not require any license headers) will be marked B
     [echo]   Compressed archives will be marked A
     [echo]   Notices, licenses etc. will be marked N
     [echo]  
     [echo] *****************************************************

forbidden-apis-check:
[forbiddenapis] Reading bundled API signatures: jdk-unsafe-1.8
[forbiddenapis] Reading bundled API signatures: jdk-deprecated-1.8
[forbiddenapis] Reading bundled API signatures: jdk-internal-1.8
[forbiddenapis] Reading bundled API signatures: jdk-non-portable
[forbiddenapis] Reading bundled API signatures: jdk-reflection
[forbiddenapis] Reading API signatures: <https://builds.apache.org/job/POI-DSL-old-Xerces/ws/src/resources/devtools/forbidden-signatures.txt>
[forbiddenapis] Loading classes to check...
[forbiddenapis] Scanning classes for violations...
[forbiddenapis] Scanned 4147 (and 1928 related) class file(s) for forbidden API invocations (in 7.84s), 0 error(s).
[forbiddenapis] Reading API signatures: <https://builds.apache.org/job/POI-DSL-old-Xerces/ws/src/resources/devtools/forbidden-signatures-prod.txt>
[forbiddenapis] Loading classes to check...
[forbiddenapis] Scanning classes for violations...
[forbiddenapis] Scanned 3233 (and 1530 related) class file(s) for forbidden API invocations (in 1.34s), 0 error(s).

jenkins:

BUILD SUCCESSFUL
Total time: 18 minutes 7 seconds
[integrationtest] $ /home/jenkins/tools/ant/apache-ant-1.9.9/bin/ant -file build.xml run -Dadditionaljar=compile-lib/xercesImpl-2.6.1.jar
Buildfile: <https://builds.apache.org/job/POI-DSL-old-Xerces/ws/src/integrationtest/build.xml>

init:

runSourceBuild:
    [mkdir] Created dir: <https://builds.apache.org/job/POI-DSL-old-Xerces/ws/build/distsourcebuild>
     [echo] Found source package at <https://builds.apache.org/job/POI-DSL-old-Xerces/ws/build/dist/poi-src-4.0.0-SNAPSHOT-20180114.zip>
    [unzip] Expanding: <https://builds.apache.org/job/POI-DSL-old-Xerces/ws/build/dist/poi-src-4.0.0-SNAPSHOT-20180114.zip> into <https://builds.apache.org/job/POI-DSL-old-Xerces/ws/build/distsourcebuild>
    [mkdir] Created dir: <https://builds.apache.org/job/POI-DSL-old-Xerces/ws/build/distsourcebuild/poi-4.0.0-SNAPSHOT/lib>
    [mkdir] Created dir: <https://builds.apache.org/job/POI-DSL-old-Xerces/ws/build/distsourcebuild/poi-4.0.0-SNAPSHOT/ooxml-lib>
    [mkdir] Created dir: <https://builds.apache.org/job/POI-DSL-old-Xerces/ws/build/distsourcebuild/poi-4.0.0-SNAPSHOT/compile-lib>
     [copy] Copying 22 files to <https://builds.apache.org/job/POI-DSL-old-Xerces/ws/build/distsourcebuild/poi-4.0.0-SNAPSHOT/lib>
     [copy] Copying 15 files to <https://builds.apache.org/job/POI-DSL-old-Xerces/ws/build/distsourcebuild/poi-4.0.0-SNAPSHOT/ooxml-lib>
     [copy] Copying 4 files to <https://builds.apache.org/job/POI-DSL-old-Xerces/ws/build/distsourcebuild/poi-4.0.0-SNAPSHOT/compile-lib>
     [echo] Building in temporary dir <https://builds.apache.org/job/POI-DSL-old-Xerces/ws/build/distsourcebuild/poi-4.0.0-SNAPSHOT/>

check-jars:

fetch-jars:

check-ooxml-jars:

fetch-ooxml-jars:

init:
    [mkdir] Created dir: <https://builds.apache.org/job/POI-DSL-old-Xerces/ws/build/distsourcebuild/poi-4.0.0-SNAPSHOT/build>
    [mkdir] Created dir: <https://builds.apache.org/job/POI-DSL-old-Xerces/ws/build/distsourcebuild/poi-4.0.0-SNAPSHOT/build/classes>
    [mkdir] Created dir: <https://builds.apache.org/job/POI-DSL-old-Xerces/ws/build/distsourcebuild/poi-4.0.0-SNAPSHOT/build/test-classes>
    [mkdir] Created dir: <https://builds.apache.org/job/POI-DSL-old-Xerces/ws/build/distsourcebuild/poi-4.0.0-SNAPSHOT/build/test-results>
    [mkdir] Created dir: <https://builds.apache.org/job/POI-DSL-old-Xerces/ws/build/distsourcebuild/poi-4.0.0-SNAPSHOT/build/scratchpad-classes>
    [mkdir] Created dir: <https://builds.apache.org/job/POI-DSL-old-Xerces/ws/build/distsourcebuild/poi-4.0.0-SNAPSHOT/build/scratchpad-test-classes>
    [mkdir] Created dir: <https://builds.apache.org/job/POI-DSL-old-Xerces/ws/build/distsourcebuild/poi-4.0.0-SNAPSHOT/build/scratchpad-test-results>
    [mkdir] Created dir: <https://builds.apache.org/job/POI-DSL-old-Xerces/ws/build/distsourcebuild/poi-4.0.0-SNAPSHOT/build/geometry-java>
    [mkdir] Created dir: <https://builds.apache.org/job/POI-DSL-old-Xerces/ws/build/distsourcebuild/poi-4.0.0-SNAPSHOT/build/ooxml-classes>
    [mkdir] Created dir: <https://builds.apache.org/job/POI-DSL-old-Xerces/ws/build/distsourcebuild/poi-4.0.0-SNAPSHOT/build/ooxml-test-classes>
    [mkdir] Created dir: <https://builds.apache.org/job/POI-DSL-old-Xerces/ws/build/distsourcebuild/poi-4.0.0-SNAPSHOT/build/ooxml-test-results>
    [mkdir] Created dir: <https://builds.apache.org/job/POI-DSL-old-Xerces/ws/build/distsourcebuild/poi-4.0.0-SNAPSHOT/build/excelant-classes>
    [mkdir] Created dir: <https://builds.apache.org/job/POI-DSL-old-Xerces/ws/build/distsourcebuild/poi-4.0.0-SNAPSHOT/build/excelant-test-classes>
    [mkdir] Created dir: <https://builds.apache.org/job/POI-DSL-old-Xerces/ws/build/distsourcebuild/poi-4.0.0-SNAPSHOT/build/excelant-test-results>
    [mkdir] Created dir: <https://builds.apache.org/job/POI-DSL-old-Xerces/ws/build/distsourcebuild/poi-4.0.0-SNAPSHOT/build/examples-classes>
    [mkdir] Created dir: <https://builds.apache.org/job/POI-DSL-old-Xerces/ws/build/distsourcebuild/poi-4.0.0-SNAPSHOT/build/integration-test-classes>
    [mkdir] Created dir: <https://builds.apache.org/job/POI-DSL-old-Xerces/ws/build/distsourcebuild/poi-4.0.0-SNAPSHOT/build/integration-test-results>
    [mkdir] Created dir: <https://builds.apache.org/job/POI-DSL-old-Xerces/ws/build/distsourcebuild/poi-4.0.0-SNAPSHOT/build/dist>
    [mkdir] Created dir: <https://builds.apache.org/job/POI-DSL-old-Xerces/ws/build/distsourcebuild/poi-4.0.0-SNAPSHOT/build/tmp/site/build/site>
     [echo] Using Ant: Apache Ant(TM) version 1.9.9 compiled on February 2 2017 from /home/jenkins/tools/ant/apache-ant-1.9.9, Ant detected Java 1.8 (may be different than actual Java sometimes...)
     [echo] Using Java: 1.8.0_152/1.8.0_152-b16/25.152-b16/Java HotSpot(TM) 64-Bit Server VM from Oracle Corporation on Linux: 3.19.0-25-generic

compile-main:
    [javac] Compiling 1212 source files to <https://builds.apache.org/job/POI-DSL-old-Xerces/ws/build/distsourcebuild/poi-4.0.0-SNAPSHOT/build/classes>
    [javac] Note: Some input files use or override a deprecated API.
    [javac] Note: Recompile with -Xlint:deprecation for details.
    [javac] Note: Some input files use unchecked or unsafe operations.
    [javac] Note: Recompile with -Xlint:unchecked for details.
    [javac] Compiling 540 source files to <https://builds.apache.org/job/POI-DSL-old-Xerces/ws/build/distsourcebuild/poi-4.0.0-SNAPSHOT/build/test-classes>
    [javac] Note: Some input files use or override a deprecated API.
    [javac] Note: Recompile with -Xlint:deprecation for details.
     [copy] Copying 4 files to <https://builds.apache.org/job/POI-DSL-old-Xerces/ws/build/distsourcebuild/poi-4.0.0-SNAPSHOT/build/classes>

check-ooxml-xsds:

fetch-ooxml-xsds:

generate-geometry:

compile-scratchpad:
    [javac] Compiling 488 source files to <https://builds.apache.org/job/POI-DSL-old-Xerces/ws/build/distsourcebuild/poi-4.0.0-SNAPSHOT/build/scratchpad-classes>
    [javac] Note: Some input files use or override a deprecated API.
    [javac] Note: Recompile with -Xlint:deprecation for details.
    [javac] Compiling 190 source files to <https://builds.apache.org/job/POI-DSL-old-Xerces/ws/build/distsourcebuild/poi-4.0.0-SNAPSHOT/build/scratchpad-test-classes>
    [javac] Note: Some input files use or override a deprecated API.
    [javac] Note: Recompile with -Xlint:deprecation for details.
     [copy] Copying 2 files to <https://builds.apache.org/job/POI-DSL-old-Xerces/ws/build/distsourcebuild/poi-4.0.0-SNAPSHOT/build/scratchpad-classes>

check-compiled-ooxml-xsds:

compile-ooxml-xsds:

compile-ooxml:
    [javac] Compiling 539 source files to <https://builds.apache.org/job/POI-DSL-old-Xerces/ws/build/distsourcebuild/poi-4.0.0-SNAPSHOT/build/ooxml-classes>
    [javac] Note: Some input files use or override a deprecated API.
    [javac] Note: Recompile with -Xlint:deprecation for details.
    [javac] Compiling 247 source files to <https://builds.apache.org/job/POI-DSL-old-Xerces/ws/build/distsourcebuild/poi-4.0.0-SNAPSHOT/build/ooxml-test-classes>
    [javac] Note: Some input files use or override a deprecated API.
    [javac] Note: Recompile with -Xlint:deprecation for details.
     [copy] Copying 3 files to <https://builds.apache.org/job/POI-DSL-old-Xerces/ws/build/distsourcebuild/poi-4.0.0-SNAPSHOT/build/ooxml-classes>

compile-examples:
    [javac] Compiling 151 source files to <https://builds.apache.org/job/POI-DSL-old-Xerces/ws/build/distsourcebuild/poi-4.0.0-SNAPSHOT/build/examples-classes>
    [javac] Note: <https://builds.apache.org/job/POI-DSL-old-Xerces/ws/build/distsourcebuild/poi-4.0.0-SNAPSHOT/src/examples/src/org/apache/poi/xssf/eventusermodel/examples/FromHowTo.java> uses or overrides a deprecated API.
    [javac] Note: Recompile with -Xlint:deprecation for details.
     [copy] Copying 1 file to <https://builds.apache.org/job/POI-DSL-old-Xerces/ws/build/distsourcebuild/poi-4.0.0-SNAPSHOT/build/examples-classes>

compile-excelant:
    [javac] Compiling 14 source files to <https://builds.apache.org/job/POI-DSL-old-Xerces/ws/build/distsourcebuild/poi-4.0.0-SNAPSHOT/build/excelant-classes>
    [javac] Compiling 13 source files to <https://builds.apache.org/job/POI-DSL-old-Xerces/ws/build/distsourcebuild/poi-4.0.0-SNAPSHOT/build/excelant-test-classes>
     [copy] Copying 1 file to <https://builds.apache.org/job/POI-DSL-old-Xerces/ws/build/distsourcebuild/poi-4.0.0-SNAPSHOT/build/excelant-classes>

compile:

-compile-ooxml-lite-check:

compile-ooxml-lite:
     [echo] Running ooxml-lite generator
    [mkdir] Created dir: <https://builds.apache.org/job/POI-DSL-old-Xerces/ws/build/distsourcebuild/poi-4.0.0-SNAPSHOT/build/ooxml-lite-merged>
      [jar] Building jar: <https://builds.apache.org/job/POI-DSL-old-Xerces/ws/build/distsourcebuild/poi-4.0.0-SNAPSHOT/build/ooxml-lite-merged/ooxml-lite-merged.jar>
     [java] Collecting unit tests from <https://builds.apache.org/job/POI-DSL-old-Xerces/ws/build/distsourcebuild/poi-4.0.0-SNAPSHOT/build/ooxml-test-classes>
     [java] Inner class org.apache.poi.TestPOIXMLDocument$1.class not included
     [java] Inner class org.apache.poi.sl.TestOleShape$Api.class not included
     [java] Inner class org.apache.poi.sl.TestOleShape$1.class not included
     [java] Inner class org.apache.poi.xssf.usermodel.TestMatrixFormulasFromXMLSpreadsheet$1.class not included
     [java] Inner class org.apache.poi.xssf.usermodel.TestMatrixFormulasFromXMLSpreadsheet$Navigator.class not included
     [java] Inner class org.apache.poi.TestPOIXMLDocument$UncaughtHandler.class not included
     [java] Inner class org.apache.poi.dev.TestOOXMLPrettyPrint$1.class not included
     [java] Inner class org.apache.poi.dev.TestOOXMLLister$1.class not included
     [java] Class org.apache.poi.benchmark.generated.AddImageBench_jmhType does not derive from TestCase and does not have a @Test annotation
     [java] Found 224 classes
     [java] .................................................................I..................................................I.....................................................................................................................I................I...............................................................................................................................................I.......................................................................................................I..I..I.I....................................................................................................................................................................................................................................................................................................................................................................................................................................................................................................................................................................................................................................................................................................................................I.................................................................................I......II...........I.I........................I.........I.....I...........................................................................................................................................................................................................................................................................I..........................III.I..I.......I.......I.....I........................................................I.I...I.........................................................................................................................................................................................................................................................................................................................I.....................I.............................................I........................................E...............................................................................................III............................................................................................................I
     [java] Time: 100.724
     [java] There was 1 failure:
     [java] 1) render[53446.ppt](org.apache.poi.xslf.usermodel.TestPPTX2PNG)
     [java] java.lang.IncompatibleClassChangeError: vtable stub
     [java] at java.text.AttributeEntry.hashCode(AttributedString.java:1127)
     [java] at java.util.HashMap.hash(HashMap.java:339)
     [java] at java.util.HashMap.put(HashMap.java:612)
     [java] at java.util.HashSet.add(HashSet.java:220)
     [java] at java.text.AttributedString$AttributeMap.entrySet(AttributedString.java:1083)
     [java] at java.util.AbstractMap.size(AbstractMap.java:85)
     [java] at java.util.AbstractMap.isEmpty(AbstractMap.java:95)
     [java] at sun.font.AttributeValues.merge(AttributeValues.java:317)
     [java] at sun.font.AttributeValues.fromMap(AttributeValues.java:359)
     [java] at sun.font.AttributeValues.fromMap(AttributeValues.java:354)
     [java] at sun.font.Decoration.getDecoration(Decoration.java:114)
     [java] at java.awt.font.StyledParagraph.<init>(StyledParagraph.java:110)
     [java] at java.awt.font.TextLine.standardCreateTextLine(TextLine.java:1198)
     [java] at java.awt.font.TextLayout.standardInit(TextLayout.java:654)
     [java] at java.awt.font.TextLayout.<init>(TextLayout.java:538)
     [java] at sun.java2d.SunGraphics2D.drawString(SunGraphics2D.java:2980)
     [java] at org.apache.poi.hwmf.draw.HwmfGraphics.drawString(HwmfGraphics.java:395)
     [java] at org.apache.poi.hwmf.record.HwmfText$WmfExtTextOut.draw(HwmfText.java:346)
     [java] at org.apache.poi.hwmf.usermodel.HwmfPicture.draw(HwmfPicture.java:127)
     [java] at org.apache.poi.hwmf.draw.HwmfSLImageRenderer.drawImage(HwmfSLImageRenderer.java:120)
     [java] at org.apache.poi.sl.draw.DrawPictureShape.drawContent(DrawPictureShape.java:53)
     [java] at org.apache.poi.sl.draw.DrawSimpleShape.draw(DrawSimpleShape.java:97)
     [java] at org.apache.poi.sl.draw.DrawSheet.draw(DrawSheet.java:71)
     [java] at org.apache.poi.sl.draw.DrawSlide.draw(DrawSlide.java:41)
     [java] at org.apache.poi.hslf.usermodel.HSLFSlide.draw(HSLFSlide.java:490)
     [java] at org.apache.poi.xslf.util.PPTX2PNG.main(PPTX2PNG.java:153)
     [java] at org.apache.poi.xslf.usermodel.TestPPTX2PNG.render(TestPPTX2PNG.java:101)
     [java] at sun.reflect.NativeMethodAccessorImpl.invoke0(Native Method)
     [java] at sun.reflect.NativeMethodAccessorImpl.invoke(NativeMethodAccessorImpl.java:62)
     [java] at sun.reflect.DelegatingMethodAccessorImpl.invoke(DelegatingMethodAccessorImpl.java:43)
     [java] at java.lang.reflect.Method.invoke(Method.java:498)
     [java] at org.junit.runners.model.FrameworkMethod$1.runReflectiveCall(FrameworkMethod.java:50)
     [java] at org.junit.internal.runners.model.ReflectiveCallable.run(ReflectiveCallable.java:12)
     [java] at org.junit.runners.model.FrameworkMethod.invokeExplosively(FrameworkMethod.java:47)
     [java] at org.junit.internal.runners.statements.InvokeMethod.evaluate(InvokeMethod.java:17)
     [java] at org.junit.runners.ParentRunner.runLeaf(ParentRunner.java:325)
     [java] at org.junit.runners.BlockJUnit4ClassRunner.runChild(BlockJUnit4ClassRunner.java:78)
     [java] at org.junit.runners.BlockJUnit4ClassRunner.runChild(BlockJUnit4ClassRunner.java:57)
     [java] at org.junit.runners.ParentRunner$3.run(ParentRunner.java:290)
     [java] at org.junit.runners.ParentRunner$1.schedule(ParentRunner.java:71)
     [java] at org.junit.runners.ParentRunner.runChildren(ParentRunner.java:288)
     [java] at org.junit.runners.ParentRunner.access$000(ParentRunner.java:58)
     [java] at org.junit.runners.ParentRunner$2.evaluate(ParentRunner.java:268)
     [java] at org.junit.runners.ParentRunner.run(ParentRunner.java:363)
     [java] at org.junit.runners.Suite.runChild(Suite.java:128)
     [java] at org.junit.runners.Suite.runChild(Suite.java:27)
     [java] at org.junit.runners.ParentRunner$3.run(ParentRunner.java:290)
     [java] at org.junit.runners.ParentRunner$1.schedule(ParentRunner.java:71)
     [java] at org.junit.runners.ParentRunner.runChildren(ParentRunner.java:288)
     [java] at org.junit.runners.ParentRunner.access$000(ParentRunner.java:58)
     [java] at org.junit.runners.ParentRunner$2.evaluate(ParentRunner.java:268)
     [java] at org.junit.internal.runners.statements.RunBefores.evaluate(RunBefores.java:26)
     [java] at org.junit.runners.ParentRunner.run(ParentRunner.java:363)
     [java] at org.junit.runners.Suite.runChild(Suite.java:128)
     [java] at org.junit.runners.Suite.runChild(Suite.java:27)
     [java] at org.junit.runners.ParentRunner$3.run(ParentRunner.java:290)
     [java] at org.junit.runners.ParentRunner$1.schedule(ParentRunner.java:71)
     [java] at org.junit.runners.ParentRunner.runChildren(ParentRunner.java:288)
     [java] at org.junit.runners.ParentRunner.access$000(ParentRunner.java:58)
     [java] at org.junit.runners.ParentRunner$2.evaluate(ParentRunner.java:268)
     [java] at org.junit.runners.ParentRunner.run(ParentRunner.java:363)
     [java] at org.junit.runner.JUnitCore.run(JUnitCore.java:137)
     [java] at org.junit.runner.JUnitCore.run(JUnitCore.java:115)
     [java] at org.junit.runner.JUnitCore.run(JUnitCore.java:105)
     [java] at org.junit.runner.JUnitCore.run(JUnitCore.java:94)
     [java] at org.apache.poi.util.OOXMLLite.build(OOXMLLite.java:149)
     [java] at org.apache.poi.util.OOXMLLite.main(OOXMLLite.java:94)
     [java]
     [java] FAILURES!!!
     [java] Tests run: 2341,  Failures: 1
     [java]
     [java] Exception in thread "main" java.lang.RuntimeException: Tests did not succeed, cannot build ooxml-lite jar
     [java] at org.apache.poi.util.OOXMLLite.build(OOXMLLite.java:151)
     [java] at org.apache.poi.util.OOXMLLite.main(OOXMLLite.java:94)

BUILD FAILED
<https://builds.apache.org/job/POI-DSL-old-Xerces/ws/src/integrationtest/build.xml>:80: The following error occurred while executing this line:
<https://builds.apache.org/job/POI-DSL-old-Xerces/ws/build/distsourcebuild/poi-4.0.0-SNAPSHOT/build.xml>:1519: Java returned: 1

Total time: 2 minutes 48 seconds
Build step 'Invoke Ant' marked build as failure
Skipping publisher since build result is FAILURE
Archiving artifacts
[Fast Archiver] Compressed 234.92 MB of artifacts by 51.9% relative to #62
Skipping publisher since build result is FAILURE
Recording test results

---------------------------------------------------------------------
To unsubscribe, e-mail: [hidden email]
For additional commands, e-mail: [hidden email]

Reply | Threaded
Open this post in threaded view
|

Jenkins build is back to normal : POI-DSL-old-Xerces #65

Apache Jenkins Server
See <https://builds.apache.org/job/POI-DSL-old-Xerces/65/display/redirect?page=changes>


---------------------------------------------------------------------
To unsubscribe, e-mail: [hidden email]
For additional commands, e-mail: [hidden email]