Build failed in Jenkins: POI-DSL-no-scratchpad #159

classic Classic list List threaded Threaded
2 messages Options
Reply | Threaded
Open this post in threaded view
|

Build failed in Jenkins: POI-DSL-no-scratchpad #159

Apache Jenkins Server
See <https://builds.apache.org/job/POI-DSL-no-scratchpad/159/display/redirect>

Changes:


------------------------------------------
[...truncated 426 B...]
Building remotely on H37 (ubuntu xenial) in workspace <https://builds.apache.org/job/POI-DSL-no-scratchpad/ws/>
[WS-CLEANUP] Deleting project workspace...
[WS-CLEANUP] Done
Updating https://svn.apache.org/repos/asf/poi/trunk at revision '2019-10-27T00:04:11.257 +0000'
U         jenkins/create_jobs.groovy
U         src/testcases/org/apache/poi/ddf/TestEscherBoolProperty.java
U         src/testcases/org/apache/poi/ddf/TestEscherDgRecord.java
U         src/testcases/org/apache/poi/ddf/TestEscherBSERecord.java
U         src/testcases/org/apache/poi/ddf/TestEscherChildAnchorRecord.java
U         src/testcases/org/apache/poi/ddf/TestEscherClientAnchorRecord.java
U         src/testcases/org/apache/poi/ddf/TestEscherClientDataRecord.java
U         src/testcases/org/apache/poi/ddf/TestEscherContainerRecord.java
U         src/testcases/org/apache/poi/ddf/TestEscherDggRecord.java
U         src/testcases/org/apache/poi/ddf/TestEscherOptRecord.java
U         src/testcases/org/apache/poi/ddf/TestEscherSpRecord.java
U         src/testcases/org/apache/poi/ddf/TestEscherSpgrRecord.java
U         src/testcases/org/apache/poi/ddf/TestEscherSplitMenuColorsRecord.java
U         src/testcases/org/apache/poi/ddf/TestUnknownEscherRecord.java
U         src/testcases/org/apache/poi/ss/usermodel/TestFractionFormat.java
U         src/testcases/org/apache/poi/ss/util/TestExpandedDouble.java
U         src/testcases/org/apache/poi/poifs/storage/RawDataUtil.java
U         src/testcases/org/apache/poi/hssf/usermodel/TestPolygon.java
U         src/java/org/apache/poi/util/GenericRecordJsonWriter.java
U         src/java/org/apache/poi/util/GenericRecordXmlWriter.java
U         src/java/org/apache/poi/ss/usermodel/FractionFormat.java
U         src/java/org/apache/poi/hssf/model/InternalWorkbook.java
U         src/java/org/apache/poi/sl/draw/ImageRenderer.java
U         src/java/org/apache/poi/hpsf/Property.java
U         src/integrationtest/org/apache/poi/TestAllFiles.java
U         src/ooxml/java/org/apache/poi/xwpf/usermodel/XWPFComment.java
U         src/ooxml/java/org/apache/poi/xssf/usermodel/XSSFDrawing.java
U         src/ooxml/java/org/apache/poi/xssf/usermodel/helpers/XSSFPasswordHelper.java
U         src/ooxml/java/org/apache/poi/poifs/crypt/dsig/SignatureInfo.java
U         src/ooxml/java/org/apache/poi/poifs/crypt/dsig/services/TSPTimeStampService.java
AU        src/ooxml/testcases/org/apache/poi/xwpf/usermodel/TestXWPFComment.java
U         src/ooxml/testcases/org/apache/poi/poifs/crypt/dsig/TestSignatureConfig.java
U         src/ooxml/testcases/org/apache/poi/ss/extractor/TestEmbeddedExtractor.java
U         src/resources/devtools/forbidden-signatures.txt
U         src/scratchpad/src/org/apache/poi/hslf/usermodel/HSLFObjectData.java
U         src/scratchpad/src/org/apache/poi/hslf/usermodel/HSLFPictureData.java
U         src/scratchpad/src/org/apache/poi/hslf/usermodel/HSLFSlideShow.java
U         src/scratchpad/src/org/apache/poi/hemf/record/emfplus/HemfPlusDraw.java
U         build.gradle
U         gradle/wrapper/gradle-wrapper.jar
U         gradle/wrapper/gradle-wrapper.properties
U         gradlew
U         gradlew.bat
U         build.xml
U         osgi/build.xml
A         test-data/document/comment.docx
U         doap_POI.rdf

<-- Got one external: documentation, svn url: https://svn.apache.org/repos/asf/poi/site/src/documentation -->
Fetching 'https://svn.apache.org/repos/asf/poi/site/src/documentation' at -1 into '<https://builds.apache.org/job/POI-DSL-no-scratchpad/ws/src/documentation'>
U         src/documentation/content/xdocs/download.xml
U         src/documentation/content/xdocs/index.xml
U         src/documentation/content/xdocs/apidocs/index.xml
U         src/documentation/content/xdocs/changes.xml
At revision 1869024


<-- Got one external: forrest.properties, svn url: https://svn.apache.org/repos/asf/poi/site/forrest.properties -->
Fetching 'https://svn.apache.org/repos/asf/poi/site/forrest.properties' at -1 into '<https://builds.apache.org/job/POI-DSL-no-scratchpad/ws/forrest.properties'>
At revision 1869024

At revision 1869024

org.tmatesoft.svn.core.SVNException: svn: E130003: Parser configuration problem: namespace reporting is not enabled
        at org.tmatesoft.svn.core.internal.wc.SVNErrorManager.error(SVNErrorManager.java:70)
        at org.tmatesoft.svn.core.internal.wc.SVNErrorManager.error(SVNErrorManager.java:57)
        at org.tmatesoft.svn.core.internal.io.dav.http.HTTPConnection.request(HTTPConnection.java:760)
        at org.tmatesoft.svn.core.internal.io.dav.http.HTTPConnection.request(HTTPConnection.java:352)
        at org.tmatesoft.svn.core.internal.io.dav.http.HTTPConnection.request(HTTPConnection.java:340)
        at org.tmatesoft.svn.core.internal.io.dav.DAVConnection.performHttpRequest(DAVConnection.java:910)
        at org.tmatesoft.svn.core.internal.io.dav.DAVConnection.doReport(DAVConnection.java:363)
        at org.tmatesoft.svn.core.internal.io.dav.DAVConnection.doReport(DAVConnection.java:353)
        at org.tmatesoft.svn.core.internal.io.dav.DAVRepository.logImpl(DAVRepository.java:1003)
        at org.tmatesoft.svn.core.io.SVNRepository.log(SVNRepository.java:1041)
        at org.tmatesoft.svn.core.internal.wc2.remote.SvnRemoteLog.run(SvnRemoteLog.java:181)
        at org.tmatesoft.svn.core.internal.wc2.remote.SvnRemoteLog.run(SvnRemoteLog.java:35)
        at org.tmatesoft.svn.core.internal.wc2.SvnOperationRunner.run(SvnOperationRunner.java:21)
        at org.tmatesoft.svn.core.wc2.SvnOperationFactory.run(SvnOperationFactory.java:1239)
        at org.tmatesoft.svn.core.wc2.SvnOperation.run(SvnOperation.java:294)
        at org.tmatesoft.svn.core.wc.SVNLogClient.doLog(SVNLogClient.java:968)
        at org.tmatesoft.svn.core.wc.SVNLogClient.doLog(SVNLogClient.java:873)
        at hudson.scm.SubversionChangeLogBuilder.buildModule(SubversionChangeLogBuilder.java:190)
Caused: hudson.util.IOException2: revision check failed on https://svn.apache.org/repos/asf/poi/trunk
        at hudson.scm.SubversionChangeLogBuilder.buildModule(SubversionChangeLogBuilder.java:204)
        at hudson.scm.SubversionChangeLogBuilder.run(SubversionChangeLogBuilder.java:124)
        at hudson.scm.SubversionSCM.calcChangeLog(SubversionSCM.java:757)
        at hudson.scm.SubversionSCM.checkout(SubversionSCM.java:898)
        at hudson.scm.SCM.checkout(SCM.java:504)
        at hudson.model.AbstractProject.checkout(AbstractProject.java:1208)
        at hudson.model.AbstractBuild$AbstractBuildExecution.defaultCheckout(AbstractBuild.java:574)
        at jenkins.scm.SCMCheckoutStrategy.checkout(SCMCheckoutStrategy.java:86)
        at hudson.model.AbstractBuild$AbstractBuildExecution.run(AbstractBuild.java:499)
        at hudson.model.Run.execute(Run.java:1815)
        at hudson.model.FreeStyleBuild.run(FreeStyleBuild.java:43)
        at hudson.model.ResourceController.execute(ResourceController.java:97)
        at hudson.model.Executor.run(Executor.java:429)
Retrying after 10 seconds
Updating https://svn.apache.org/repos/asf/poi/trunk at revision '2019-10-27T00:04:11.257 +0000'

<-- Got one external: documentation, svn url: https://svn.apache.org/repos/asf/poi/site/src/documentation -->
Fetching 'https://svn.apache.org/repos/asf/poi/site/src/documentation' at -1 into '<https://builds.apache.org/job/POI-DSL-no-scratchpad/ws/src/documentation'>
At revision 1869024


<-- Got one external: forrest.properties, svn url: https://svn.apache.org/repos/asf/poi/site/forrest.properties -->
Fetching 'https://svn.apache.org/repos/asf/poi/site/forrest.properties' at -1 into '<https://builds.apache.org/job/POI-DSL-no-scratchpad/ws/forrest.properties'>
At revision 1869024

At revision 1869024

org.tmatesoft.svn.core.SVNException: svn: E130003: Parser configuration problem: namespace reporting is not enabled
        at org.tmatesoft.svn.core.internal.wc.SVNErrorManager.error(SVNErrorManager.java:70)
        at org.tmatesoft.svn.core.internal.wc.SVNErrorManager.error(SVNErrorManager.java:57)
        at org.tmatesoft.svn.core.internal.io.dav.http.HTTPConnection.request(HTTPConnection.java:760)
        at org.tmatesoft.svn.core.internal.io.dav.http.HTTPConnection.request(HTTPConnection.java:352)
        at org.tmatesoft.svn.core.internal.io.dav.http.HTTPConnection.request(HTTPConnection.java:340)
        at org.tmatesoft.svn.core.internal.io.dav.DAVConnection.performHttpRequest(DAVConnection.java:910)
        at org.tmatesoft.svn.core.internal.io.dav.DAVConnection.doReport(DAVConnection.java:363)
        at org.tmatesoft.svn.core.internal.io.dav.DAVConnection.doReport(DAVConnection.java:353)
        at org.tmatesoft.svn.core.internal.io.dav.DAVRepository.logImpl(DAVRepository.java:1003)
        at org.tmatesoft.svn.core.io.SVNRepository.log(SVNRepository.java:1041)
        at org.tmatesoft.svn.core.internal.wc2.remote.SvnRemoteLog.run(SvnRemoteLog.java:181)
        at org.tmatesoft.svn.core.internal.wc2.remote.SvnRemoteLog.run(SvnRemoteLog.java:35)
        at org.tmatesoft.svn.core.internal.wc2.SvnOperationRunner.run(SvnOperationRunner.java:21)
        at org.tmatesoft.svn.core.wc2.SvnOperationFactory.run(SvnOperationFactory.java:1239)
        at org.tmatesoft.svn.core.wc2.SvnOperation.run(SvnOperation.java:294)
        at org.tmatesoft.svn.core.wc.SVNLogClient.doLog(SVNLogClient.java:968)
        at org.tmatesoft.svn.core.wc.SVNLogClient.doLog(SVNLogClient.java:873)
        at hudson.scm.SubversionChangeLogBuilder.buildModule(SubversionChangeLogBuilder.java:190)
Caused: hudson.util.IOException2: revision check failed on https://svn.apache.org/repos/asf/poi/trunk
        at hudson.scm.SubversionChangeLogBuilder.buildModule(SubversionChangeLogBuilder.java:204)
        at hudson.scm.SubversionChangeLogBuilder.run(SubversionChangeLogBuilder.java:124)
        at hudson.scm.SubversionSCM.calcChangeLog(SubversionSCM.java:757)
        at hudson.scm.SubversionSCM.checkout(SubversionSCM.java:898)
        at hudson.scm.SCM.checkout(SCM.java:504)
        at hudson.model.AbstractProject.checkout(AbstractProject.java:1208)
        at hudson.model.AbstractBuild$AbstractBuildExecution.defaultCheckout(AbstractBuild.java:574)
        at jenkins.scm.SCMCheckoutStrategy.checkout(SCMCheckoutStrategy.java:86)
        at hudson.model.AbstractBuild$AbstractBuildExecution.run(AbstractBuild.java:499)
        at hudson.model.Run.execute(Run.java:1815)
        at hudson.model.FreeStyleBuild.run(FreeStyleBuild.java:43)
        at hudson.model.ResourceController.execute(ResourceController.java:97)
        at hudson.model.Executor.run(Executor.java:429)
Retrying after 10 seconds
Updating https://svn.apache.org/repos/asf/poi/trunk at revision '2019-10-27T00:04:11.257 +0000'

<-- Got one external: documentation, svn url: https://svn.apache.org/repos/asf/poi/site/src/documentation -->
Fetching 'https://svn.apache.org/repos/asf/poi/site/src/documentation' at -1 into '<https://builds.apache.org/job/POI-DSL-no-scratchpad/ws/src/documentation'>
At revision 1869024


<-- Got one external: forrest.properties, svn url: https://svn.apache.org/repos/asf/poi/site/forrest.properties -->
Fetching 'https://svn.apache.org/repos/asf/poi/site/forrest.properties' at -1 into '<https://builds.apache.org/job/POI-DSL-no-scratchpad/ws/forrest.properties'>
At revision 1869024

At revision 1869024

org.tmatesoft.svn.core.SVNException: svn: E130003: Parser configuration problem: namespace reporting is not enabled
        at org.tmatesoft.svn.core.internal.wc.SVNErrorManager.error(SVNErrorManager.java:70)
        at org.tmatesoft.svn.core.internal.wc.SVNErrorManager.error(SVNErrorManager.java:57)
        at org.tmatesoft.svn.core.internal.io.dav.http.HTTPConnection.request(HTTPConnection.java:760)
        at org.tmatesoft.svn.core.internal.io.dav.http.HTTPConnection.request(HTTPConnection.java:352)
        at org.tmatesoft.svn.core.internal.io.dav.http.HTTPConnection.request(HTTPConnection.java:340)
        at org.tmatesoft.svn.core.internal.io.dav.DAVConnection.performHttpRequest(DAVConnection.java:910)
        at org.tmatesoft.svn.core.internal.io.dav.DAVConnection.doReport(DAVConnection.java:363)
        at org.tmatesoft.svn.core.internal.io.dav.DAVConnection.doReport(DAVConnection.java:353)
        at org.tmatesoft.svn.core.internal.io.dav.DAVRepository.logImpl(DAVRepository.java:1003)
        at org.tmatesoft.svn.core.io.SVNRepository.log(SVNRepository.java:1041)
        at org.tmatesoft.svn.core.internal.wc2.remote.SvnRemoteLog.run(SvnRemoteLog.java:181)
        at org.tmatesoft.svn.core.internal.wc2.remote.SvnRemoteLog.run(SvnRemoteLog.java:35)
        at org.tmatesoft.svn.core.internal.wc2.SvnOperationRunner.run(SvnOperationRunner.java:21)
        at org.tmatesoft.svn.core.wc2.SvnOperationFactory.run(SvnOperationFactory.java:1239)
        at org.tmatesoft.svn.core.wc2.SvnOperation.run(SvnOperation.java:294)
        at org.tmatesoft.svn.core.wc.SVNLogClient.doLog(SVNLogClient.java:968)
        at org.tmatesoft.svn.core.wc.SVNLogClient.doLog(SVNLogClient.java:873)
        at hudson.scm.SubversionChangeLogBuilder.buildModule(SubversionChangeLogBuilder.java:190)
Caused: hudson.util.IOException2: revision check failed on https://svn.apache.org/repos/asf/poi/trunk
        at hudson.scm.SubversionChangeLogBuilder.buildModule(SubversionChangeLogBuilder.java:204)
        at hudson.scm.SubversionChangeLogBuilder.run(SubversionChangeLogBuilder.java:124)
        at hudson.scm.SubversionSCM.calcChangeLog(SubversionSCM.java:757)
        at hudson.scm.SubversionSCM.checkout(SubversionSCM.java:898)
        at hudson.scm.SCM.checkout(SCM.java:504)
        at hudson.model.AbstractProject.checkout(AbstractProject.java:1208)
        at hudson.model.AbstractBuild$AbstractBuildExecution.defaultCheckout(AbstractBuild.java:574)
        at jenkins.scm.SCMCheckoutStrategy.checkout(SCMCheckoutStrategy.java:86)
        at hudson.model.AbstractBuild$AbstractBuildExecution.run(AbstractBuild.java:499)
        at hudson.model.Run.execute(Run.java:1815)
        at hudson.model.FreeStyleBuild.run(FreeStyleBuild.java:43)
        at hudson.model.ResourceController.execute(ResourceController.java:97)
        at hudson.model.Executor.run(Executor.java:429)
Retrying after 10 seconds
Updating https://svn.apache.org/repos/asf/poi/trunk at revision '2019-10-27T00:04:11.257 +0000'

<-- Got one external: documentation, svn url: https://svn.apache.org/repos/asf/poi/site/src/documentation -->
Fetching 'https://svn.apache.org/repos/asf/poi/site/src/documentation' at -1 into '<https://builds.apache.org/job/POI-DSL-no-scratchpad/ws/src/documentation'>
At revision 1869024


<-- Got one external: forrest.properties, svn url: https://svn.apache.org/repos/asf/poi/site/forrest.properties -->
Fetching 'https://svn.apache.org/repos/asf/poi/site/forrest.properties' at -1 into '<https://builds.apache.org/job/POI-DSL-no-scratchpad/ws/forrest.properties'>
At revision 1869024

At revision 1869024

org.tmatesoft.svn.core.SVNException: svn: E130003: Parser configuration problem: namespace reporting is not enabled
        at org.tmatesoft.svn.core.internal.wc.SVNErrorManager.error(SVNErrorManager.java:70)
        at org.tmatesoft.svn.core.internal.wc.SVNErrorManager.error(SVNErrorManager.java:57)
        at org.tmatesoft.svn.core.internal.io.dav.http.HTTPConnection.request(HTTPConnection.java:760)
        at org.tmatesoft.svn.core.internal.io.dav.http.HTTPConnection.request(HTTPConnection.java:352)
        at org.tmatesoft.svn.core.internal.io.dav.http.HTTPConnection.request(HTTPConnection.java:340)
        at org.tmatesoft.svn.core.internal.io.dav.DAVConnection.performHttpRequest(DAVConnection.java:910)
        at org.tmatesoft.svn.core.internal.io.dav.DAVConnection.doReport(DAVConnection.java:363)
        at org.tmatesoft.svn.core.internal.io.dav.DAVConnection.doReport(DAVConnection.java:353)
        at org.tmatesoft.svn.core.internal.io.dav.DAVRepository.logImpl(DAVRepository.java:1003)
        at org.tmatesoft.svn.core.io.SVNRepository.log(SVNRepository.java:1041)
        at org.tmatesoft.svn.core.internal.wc2.remote.SvnRemoteLog.run(SvnRemoteLog.java:181)
        at org.tmatesoft.svn.core.internal.wc2.remote.SvnRemoteLog.run(SvnRemoteLog.java:35)
        at org.tmatesoft.svn.core.internal.wc2.SvnOperationRunner.run(SvnOperationRunner.java:21)
        at org.tmatesoft.svn.core.wc2.SvnOperationFactory.run(SvnOperationFactory.java:1239)
        at org.tmatesoft.svn.core.wc2.SvnOperation.run(SvnOperation.java:294)
        at org.tmatesoft.svn.core.wc.SVNLogClient.doLog(SVNLogClient.java:968)
        at org.tmatesoft.svn.core.wc.SVNLogClient.doLog(SVNLogClient.java:873)
        at hudson.scm.SubversionChangeLogBuilder.buildModule(SubversionChangeLogBuilder.java:190)
Caused: hudson.util.IOException2: revision check failed on https://svn.apache.org/repos/asf/poi/trunk
        at hudson.scm.SubversionChangeLogBuilder.buildModule(SubversionChangeLogBuilder.java:204)
        at hudson.scm.SubversionChangeLogBuilder.run(SubversionChangeLogBuilder.java:124)
        at hudson.scm.SubversionSCM.calcChangeLog(SubversionSCM.java:757)
        at hudson.scm.SubversionSCM.checkout(SubversionSCM.java:898)
        at hudson.scm.SCM.checkout(SCM.java:504)
        at hudson.model.AbstractProject.checkout(AbstractProject.java:1208)
        at hudson.model.AbstractBuild$AbstractBuildExecution.defaultCheckout(AbstractBuild.java:574)
        at jenkins.scm.SCMCheckoutStrategy.checkout(SCMCheckoutStrategy.java:86)
        at hudson.model.AbstractBuild$AbstractBuildExecution.run(AbstractBuild.java:499)
        at hudson.model.Run.execute(Run.java:1815)
        at hudson.model.FreeStyleBuild.run(FreeStyleBuild.java:43)
        at hudson.model.ResourceController.execute(ResourceController.java:97)
        at hudson.model.Executor.run(Executor.java:429)
Skipping publisher since build result is FAILURE
Archiving artifacts
[Fast Archiver] Compressed 100.59 MB of artifacts by 99.9% relative to #158
Skipping publisher since build result is FAILURE
Recording test results
ERROR: Step ?Publish JUnit test result report? failed: Test reports were found but none of them are new. Did leafNodes run?
For example, <https://builds.apache.org/job/POI-DSL-no-scratchpad/ws/build/excelant-test-results/TEST-org.apache.poi.ss.examples.formula.TestExcelAntUserDefinedFunction.xml> is 6 days 23 hr old


---------------------------------------------------------------------
To unsubscribe, e-mail: [hidden email]
For additional commands, e-mail: [hidden email]

Reply | Threaded
Open this post in threaded view
|

Jenkins build is back to normal : POI-DSL-no-scratchpad #160

Apache Jenkins Server
See <https://builds.apache.org/job/POI-DSL-no-scratchpad/160/display/redirect>


---------------------------------------------------------------------
To unsubscribe, e-mail: [hidden email]
For additional commands, e-mail: [hidden email]