Build failed in Jenkins: POI-DSL-Windows-1.8 #691

classic Classic list List threaded Threaded
8 messages Options
Reply | Threaded
Open this post in threaded view
|

Build failed in Jenkins: POI-DSL-Windows-1.8 #691

Apache Jenkins Server
See <https://builds.apache.org/job/POI-DSL-Windows-1.8/691/display/redirect>

Changes:


------------------------------------------
[...truncated 769.02 MB...]
        at jenkins.util.io.PathRemover.tryRemoveRecursive(PathRemover.java:215)
        at jenkins.util.io.PathRemover.tryRemoveDirectoryContents(PathRemover.java:226)
        at jenkins.util.io.PathRemover.tryRemoveRecursive(PathRemover.java:215)
        at jenkins.util.io.PathRemover.tryRemoveDirectoryContents(PathRemover.java:226)
        at jenkins.util.io.PathRemover.forceRemoveDirectoryContents(PathRemover.java:87)
        at hudson.Util.deleteContentsRecursive(Util.java:259)
        at hudson.Util.deleteContentsRecursive(Util.java:248)
        at hudson.scm.subversion.CheckoutUpdater$SubversionUpdateTask.perform(CheckoutUpdater.java:93)
        at hudson.scm.subversion.WorkspaceUpdater$UpdateTask.delegateTo(WorkspaceUpdater.java:168)
        at hudson.scm.subversion.WorkspaceUpdater$UpdateTask.delegateTo(WorkspaceUpdater.java:176)
        at hudson.scm.subversion.UpdateUpdater$TaskImpl.perform(UpdateUpdater.java:134)
        at hudson.scm.subversion.WorkspaceUpdater$UpdateTask.delegateTo(WorkspaceUpdater.java:168)
        at hudson.scm.SubversionSCM$CheckOutTask.perform(SubversionSCM.java:1041)
        at hudson.scm.SubversionSCM$CheckOutTask.invoke(SubversionSCM.java:1017)
        at hudson.scm.SubversionSCM$CheckOutTask.invoke(SubversionSCM.java:990)
        at hudson.FilePath$FileCallableWrapper.call(FilePath.java:3052)
        at hudson.remoting.UserRequest.perform(UserRequest.java:212)
        at hudson.remoting.UserRequest.perform(UserRequest.java:54)
        at hudson.remoting.Request$2.run(Request.java:369)
        at hudson.remoting.InterceptingExecutorService$1.call(InterceptingExecutorService.java:72)
        at java.util.concurrent.FutureTask.run(Unknown Source)
        at java.util.concurrent.ThreadPoolExecutor.runWorker(Unknown Source)
        at java.util.concurrent.ThreadPoolExecutor$Worker.run(Unknown Source)
        at hudson.remoting.Engine$1.lambda$newThread$0(Engine.java:93)
        at java.lang.Thread.run(Unknown Source)
java.nio.file.AccessDeniedException: <https://builds.apache.org/job/POI-DSL-Windows-1.8/ws/build\tmp\poifiles>
        at sun.nio.fs.WindowsException.translateToIOException(Unknown Source)
        at sun.nio.fs.WindowsException.rethrowAsIOException(Unknown Source)
        at sun.nio.fs.WindowsException.rethrowAsIOException(Unknown Source)
        at sun.nio.fs.WindowsFileSystemProvider.implDelete(Unknown Source)
        at sun.nio.fs.AbstractFileSystemProvider.deleteIfExists(Unknown Source)
        at java.nio.file.Files.deleteIfExists(Unknown Source)
        at jenkins.util.io.PathRemover.removeOrMakeRemovableThenRemove(PathRemover.java:241)
        at jenkins.util.io.PathRemover.tryRemoveFile(PathRemover.java:205)
        at jenkins.util.io.PathRemover.tryRemoveRecursive(PathRemover.java:216)
        at jenkins.util.io.PathRemover.tryRemoveDirectoryContents(PathRemover.java:226)
        at jenkins.util.io.PathRemover.tryRemoveRecursive(PathRemover.java:215)
        at jenkins.util.io.PathRemover.tryRemoveDirectoryContents(PathRemover.java:226)
        at jenkins.util.io.PathRemover.tryRemoveRecursive(PathRemover.java:215)
        at jenkins.util.io.PathRemover.tryRemoveDirectoryContents(PathRemover.java:226)
        at jenkins.util.io.PathRemover.forceRemoveDirectoryContents(PathRemover.java:87)
        at hudson.Util.deleteContentsRecursive(Util.java:259)
        at hudson.Util.deleteContentsRecursive(Util.java:248)
        at hudson.scm.subversion.CheckoutUpdater$SubversionUpdateTask.perform(CheckoutUpdater.java:93)
        at hudson.scm.subversion.WorkspaceUpdater$UpdateTask.delegateTo(WorkspaceUpdater.java:168)
        at hudson.scm.subversion.WorkspaceUpdater$UpdateTask.delegateTo(WorkspaceUpdater.java:176)
        at hudson.scm.subversion.UpdateUpdater$TaskImpl.perform(UpdateUpdater.java:134)
        at hudson.scm.subversion.WorkspaceUpdater$UpdateTask.delegateTo(WorkspaceUpdater.java:168)
        at hudson.scm.SubversionSCM$CheckOutTask.perform(SubversionSCM.java:1041)
        at hudson.scm.SubversionSCM$CheckOutTask.invoke(SubversionSCM.java:1017)
        at hudson.scm.SubversionSCM$CheckOutTask.invoke(SubversionSCM.java:990)
        at hudson.FilePath$FileCallableWrapper.call(FilePath.java:3052)
        at hudson.remoting.UserRequest.perform(UserRequest.java:212)
        at hudson.remoting.UserRequest.perform(UserRequest.java:54)
        at hudson.remoting.Request$2.run(Request.java:369)
        at hudson.remoting.InterceptingExecutorService$1.call(InterceptingExecutorService.java:72)
        at java.util.concurrent.FutureTask.run(Unknown Source)
        at java.util.concurrent.ThreadPoolExecutor.runWorker(Unknown Source)
        at java.util.concurrent.ThreadPoolExecutor$Worker.run(Unknown Source)
        at hudson.remoting.Engine$1.lambda$newThread$0(Engine.java:93)
        at java.lang.Thread.run(Unknown Source)
jenkins.util.io.CompositeIOException: Unable to remove directory <https://builds.apache.org/job/POI-DSL-Windows-1.8/ws/build\tmp> with directory contents: [<https://builds.apache.org/job/POI-DSL-Windows-1.8/ws/build\tmp\maven-javadocs,> <https://builds.apache.org/job/POI-DSL-Windows-1.8/ws/build\tmp\poifiles]>
        at jenkins.util.io.PathRemover.removeOrMakeRemovableThenRemove(PathRemover.java:250)
        at jenkins.util.io.PathRemover.tryRemoveFile(PathRemover.java:205)
        at jenkins.util.io.PathRemover.tryRemoveRecursive(PathRemover.java:216)
        at jenkins.util.io.PathRemover.tryRemoveDirectoryContents(PathRemover.java:226)
        at jenkins.util.io.PathRemover.tryRemoveRecursive(PathRemover.java:215)
        at jenkins.util.io.PathRemover.tryRemoveDirectoryContents(PathRemover.java:226)
        at jenkins.util.io.PathRemover.forceRemoveDirectoryContents(PathRemover.java:87)
        at hudson.Util.deleteContentsRecursive(Util.java:259)
        at hudson.Util.deleteContentsRecursive(Util.java:248)
        at hudson.scm.subversion.CheckoutUpdater$SubversionUpdateTask.perform(CheckoutUpdater.java:93)
        at hudson.scm.subversion.WorkspaceUpdater$UpdateTask.delegateTo(WorkspaceUpdater.java:168)
        at hudson.scm.subversion.WorkspaceUpdater$UpdateTask.delegateTo(WorkspaceUpdater.java:176)
        at hudson.scm.subversion.UpdateUpdater$TaskImpl.perform(UpdateUpdater.java:134)
        at hudson.scm.subversion.WorkspaceUpdater$UpdateTask.delegateTo(WorkspaceUpdater.java:168)
        at hudson.scm.SubversionSCM$CheckOutTask.perform(SubversionSCM.java:1041)
        at hudson.scm.SubversionSCM$CheckOutTask.invoke(SubversionSCM.java:1017)
        at hudson.scm.SubversionSCM$CheckOutTask.invoke(SubversionSCM.java:990)
        at hudson.FilePath$FileCallableWrapper.call(FilePath.java:3052)
        at hudson.remoting.UserRequest.perform(UserRequest.java:212)
        at hudson.remoting.UserRequest.perform(UserRequest.java:54)
        at hudson.remoting.Request$2.run(Request.java:369)
        at hudson.remoting.InterceptingExecutorService$1.call(InterceptingExecutorService.java:72)
        at java.util.concurrent.FutureTask.run(Unknown Source)
        at java.util.concurrent.ThreadPoolExecutor.runWorker(Unknown Source)
        at java.util.concurrent.ThreadPoolExecutor$Worker.run(Unknown Source)
        at hudson.remoting.Engine$1.lambda$newThread$0(Engine.java:93)
        at java.lang.Thread.run(Unknown Source)
java.nio.file.AccessDeniedException: <https://builds.apache.org/job/POI-DSL-Windows-1.8/ws/build\tmp>
        at sun.nio.fs.WindowsException.translateToIOException(Unknown Source)
        at sun.nio.fs.WindowsException.rethrowAsIOException(Unknown Source)
        at sun.nio.fs.WindowsException.rethrowAsIOException(Unknown Source)
        at sun.nio.fs.WindowsFileSystemProvider.implDelete(Unknown Source)
        at sun.nio.fs.AbstractFileSystemProvider.deleteIfExists(Unknown Source)
        at java.nio.file.Files.deleteIfExists(Unknown Source)
        at jenkins.util.io.PathRemover.removeOrMakeRemovableThenRemove(PathRemover.java:237)
        at jenkins.util.io.PathRemover.tryRemoveFile(PathRemover.java:205)
        at jenkins.util.io.PathRemover.tryRemoveRecursive(PathRemover.java:216)
        at jenkins.util.io.PathRemover.tryRemoveDirectoryContents(PathRemover.java:226)
        at jenkins.util.io.PathRemover.tryRemoveRecursive(PathRemover.java:215)
        at jenkins.util.io.PathRemover.tryRemoveDirectoryContents(PathRemover.java:226)
        at jenkins.util.io.PathRemover.forceRemoveDirectoryContents(PathRemover.java:87)
        at hudson.Util.deleteContentsRecursive(Util.java:259)
        at hudson.Util.deleteContentsRecursive(Util.java:248)
        at hudson.scm.subversion.CheckoutUpdater$SubversionUpdateTask.perform(CheckoutUpdater.java:93)
        at hudson.scm.subversion.WorkspaceUpdater$UpdateTask.delegateTo(WorkspaceUpdater.java:168)
        at hudson.scm.subversion.WorkspaceUpdater$UpdateTask.delegateTo(WorkspaceUpdater.java:176)
        at hudson.scm.subversion.UpdateUpdater$TaskImpl.perform(UpdateUpdater.java:134)
        at hudson.scm.subversion.WorkspaceUpdater$UpdateTask.delegateTo(WorkspaceUpdater.java:168)
        at hudson.scm.SubversionSCM$CheckOutTask.perform(SubversionSCM.java:1041)
        at hudson.scm.SubversionSCM$CheckOutTask.invoke(SubversionSCM.java:1017)
        at hudson.scm.SubversionSCM$CheckOutTask.invoke(SubversionSCM.java:990)
        at hudson.FilePath$FileCallableWrapper.call(FilePath.java:3052)
        at hudson.remoting.UserRequest.perform(UserRequest.java:212)
        at hudson.remoting.UserRequest.perform(UserRequest.java:54)
        at hudson.remoting.Request$2.run(Request.java:369)
        at hudson.remoting.InterceptingExecutorService$1.call(InterceptingExecutorService.java:72)
        at java.util.concurrent.FutureTask.run(Unknown Source)
        at java.util.concurrent.ThreadPoolExecutor.runWorker(Unknown Source)
        at java.util.concurrent.ThreadPoolExecutor$Worker.run(Unknown Source)
        at hudson.remoting.Engine$1.lambda$newThread$0(Engine.java:93)
        at java.lang.Thread.run(Unknown Source)
java.nio.file.AccessDeniedException: <https://builds.apache.org/job/POI-DSL-Windows-1.8/ws/build\tmp>
        at sun.nio.fs.WindowsException.translateToIOException(Unknown Source)
        at sun.nio.fs.WindowsException.rethrowAsIOException(Unknown Source)
        at sun.nio.fs.WindowsException.rethrowAsIOException(Unknown Source)
        at sun.nio.fs.WindowsFileSystemProvider.implDelete(Unknown Source)
        at sun.nio.fs.AbstractFileSystemProvider.deleteIfExists(Unknown Source)
        at java.nio.file.Files.deleteIfExists(Unknown Source)
        at jenkins.util.io.PathRemover.removeOrMakeRemovableThenRemove(PathRemover.java:241)
        at jenkins.util.io.PathRemover.tryRemoveFile(PathRemover.java:205)
        at jenkins.util.io.PathRemover.tryRemoveRecursive(PathRemover.java:216)
        at jenkins.util.io.PathRemover.tryRemoveDirectoryContents(PathRemover.java:226)
        at jenkins.util.io.PathRemover.tryRemoveRecursive(PathRemover.java:215)
        at jenkins.util.io.PathRemover.tryRemoveDirectoryContents(PathRemover.java:226)
        at jenkins.util.io.PathRemover.forceRemoveDirectoryContents(PathRemover.java:87)
        at hudson.Util.deleteContentsRecursive(Util.java:259)
        at hudson.Util.deleteContentsRecursive(Util.java:248)
        at hudson.scm.subversion.CheckoutUpdater$SubversionUpdateTask.perform(CheckoutUpdater.java:93)
        at hudson.scm.subversion.WorkspaceUpdater$UpdateTask.delegateTo(WorkspaceUpdater.java:168)
        at hudson.scm.subversion.WorkspaceUpdater$UpdateTask.delegateTo(WorkspaceUpdater.java:176)
        at hudson.scm.subversion.UpdateUpdater$TaskImpl.perform(UpdateUpdater.java:134)
        at hudson.scm.subversion.WorkspaceUpdater$UpdateTask.delegateTo(WorkspaceUpdater.java:168)
        at hudson.scm.SubversionSCM$CheckOutTask.perform(SubversionSCM.java:1041)
        at hudson.scm.SubversionSCM$CheckOutTask.invoke(SubversionSCM.java:1017)
        at hudson.scm.SubversionSCM$CheckOutTask.invoke(SubversionSCM.java:990)
        at hudson.FilePath$FileCallableWrapper.call(FilePath.java:3052)
        at hudson.remoting.UserRequest.perform(UserRequest.java:212)
        at hudson.remoting.UserRequest.perform(UserRequest.java:54)
        at hudson.remoting.Request$2.run(Request.java:369)
        at hudson.remoting.InterceptingExecutorService$1.call(InterceptingExecutorService.java:72)
        at java.util.concurrent.FutureTask.run(Unknown Source)
        at java.util.concurrent.ThreadPoolExecutor.runWorker(Unknown Source)
        at java.util.concurrent.ThreadPoolExecutor$Worker.run(Unknown Source)
        at hudson.remoting.Engine$1.lambda$newThread$0(Engine.java:93)
        at java.lang.Thread.run(Unknown Source)
jenkins.util.io.CompositeIOException: Unable to remove directory <https://builds.apache.org/job/POI-DSL-Windows-1.8/ws/build> with directory contents: [<https://builds.apache.org/job/POI-DSL-Windows-1.8/ws/build\classes,> <https://builds.apache.org/job/POI-DSL-Windows-1.8/ws/build\coverage,> <https://builds.apache.org/job/POI-DSL-Windows-1.8/ws/build\custom-reports-test,> <https://builds.apache.org/job/POI-DSL-Windows-1.8/ws/build\dist,> <https://builds.apache.org/job/POI-DSL-Windows-1.8/ws/build\distsourcebuild,> <https://builds.apache.org/job/POI-DSL-Windows-1.8/ws/build\examples-classes,> <https://builds.apache.org/job/POI-DSL-Windows-1.8/ws/build\excelant-classes,> <https://builds.apache.org/job/POI-DSL-Windows-1.8/ws/build\excelant-test-classes,> <https://builds.apache.org/job/POI-DSL-Windows-1.8/ws/build\excelant-test-results,> <https://builds.apache.org/job/POI-DSL-Windows-1.8/ws/build\excelant-testokfile.txt,> <https://builds.apache.org/job/POI-DSL-Windows-1.8/ws/build\findbugs,> <https://builds.apache.org/job/POI-DSL-Windows-1.8/ws/build\findbugs.html,> <https://builds.apache.org/job/POI-DSL-Windows-1.8/ws/build\findbugs.xml,> <https://builds.apache.org/job/POI-DSL-Windows-1.8/ws/build\geometry-java,> <https://builds.apache.org/job/POI-DSL-Windows-1.8/ws/build\integration-test-classes,> <https://builds.apache.org/job/POI-DSL-Windows-1.8/ws/build\integration-test-results,> <https://builds.apache.org/job/POI-DSL-Windows-1.8/ws/build\integration-testokfile.txt,> <https://builds.apache.org/job/POI-DSL-Windows-1.8/ws/build\jacoco-excelant.exec,> <https://builds.apache.org/job/POI-DSL-Windows-1.8/ws/build\jacoco-integration.exec,> <https://builds.apache.org/job/POI-DSL-Windows-1.8/ws/build\jacoco-main.exec,> <https://builds.apache.org/job/POI-DSL-Windows-1.8/ws/build\jacoco-ooxml-lite-xmlsec.exec,> <https://builds.apache.org/job/POI-DSL-Windows-1.8/ws/build\jacoco-ooxml-lite.exec,> <https://builds.apache.org/job/POI-DSL-Windows-1.8/ws/build\jacoco-ooxml-xmlsec.exec,> <https://builds.apache.org/job/POI-DSL-Windows-1.8/ws/build\jacoco-ooxml.exec,> <https://builds.apache.org/job/POI-DSL-Windows-1.8/ws/build\jacoco-scratchpad.exec,> <https://builds.apache.org/job/POI-DSL-Windows-1.8/ws/build\main-testokfile.txt,> <https://builds.apache.org/job/POI-DSL-Windows-1.8/ws/build\ooxml-classes,> <https://builds.apache.org/job/POI-DSL-Windows-1.8/ws/build\ooxml-lite-agent.jar,> <https://builds.apache.org/job/POI-DSL-Windows-1.8/ws/build\ooxml-lite-classes.jar,> <https://builds.apache.org/job/POI-DSL-Windows-1.8/ws/build\ooxml-lite-report.txt,> <https://builds.apache.org/job/POI-DSL-Windows-1.8/ws/build\ooxml-lite-report.txt-pat,> <https://builds.apache.org/job/POI-DSL-Windows-1.8/ws/build\ooxml-test-classes,> <https://builds.apache.org/job/POI-DSL-Windows-1.8/ws/build\ooxml-test-results,> <https://builds.apache.org/job/POI-DSL-Windows-1.8/ws/build\poi-manifest.mf,> <https://builds.apache.org/job/POI-DSL-Windows-1.8/ws/build\rat,> <https://builds.apache.org/job/POI-DSL-Windows-1.8/ws/build\scratchpad-classes,> <https://builds.apache.org/job/POI-DSL-Windows-1.8/ws/build\scratchpad-test-classes,> <https://builds.apache.org/job/POI-DSL-Windows-1.8/ws/build\scratchpad-test-results,> <https://builds.apache.org/job/POI-DSL-Windows-1.8/ws/build\scratchpad-testokfile.txt,> <https://builds.apache.org/job/POI-DSL-Windows-1.8/ws/build\sigtest.xlsx,> <https://builds.apache.org/job/POI-DSL-Windows-1.8/ws/build\site,> <https://builds.apache.org/job/POI-DSL-Windows-1.8/ws/build\test-classes,> <https://builds.apache.org/job/POI-DSL-Windows-1.8/ws/build\test-results,> <https://builds.apache.org/job/POI-DSL-Windows-1.8/ws/build\test.pfx,> <https://builds.apache.org/job/POI-DSL-Windows-1.8/ws/build\tmp]>
        at jenkins.util.io.PathRemover.removeOrMakeRemovableThenRemove(PathRemover.java:250)
        at jenkins.util.io.PathRemover.tryRemoveFile(PathRemover.java:205)
        at jenkins.util.io.PathRemover.tryRemoveRecursive(PathRemover.java:216)
        at jenkins.util.io.PathRemover.tryRemoveDirectoryContents(PathRemover.java:226)
        at jenkins.util.io.PathRemover.forceRemoveDirectoryContents(PathRemover.java:87)
        at hudson.Util.deleteContentsRecursive(Util.java:259)
        at hudson.Util.deleteContentsRecursive(Util.java:248)
        at hudson.scm.subversion.CheckoutUpdater$SubversionUpdateTask.perform(CheckoutUpdater.java:93)
        at hudson.scm.subversion.WorkspaceUpdater$UpdateTask.delegateTo(WorkspaceUpdater.java:168)
        at hudson.scm.subversion.WorkspaceUpdater$UpdateTask.delegateTo(WorkspaceUpdater.java:176)
        at hudson.scm.subversion.UpdateUpdater$TaskImpl.perform(UpdateUpdater.java:134)
        at hudson.scm.subversion.WorkspaceUpdater$UpdateTask.delegateTo(WorkspaceUpdater.java:168)
        at hudson.scm.SubversionSCM$CheckOutTask.perform(SubversionSCM.java:1041)
        at hudson.scm.SubversionSCM$CheckOutTask.invoke(SubversionSCM.java:1017)
        at hudson.scm.SubversionSCM$CheckOutTask.invoke(SubversionSCM.java:990)
        at hudson.FilePath$FileCallableWrapper.call(FilePath.java:3052)
        at hudson.remoting.UserRequest.perform(UserRequest.java:212)
        at hudson.remoting.UserRequest.perform(UserRequest.java:54)
        at hudson.remoting.Request$2.run(Request.java:369)
        at hudson.remoting.InterceptingExecutorService$1.call(InterceptingExecutorService.java:72)
        at java.util.concurrent.FutureTask.run(Unknown Source)
        at java.util.concurrent.ThreadPoolExecutor.runWorker(Unknown Source)
        at java.util.concurrent.ThreadPoolExecutor$Worker.run(Unknown Source)
        at hudson.remoting.Engine$1.lambda$newThread$0(Engine.java:93)
        at java.lang.Thread.run(Unknown Source)
java.nio.file.DirectoryNotEmptyException: <https://builds.apache.org/job/POI-DSL-Windows-1.8/ws/build>
        at sun.nio.fs.WindowsFileSystemProvider.implDelete(Unknown Source)
        at sun.nio.fs.AbstractFileSystemProvider.deleteIfExists(Unknown Source)
        at java.nio.file.Files.deleteIfExists(Unknown Source)
        at jenkins.util.io.PathRemover.removeOrMakeRemovableThenRemove(PathRemover.java:237)
        at jenkins.util.io.PathRemover.tryRemoveFile(PathRemover.java:205)
        at jenkins.util.io.PathRemover.tryRemoveRecursive(PathRemover.java:216)
        at jenkins.util.io.PathRemover.tryRemoveDirectoryContents(PathRemover.java:226)
        at jenkins.util.io.PathRemover.forceRemoveDirectoryContents(PathRemover.java:87)
        at hudson.Util.deleteContentsRecursive(Util.java:259)
        at hudson.Util.deleteContentsRecursive(Util.java:248)
        at hudson.scm.subversion.CheckoutUpdater$SubversionUpdateTask.perform(CheckoutUpdater.java:93)
        at hudson.scm.subversion.WorkspaceUpdater$UpdateTask.delegateTo(WorkspaceUpdater.java:168)
        at hudson.scm.subversion.WorkspaceUpdater$UpdateTask.delegateTo(WorkspaceUpdater.java:176)
        at hudson.scm.subversion.UpdateUpdater$TaskImpl.perform(UpdateUpdater.java:134)
        at hudson.scm.subversion.WorkspaceUpdater$UpdateTask.delegateTo(WorkspaceUpdater.java:168)
        at hudson.scm.SubversionSCM$CheckOutTask.perform(SubversionSCM.java:1041)
        at hudson.scm.SubversionSCM$CheckOutTask.invoke(SubversionSCM.java:1017)
        at hudson.scm.SubversionSCM$CheckOutTask.invoke(SubversionSCM.java:990)
        at hudson.FilePath$FileCallableWrapper.call(FilePath.java:3052)
        at hudson.remoting.UserRequest.perform(UserRequest.java:212)
        at hudson.remoting.UserRequest.perform(UserRequest.java:54)
        at hudson.remoting.Request$2.run(Request.java:369)
        at hudson.remoting.InterceptingExecutorService$1.call(InterceptingExecutorService.java:72)
        at java.util.concurrent.FutureTask.run(Unknown Source)
        at java.util.concurrent.ThreadPoolExecutor.runWorker(Unknown Source)
        at java.util.concurrent.ThreadPoolExecutor$Worker.run(Unknown Source)
        at hudson.remoting.Engine$1.lambda$newThread$0(Engine.java:93)
        at java.lang.Thread.run(Unknown Source)
java.nio.file.DirectoryNotEmptyException: <https://builds.apache.org/job/POI-DSL-Windows-1.8/ws/build>
        at sun.nio.fs.WindowsFileSystemProvider.implDelete(Unknown Source)
        at sun.nio.fs.AbstractFileSystemProvider.deleteIfExists(Unknown Source)
        at java.nio.file.Files.deleteIfExists(Unknown Source)
        at jenkins.util.io.PathRemover.removeOrMakeRemovableThenRemove(PathRemover.java:241)
        at jenkins.util.io.PathRemover.tryRemoveFile(PathRemover.java:205)
        at jenkins.util.io.PathRemover.tryRemoveRecursive(PathRemover.java:216)
        at jenkins.util.io.PathRemover.tryRemoveDirectoryContents(PathRemover.java:226)
        at jenkins.util.io.PathRemover.forceRemoveDirectoryContents(PathRemover.java:87)
        at hudson.Util.deleteContentsRecursive(Util.java:259)
        at hudson.Util.deleteContentsRecursive(Util.java:248)
        at hudson.scm.subversion.CheckoutUpdater$SubversionUpdateTask.perform(CheckoutUpdater.java:93)
        at hudson.scm.subversion.WorkspaceUpdater$UpdateTask.delegateTo(WorkspaceUpdater.java:168)
        at hudson.scm.subversion.WorkspaceUpdater$UpdateTask.delegateTo(WorkspaceUpdater.java:176)
        at hudson.scm.subversion.UpdateUpdater$TaskImpl.perform(UpdateUpdater.java:134)
        at hudson.scm.subversion.WorkspaceUpdater$UpdateTask.delegateTo(WorkspaceUpdater.java:168)
        at hudson.scm.SubversionSCM$CheckOutTask.perform(SubversionSCM.java:1041)
        at hudson.scm.SubversionSCM$CheckOutTask.invoke(SubversionSCM.java:1017)
        at hudson.scm.SubversionSCM$CheckOutTask.invoke(SubversionSCM.java:990)
        at hudson.FilePath$FileCallableWrapper.call(FilePath.java:3052)
        at hudson.remoting.UserRequest.perform(UserRequest.java:212)
        at hudson.remoting.UserRequest.perform(UserRequest.java:54)
        at hudson.remoting.Request$2.run(Request.java:369)
        at hudson.remoting.InterceptingExecutorService$1.call(InterceptingExecutorService.java:72)
        at java.util.concurrent.FutureTask.run(Unknown Source)
        at java.util.concurrent.ThreadPoolExecutor.runWorker(Unknown Source)
        at java.util.concurrent.ThreadPoolExecutor$Worker.run(Unknown Source)
        at hudson.remoting.Engine$1.lambda$newThread$0(Engine.java:93)
        at java.lang.Thread.run(Unknown Source)
Skipping publisher since build result is FAILURE
Archiving artifacts
[Fast Archiver] Compressed 200.78 MB of artifacts by 26.4% relative to #690
Skipping publisher since build result is FAILURE
Recording test results
ERROR: Step ‘Publish JUnit test result report’ failed: Test reports were found but none of them are new. Did leafNodes run?
For example, <https://builds.apache.org/job/POI-DSL-Windows-1.8/ws/build\excelant-test-results\TEST-org.apache.poi.ss.examples.formula.TestExcelAntUserDefinedFunction.xml> is 1 mo 12 days old


---------------------------------------------------------------------
To unsubscribe, e-mail: [hidden email]
For additional commands, e-mail: [hidden email]

Reply | Threaded
Open this post in threaded view
|

Build failed in Jenkins: POI-DSL-Windows-1.8 #692

Apache Jenkins Server
See <https://builds.apache.org/job/POI-DSL-Windows-1.8/692/display/redirect>

Changes:


------------------------------------------
[...truncated 769.02 MB...]
        at jenkins.util.io.PathRemover.tryRemoveRecursive(PathRemover.java:215)
        at jenkins.util.io.PathRemover.tryRemoveDirectoryContents(PathRemover.java:226)
        at jenkins.util.io.PathRemover.tryRemoveRecursive(PathRemover.java:215)
        at jenkins.util.io.PathRemover.tryRemoveDirectoryContents(PathRemover.java:226)
        at jenkins.util.io.PathRemover.forceRemoveDirectoryContents(PathRemover.java:87)
        at hudson.Util.deleteContentsRecursive(Util.java:259)
        at hudson.Util.deleteContentsRecursive(Util.java:248)
        at hudson.scm.subversion.CheckoutUpdater$SubversionUpdateTask.perform(CheckoutUpdater.java:93)
        at hudson.scm.subversion.WorkspaceUpdater$UpdateTask.delegateTo(WorkspaceUpdater.java:168)
        at hudson.scm.subversion.WorkspaceUpdater$UpdateTask.delegateTo(WorkspaceUpdater.java:176)
        at hudson.scm.subversion.UpdateUpdater$TaskImpl.perform(UpdateUpdater.java:134)
        at hudson.scm.subversion.WorkspaceUpdater$UpdateTask.delegateTo(WorkspaceUpdater.java:168)
        at hudson.scm.SubversionSCM$CheckOutTask.perform(SubversionSCM.java:1041)
        at hudson.scm.SubversionSCM$CheckOutTask.invoke(SubversionSCM.java:1017)
        at hudson.scm.SubversionSCM$CheckOutTask.invoke(SubversionSCM.java:990)
        at hudson.FilePath$FileCallableWrapper.call(FilePath.java:3052)
        at hudson.remoting.UserRequest.perform(UserRequest.java:212)
        at hudson.remoting.UserRequest.perform(UserRequest.java:54)
        at hudson.remoting.Request$2.run(Request.java:369)
        at hudson.remoting.InterceptingExecutorService$1.call(InterceptingExecutorService.java:72)
        at java.util.concurrent.FutureTask.run(Unknown Source)
        at java.util.concurrent.ThreadPoolExecutor.runWorker(Unknown Source)
        at java.util.concurrent.ThreadPoolExecutor$Worker.run(Unknown Source)
        at hudson.remoting.Engine$1.lambda$newThread$0(Engine.java:93)
        at java.lang.Thread.run(Unknown Source)
java.nio.file.AccessDeniedException: <https://builds.apache.org/job/POI-DSL-Windows-1.8/ws/build\tmp\poifiles>
        at sun.nio.fs.WindowsException.translateToIOException(Unknown Source)
        at sun.nio.fs.WindowsException.rethrowAsIOException(Unknown Source)
        at sun.nio.fs.WindowsException.rethrowAsIOException(Unknown Source)
        at sun.nio.fs.WindowsFileSystemProvider.implDelete(Unknown Source)
        at sun.nio.fs.AbstractFileSystemProvider.deleteIfExists(Unknown Source)
        at java.nio.file.Files.deleteIfExists(Unknown Source)
        at jenkins.util.io.PathRemover.removeOrMakeRemovableThenRemove(PathRemover.java:241)
        at jenkins.util.io.PathRemover.tryRemoveFile(PathRemover.java:205)
        at jenkins.util.io.PathRemover.tryRemoveRecursive(PathRemover.java:216)
        at jenkins.util.io.PathRemover.tryRemoveDirectoryContents(PathRemover.java:226)
        at jenkins.util.io.PathRemover.tryRemoveRecursive(PathRemover.java:215)
        at jenkins.util.io.PathRemover.tryRemoveDirectoryContents(PathRemover.java:226)
        at jenkins.util.io.PathRemover.tryRemoveRecursive(PathRemover.java:215)
        at jenkins.util.io.PathRemover.tryRemoveDirectoryContents(PathRemover.java:226)
        at jenkins.util.io.PathRemover.forceRemoveDirectoryContents(PathRemover.java:87)
        at hudson.Util.deleteContentsRecursive(Util.java:259)
        at hudson.Util.deleteContentsRecursive(Util.java:248)
        at hudson.scm.subversion.CheckoutUpdater$SubversionUpdateTask.perform(CheckoutUpdater.java:93)
        at hudson.scm.subversion.WorkspaceUpdater$UpdateTask.delegateTo(WorkspaceUpdater.java:168)
        at hudson.scm.subversion.WorkspaceUpdater$UpdateTask.delegateTo(WorkspaceUpdater.java:176)
        at hudson.scm.subversion.UpdateUpdater$TaskImpl.perform(UpdateUpdater.java:134)
        at hudson.scm.subversion.WorkspaceUpdater$UpdateTask.delegateTo(WorkspaceUpdater.java:168)
        at hudson.scm.SubversionSCM$CheckOutTask.perform(SubversionSCM.java:1041)
        at hudson.scm.SubversionSCM$CheckOutTask.invoke(SubversionSCM.java:1017)
        at hudson.scm.SubversionSCM$CheckOutTask.invoke(SubversionSCM.java:990)
        at hudson.FilePath$FileCallableWrapper.call(FilePath.java:3052)
        at hudson.remoting.UserRequest.perform(UserRequest.java:212)
        at hudson.remoting.UserRequest.perform(UserRequest.java:54)
        at hudson.remoting.Request$2.run(Request.java:369)
        at hudson.remoting.InterceptingExecutorService$1.call(InterceptingExecutorService.java:72)
        at java.util.concurrent.FutureTask.run(Unknown Source)
        at java.util.concurrent.ThreadPoolExecutor.runWorker(Unknown Source)
        at java.util.concurrent.ThreadPoolExecutor$Worker.run(Unknown Source)
        at hudson.remoting.Engine$1.lambda$newThread$0(Engine.java:93)
        at java.lang.Thread.run(Unknown Source)
jenkins.util.io.CompositeIOException: Unable to remove directory <https://builds.apache.org/job/POI-DSL-Windows-1.8/ws/build\tmp> with directory contents: [<https://builds.apache.org/job/POI-DSL-Windows-1.8/ws/build\tmp\maven-javadocs,> <https://builds.apache.org/job/POI-DSL-Windows-1.8/ws/build\tmp\poifiles]>
        at jenkins.util.io.PathRemover.removeOrMakeRemovableThenRemove(PathRemover.java:250)
        at jenkins.util.io.PathRemover.tryRemoveFile(PathRemover.java:205)
        at jenkins.util.io.PathRemover.tryRemoveRecursive(PathRemover.java:216)
        at jenkins.util.io.PathRemover.tryRemoveDirectoryContents(PathRemover.java:226)
        at jenkins.util.io.PathRemover.tryRemoveRecursive(PathRemover.java:215)
        at jenkins.util.io.PathRemover.tryRemoveDirectoryContents(PathRemover.java:226)
        at jenkins.util.io.PathRemover.forceRemoveDirectoryContents(PathRemover.java:87)
        at hudson.Util.deleteContentsRecursive(Util.java:259)
        at hudson.Util.deleteContentsRecursive(Util.java:248)
        at hudson.scm.subversion.CheckoutUpdater$SubversionUpdateTask.perform(CheckoutUpdater.java:93)
        at hudson.scm.subversion.WorkspaceUpdater$UpdateTask.delegateTo(WorkspaceUpdater.java:168)
        at hudson.scm.subversion.WorkspaceUpdater$UpdateTask.delegateTo(WorkspaceUpdater.java:176)
        at hudson.scm.subversion.UpdateUpdater$TaskImpl.perform(UpdateUpdater.java:134)
        at hudson.scm.subversion.WorkspaceUpdater$UpdateTask.delegateTo(WorkspaceUpdater.java:168)
        at hudson.scm.SubversionSCM$CheckOutTask.perform(SubversionSCM.java:1041)
        at hudson.scm.SubversionSCM$CheckOutTask.invoke(SubversionSCM.java:1017)
        at hudson.scm.SubversionSCM$CheckOutTask.invoke(SubversionSCM.java:990)
        at hudson.FilePath$FileCallableWrapper.call(FilePath.java:3052)
        at hudson.remoting.UserRequest.perform(UserRequest.java:212)
        at hudson.remoting.UserRequest.perform(UserRequest.java:54)
        at hudson.remoting.Request$2.run(Request.java:369)
        at hudson.remoting.InterceptingExecutorService$1.call(InterceptingExecutorService.java:72)
        at java.util.concurrent.FutureTask.run(Unknown Source)
        at java.util.concurrent.ThreadPoolExecutor.runWorker(Unknown Source)
        at java.util.concurrent.ThreadPoolExecutor$Worker.run(Unknown Source)
        at hudson.remoting.Engine$1.lambda$newThread$0(Engine.java:93)
        at java.lang.Thread.run(Unknown Source)
java.nio.file.AccessDeniedException: <https://builds.apache.org/job/POI-DSL-Windows-1.8/ws/build\tmp>
        at sun.nio.fs.WindowsException.translateToIOException(Unknown Source)
        at sun.nio.fs.WindowsException.rethrowAsIOException(Unknown Source)
        at sun.nio.fs.WindowsException.rethrowAsIOException(Unknown Source)
        at sun.nio.fs.WindowsFileSystemProvider.implDelete(Unknown Source)
        at sun.nio.fs.AbstractFileSystemProvider.deleteIfExists(Unknown Source)
        at java.nio.file.Files.deleteIfExists(Unknown Source)
        at jenkins.util.io.PathRemover.removeOrMakeRemovableThenRemove(PathRemover.java:237)
        at jenkins.util.io.PathRemover.tryRemoveFile(PathRemover.java:205)
        at jenkins.util.io.PathRemover.tryRemoveRecursive(PathRemover.java:216)
        at jenkins.util.io.PathRemover.tryRemoveDirectoryContents(PathRemover.java:226)
        at jenkins.util.io.PathRemover.tryRemoveRecursive(PathRemover.java:215)
        at jenkins.util.io.PathRemover.tryRemoveDirectoryContents(PathRemover.java:226)
        at jenkins.util.io.PathRemover.forceRemoveDirectoryContents(PathRemover.java:87)
        at hudson.Util.deleteContentsRecursive(Util.java:259)
        at hudson.Util.deleteContentsRecursive(Util.java:248)
        at hudson.scm.subversion.CheckoutUpdater$SubversionUpdateTask.perform(CheckoutUpdater.java:93)
        at hudson.scm.subversion.WorkspaceUpdater$UpdateTask.delegateTo(WorkspaceUpdater.java:168)
        at hudson.scm.subversion.WorkspaceUpdater$UpdateTask.delegateTo(WorkspaceUpdater.java:176)
        at hudson.scm.subversion.UpdateUpdater$TaskImpl.perform(UpdateUpdater.java:134)
        at hudson.scm.subversion.WorkspaceUpdater$UpdateTask.delegateTo(WorkspaceUpdater.java:168)
        at hudson.scm.SubversionSCM$CheckOutTask.perform(SubversionSCM.java:1041)
        at hudson.scm.SubversionSCM$CheckOutTask.invoke(SubversionSCM.java:1017)
        at hudson.scm.SubversionSCM$CheckOutTask.invoke(SubversionSCM.java:990)
        at hudson.FilePath$FileCallableWrapper.call(FilePath.java:3052)
        at hudson.remoting.UserRequest.perform(UserRequest.java:212)
        at hudson.remoting.UserRequest.perform(UserRequest.java:54)
        at hudson.remoting.Request$2.run(Request.java:369)
        at hudson.remoting.InterceptingExecutorService$1.call(InterceptingExecutorService.java:72)
        at java.util.concurrent.FutureTask.run(Unknown Source)
        at java.util.concurrent.ThreadPoolExecutor.runWorker(Unknown Source)
        at java.util.concurrent.ThreadPoolExecutor$Worker.run(Unknown Source)
        at hudson.remoting.Engine$1.lambda$newThread$0(Engine.java:93)
        at java.lang.Thread.run(Unknown Source)
java.nio.file.AccessDeniedException: <https://builds.apache.org/job/POI-DSL-Windows-1.8/ws/build\tmp>
        at sun.nio.fs.WindowsException.translateToIOException(Unknown Source)
        at sun.nio.fs.WindowsException.rethrowAsIOException(Unknown Source)
        at sun.nio.fs.WindowsException.rethrowAsIOException(Unknown Source)
        at sun.nio.fs.WindowsFileSystemProvider.implDelete(Unknown Source)
        at sun.nio.fs.AbstractFileSystemProvider.deleteIfExists(Unknown Source)
        at java.nio.file.Files.deleteIfExists(Unknown Source)
        at jenkins.util.io.PathRemover.removeOrMakeRemovableThenRemove(PathRemover.java:241)
        at jenkins.util.io.PathRemover.tryRemoveFile(PathRemover.java:205)
        at jenkins.util.io.PathRemover.tryRemoveRecursive(PathRemover.java:216)
        at jenkins.util.io.PathRemover.tryRemoveDirectoryContents(PathRemover.java:226)
        at jenkins.util.io.PathRemover.tryRemoveRecursive(PathRemover.java:215)
        at jenkins.util.io.PathRemover.tryRemoveDirectoryContents(PathRemover.java:226)
        at jenkins.util.io.PathRemover.forceRemoveDirectoryContents(PathRemover.java:87)
        at hudson.Util.deleteContentsRecursive(Util.java:259)
        at hudson.Util.deleteContentsRecursive(Util.java:248)
        at hudson.scm.subversion.CheckoutUpdater$SubversionUpdateTask.perform(CheckoutUpdater.java:93)
        at hudson.scm.subversion.WorkspaceUpdater$UpdateTask.delegateTo(WorkspaceUpdater.java:168)
        at hudson.scm.subversion.WorkspaceUpdater$UpdateTask.delegateTo(WorkspaceUpdater.java:176)
        at hudson.scm.subversion.UpdateUpdater$TaskImpl.perform(UpdateUpdater.java:134)
        at hudson.scm.subversion.WorkspaceUpdater$UpdateTask.delegateTo(WorkspaceUpdater.java:168)
        at hudson.scm.SubversionSCM$CheckOutTask.perform(SubversionSCM.java:1041)
        at hudson.scm.SubversionSCM$CheckOutTask.invoke(SubversionSCM.java:1017)
        at hudson.scm.SubversionSCM$CheckOutTask.invoke(SubversionSCM.java:990)
        at hudson.FilePath$FileCallableWrapper.call(FilePath.java:3052)
        at hudson.remoting.UserRequest.perform(UserRequest.java:212)
        at hudson.remoting.UserRequest.perform(UserRequest.java:54)
        at hudson.remoting.Request$2.run(Request.java:369)
        at hudson.remoting.InterceptingExecutorService$1.call(InterceptingExecutorService.java:72)
        at java.util.concurrent.FutureTask.run(Unknown Source)
        at java.util.concurrent.ThreadPoolExecutor.runWorker(Unknown Source)
        at java.util.concurrent.ThreadPoolExecutor$Worker.run(Unknown Source)
        at hudson.remoting.Engine$1.lambda$newThread$0(Engine.java:93)
        at java.lang.Thread.run(Unknown Source)
jenkins.util.io.CompositeIOException: Unable to remove directory <https://builds.apache.org/job/POI-DSL-Windows-1.8/ws/build> with directory contents: [<https://builds.apache.org/job/POI-DSL-Windows-1.8/ws/build\classes,> <https://builds.apache.org/job/POI-DSL-Windows-1.8/ws/build\coverage,> <https://builds.apache.org/job/POI-DSL-Windows-1.8/ws/build\custom-reports-test,> <https://builds.apache.org/job/POI-DSL-Windows-1.8/ws/build\dist,> <https://builds.apache.org/job/POI-DSL-Windows-1.8/ws/build\distsourcebuild,> <https://builds.apache.org/job/POI-DSL-Windows-1.8/ws/build\examples-classes,> <https://builds.apache.org/job/POI-DSL-Windows-1.8/ws/build\excelant-classes,> <https://builds.apache.org/job/POI-DSL-Windows-1.8/ws/build\excelant-test-classes,> <https://builds.apache.org/job/POI-DSL-Windows-1.8/ws/build\excelant-test-results,> <https://builds.apache.org/job/POI-DSL-Windows-1.8/ws/build\excelant-testokfile.txt,> <https://builds.apache.org/job/POI-DSL-Windows-1.8/ws/build\findbugs,> <https://builds.apache.org/job/POI-DSL-Windows-1.8/ws/build\findbugs.html,> <https://builds.apache.org/job/POI-DSL-Windows-1.8/ws/build\findbugs.xml,> <https://builds.apache.org/job/POI-DSL-Windows-1.8/ws/build\geometry-java,> <https://builds.apache.org/job/POI-DSL-Windows-1.8/ws/build\integration-test-classes,> <https://builds.apache.org/job/POI-DSL-Windows-1.8/ws/build\integration-test-results,> <https://builds.apache.org/job/POI-DSL-Windows-1.8/ws/build\integration-testokfile.txt,> <https://builds.apache.org/job/POI-DSL-Windows-1.8/ws/build\jacoco-excelant.exec,> <https://builds.apache.org/job/POI-DSL-Windows-1.8/ws/build\jacoco-integration.exec,> <https://builds.apache.org/job/POI-DSL-Windows-1.8/ws/build\jacoco-main.exec,> <https://builds.apache.org/job/POI-DSL-Windows-1.8/ws/build\jacoco-ooxml-lite-xmlsec.exec,> <https://builds.apache.org/job/POI-DSL-Windows-1.8/ws/build\jacoco-ooxml-lite.exec,> <https://builds.apache.org/job/POI-DSL-Windows-1.8/ws/build\jacoco-ooxml-xmlsec.exec,> <https://builds.apache.org/job/POI-DSL-Windows-1.8/ws/build\jacoco-ooxml.exec,> <https://builds.apache.org/job/POI-DSL-Windows-1.8/ws/build\jacoco-scratchpad.exec,> <https://builds.apache.org/job/POI-DSL-Windows-1.8/ws/build\main-testokfile.txt,> <https://builds.apache.org/job/POI-DSL-Windows-1.8/ws/build\ooxml-classes,> <https://builds.apache.org/job/POI-DSL-Windows-1.8/ws/build\ooxml-lite-agent.jar,> <https://builds.apache.org/job/POI-DSL-Windows-1.8/ws/build\ooxml-lite-classes.jar,> <https://builds.apache.org/job/POI-DSL-Windows-1.8/ws/build\ooxml-lite-report.txt,> <https://builds.apache.org/job/POI-DSL-Windows-1.8/ws/build\ooxml-lite-report.txt-pat,> <https://builds.apache.org/job/POI-DSL-Windows-1.8/ws/build\ooxml-test-classes,> <https://builds.apache.org/job/POI-DSL-Windows-1.8/ws/build\ooxml-test-results,> <https://builds.apache.org/job/POI-DSL-Windows-1.8/ws/build\poi-manifest.mf,> <https://builds.apache.org/job/POI-DSL-Windows-1.8/ws/build\rat,> <https://builds.apache.org/job/POI-DSL-Windows-1.8/ws/build\scratchpad-classes,> <https://builds.apache.org/job/POI-DSL-Windows-1.8/ws/build\scratchpad-test-classes,> <https://builds.apache.org/job/POI-DSL-Windows-1.8/ws/build\scratchpad-test-results,> <https://builds.apache.org/job/POI-DSL-Windows-1.8/ws/build\scratchpad-testokfile.txt,> <https://builds.apache.org/job/POI-DSL-Windows-1.8/ws/build\sigtest.xlsx,> <https://builds.apache.org/job/POI-DSL-Windows-1.8/ws/build\site,> <https://builds.apache.org/job/POI-DSL-Windows-1.8/ws/build\test-classes,> <https://builds.apache.org/job/POI-DSL-Windows-1.8/ws/build\test-results,> <https://builds.apache.org/job/POI-DSL-Windows-1.8/ws/build\test.pfx,> <https://builds.apache.org/job/POI-DSL-Windows-1.8/ws/build\tmp]>
        at jenkins.util.io.PathRemover.removeOrMakeRemovableThenRemove(PathRemover.java:250)
        at jenkins.util.io.PathRemover.tryRemoveFile(PathRemover.java:205)
        at jenkins.util.io.PathRemover.tryRemoveRecursive(PathRemover.java:216)
        at jenkins.util.io.PathRemover.tryRemoveDirectoryContents(PathRemover.java:226)
        at jenkins.util.io.PathRemover.forceRemoveDirectoryContents(PathRemover.java:87)
        at hudson.Util.deleteContentsRecursive(Util.java:259)
        at hudson.Util.deleteContentsRecursive(Util.java:248)
        at hudson.scm.subversion.CheckoutUpdater$SubversionUpdateTask.perform(CheckoutUpdater.java:93)
        at hudson.scm.subversion.WorkspaceUpdater$UpdateTask.delegateTo(WorkspaceUpdater.java:168)
        at hudson.scm.subversion.WorkspaceUpdater$UpdateTask.delegateTo(WorkspaceUpdater.java:176)
        at hudson.scm.subversion.UpdateUpdater$TaskImpl.perform(UpdateUpdater.java:134)
        at hudson.scm.subversion.WorkspaceUpdater$UpdateTask.delegateTo(WorkspaceUpdater.java:168)
        at hudson.scm.SubversionSCM$CheckOutTask.perform(SubversionSCM.java:1041)
        at hudson.scm.SubversionSCM$CheckOutTask.invoke(SubversionSCM.java:1017)
        at hudson.scm.SubversionSCM$CheckOutTask.invoke(SubversionSCM.java:990)
        at hudson.FilePath$FileCallableWrapper.call(FilePath.java:3052)
        at hudson.remoting.UserRequest.perform(UserRequest.java:212)
        at hudson.remoting.UserRequest.perform(UserRequest.java:54)
        at hudson.remoting.Request$2.run(Request.java:369)
        at hudson.remoting.InterceptingExecutorService$1.call(InterceptingExecutorService.java:72)
        at java.util.concurrent.FutureTask.run(Unknown Source)
        at java.util.concurrent.ThreadPoolExecutor.runWorker(Unknown Source)
        at java.util.concurrent.ThreadPoolExecutor$Worker.run(Unknown Source)
        at hudson.remoting.Engine$1.lambda$newThread$0(Engine.java:93)
        at java.lang.Thread.run(Unknown Source)
java.nio.file.DirectoryNotEmptyException: <https://builds.apache.org/job/POI-DSL-Windows-1.8/ws/build>
        at sun.nio.fs.WindowsFileSystemProvider.implDelete(Unknown Source)
        at sun.nio.fs.AbstractFileSystemProvider.deleteIfExists(Unknown Source)
        at java.nio.file.Files.deleteIfExists(Unknown Source)
        at jenkins.util.io.PathRemover.removeOrMakeRemovableThenRemove(PathRemover.java:237)
        at jenkins.util.io.PathRemover.tryRemoveFile(PathRemover.java:205)
        at jenkins.util.io.PathRemover.tryRemoveRecursive(PathRemover.java:216)
        at jenkins.util.io.PathRemover.tryRemoveDirectoryContents(PathRemover.java:226)
        at jenkins.util.io.PathRemover.forceRemoveDirectoryContents(PathRemover.java:87)
        at hudson.Util.deleteContentsRecursive(Util.java:259)
        at hudson.Util.deleteContentsRecursive(Util.java:248)
        at hudson.scm.subversion.CheckoutUpdater$SubversionUpdateTask.perform(CheckoutUpdater.java:93)
        at hudson.scm.subversion.WorkspaceUpdater$UpdateTask.delegateTo(WorkspaceUpdater.java:168)
        at hudson.scm.subversion.WorkspaceUpdater$UpdateTask.delegateTo(WorkspaceUpdater.java:176)
        at hudson.scm.subversion.UpdateUpdater$TaskImpl.perform(UpdateUpdater.java:134)
        at hudson.scm.subversion.WorkspaceUpdater$UpdateTask.delegateTo(WorkspaceUpdater.java:168)
        at hudson.scm.SubversionSCM$CheckOutTask.perform(SubversionSCM.java:1041)
        at hudson.scm.SubversionSCM$CheckOutTask.invoke(SubversionSCM.java:1017)
        at hudson.scm.SubversionSCM$CheckOutTask.invoke(SubversionSCM.java:990)
        at hudson.FilePath$FileCallableWrapper.call(FilePath.java:3052)
        at hudson.remoting.UserRequest.perform(UserRequest.java:212)
        at hudson.remoting.UserRequest.perform(UserRequest.java:54)
        at hudson.remoting.Request$2.run(Request.java:369)
        at hudson.remoting.InterceptingExecutorService$1.call(InterceptingExecutorService.java:72)
        at java.util.concurrent.FutureTask.run(Unknown Source)
        at java.util.concurrent.ThreadPoolExecutor.runWorker(Unknown Source)
        at java.util.concurrent.ThreadPoolExecutor$Worker.run(Unknown Source)
        at hudson.remoting.Engine$1.lambda$newThread$0(Engine.java:93)
        at java.lang.Thread.run(Unknown Source)
java.nio.file.DirectoryNotEmptyException: <https://builds.apache.org/job/POI-DSL-Windows-1.8/ws/build>
        at sun.nio.fs.WindowsFileSystemProvider.implDelete(Unknown Source)
        at sun.nio.fs.AbstractFileSystemProvider.deleteIfExists(Unknown Source)
        at java.nio.file.Files.deleteIfExists(Unknown Source)
        at jenkins.util.io.PathRemover.removeOrMakeRemovableThenRemove(PathRemover.java:241)
        at jenkins.util.io.PathRemover.tryRemoveFile(PathRemover.java:205)
        at jenkins.util.io.PathRemover.tryRemoveRecursive(PathRemover.java:216)
        at jenkins.util.io.PathRemover.tryRemoveDirectoryContents(PathRemover.java:226)
        at jenkins.util.io.PathRemover.forceRemoveDirectoryContents(PathRemover.java:87)
        at hudson.Util.deleteContentsRecursive(Util.java:259)
        at hudson.Util.deleteContentsRecursive(Util.java:248)
        at hudson.scm.subversion.CheckoutUpdater$SubversionUpdateTask.perform(CheckoutUpdater.java:93)
        at hudson.scm.subversion.WorkspaceUpdater$UpdateTask.delegateTo(WorkspaceUpdater.java:168)
        at hudson.scm.subversion.WorkspaceUpdater$UpdateTask.delegateTo(WorkspaceUpdater.java:176)
        at hudson.scm.subversion.UpdateUpdater$TaskImpl.perform(UpdateUpdater.java:134)
        at hudson.scm.subversion.WorkspaceUpdater$UpdateTask.delegateTo(WorkspaceUpdater.java:168)
        at hudson.scm.SubversionSCM$CheckOutTask.perform(SubversionSCM.java:1041)
        at hudson.scm.SubversionSCM$CheckOutTask.invoke(SubversionSCM.java:1017)
        at hudson.scm.SubversionSCM$CheckOutTask.invoke(SubversionSCM.java:990)
        at hudson.FilePath$FileCallableWrapper.call(FilePath.java:3052)
        at hudson.remoting.UserRequest.perform(UserRequest.java:212)
        at hudson.remoting.UserRequest.perform(UserRequest.java:54)
        at hudson.remoting.Request$2.run(Request.java:369)
        at hudson.remoting.InterceptingExecutorService$1.call(InterceptingExecutorService.java:72)
        at java.util.concurrent.FutureTask.run(Unknown Source)
        at java.util.concurrent.ThreadPoolExecutor.runWorker(Unknown Source)
        at java.util.concurrent.ThreadPoolExecutor$Worker.run(Unknown Source)
        at hudson.remoting.Engine$1.lambda$newThread$0(Engine.java:93)
        at java.lang.Thread.run(Unknown Source)
Skipping publisher since build result is FAILURE
Archiving artifacts
[Fast Archiver] Compressed 200.78 MB of artifacts by 26.4% relative to #690
Skipping publisher since build result is FAILURE
Recording test results
ERROR: Step ‘Publish JUnit test result report’ failed: Test reports were found but none of them are new. Did leafNodes run?
For example, <https://builds.apache.org/job/POI-DSL-Windows-1.8/ws/build\excelant-test-results\TEST-org.apache.poi.ss.examples.formula.TestExcelAntUserDefinedFunction.xml> is 1 mo 13 days old


---------------------------------------------------------------------
To unsubscribe, e-mail: [hidden email]
For additional commands, e-mail: [hidden email]

Reply | Threaded
Open this post in threaded view
|

Build failed in Jenkins: POI-DSL-Windows-1.8 #693

Apache Jenkins Server
See <https://builds.apache.org/job/POI-DSL-Windows-1.8/693/display/redirect>

Changes:


------------------------------------------
[...truncated 382.75 KB...]
AU        src\documentation\resources\images\PropertyTableClassDiagram.gif
AU        src\documentation\resources\images\logoRussellBeattie1.png
AU        src\documentation\resources\images\logoRussellBeattie2.png
AU        src\documentation\resources\images\logoRussellBeattie3.png
A         src\documentation\sitemap.xmap
AU        src\documentation\skinconf.xml
AU        src\documentation\release-guide.txt
A         src\documentation\cli.xconf
AU        src\documentation\RELEASE-NOTES.txt
AU        src\documentation\README.txt
A         src\documentation\classes
A         src\documentation\classes\CatalogManager.properties
At revision 1880229


<-- Got one external: forrest.properties, svn url: https://svn.apache.org/repos/asf/poi/site/forrest.properties -->
Fetching 'https://svn.apache.org/repos/asf/poi/site/forrest.properties' at -1 into 'F:\jenkins\jenkins-slave\workspace\POI-DSL-Windows-1.8\forrest.properties'
A         forrest.properties
At revision 1880229

At revision 1880229

[POI-DSL-Windows-1.8] $ cmd /c call F:\jenkins\jenkins-slave\temp\jenkins7741926200956302259.bat
    X   forrest.properties
X       src\documentation

Performing status on external item at 'src\documentation':
Java-Home: f:\\jenkins\\tools\\java\\latest1.8
 Volume in drive F is data
 Volume Serial Number is 928C-27F2

 Directory of f:\jenkins\tools\java\latest1.8

07/01/2019  02:11 PM    <DIR>          .
07/01/2019  02:11 PM    <DIR>          ..
07/01/2019  02:08 PM    <DIR>          bin
07/01/2019  02:08 PM    <DIR>          db
07/01/2019  02:09 PM    <DIR>          include
09/14/2017  05:43 AM         5,202,881 javafx-src.zip
07/01/2019  02:09 PM    <DIR>          jre
07/01/2019  02:09 PM    <DIR>          lib
09/14/2017  10:15 AM                40 LICENSE
09/14/2017  10:15 AM               159 README.html
09/14/2017  10:15 AM               426 release
09/14/2017  05:43 AM            63,933 THIRDPARTYLICENSEREADME-JAVAFX.txt
09/14/2017  10:15 AM           145,180 THIRDPARTYLICENSEREADME.txt
               6 File(s)      5,412,619 bytes
               7 Dir(s)  1,915,997,069,312 bytes free
java version "1.8.0_152"
Java(TM) SE Runtime Environment (build 1.8.0_152-b16)
Java HotSpot(TM) 64-Bit Server VM (build 25.152-b16, mixed mode)
[POI-DSL-Windows-1.8] $ cmd.exe /C "F:\jenkins\tools\ant\latest1.10\bin\ant.bat -Dcoverage.enabled=true clean jenkins && exit %%ERRORLEVEL%%"
Buildfile: <https://builds.apache.org/job/POI-DSL-Windows-1.8/ws/build.xml>

clean:

replaceVersion:

check-jars:
    [mkdir] Created dir: <https://builds.apache.org/job/POI-DSL-Windows-1.8/ws/lib\main>
    [mkdir] Created dir: <https://builds.apache.org/job/POI-DSL-Windows-1.8/ws/lib\ooxml>
    [mkdir] Created dir: <https://builds.apache.org/job/POI-DSL-Windows-1.8/ws/lib\ooxml-tests>
   [delete] Directory does not exist: <https://builds.apache.org/job/POI-DSL-Windows-1.8/ws/lib\main-tests>
   [delete] Directory does not exist: <https://builds.apache.org/job/POI-DSL-Windows-1.8/ws/lib\ooxml-provided>
   [delete] Directory does not exist: <https://builds.apache.org/job/POI-DSL-Windows-1.8/ws/lib\util>

fetch-jars:
      [get] Getting: https://repo1.maven.org/maven2/commons-logging/commons-logging/1.2/commons-logging-1.2.jar
      [get] To: <https://builds.apache.org/job/POI-DSL-Windows-1.8/ws/lib\main\commons-logging-1.2.jar>
      [get] Getting: https://repo1.maven.org/maven2/commons-codec/commons-codec/1.14/commons-codec-1.14.jar
      [get] To: <https://builds.apache.org/job/POI-DSL-Windows-1.8/ws/lib\main\commons-codec-1.14.jar>
      [get] Getting: https://repo1.maven.org/maven2/log4j/log4j/1.2.17/log4j-1.2.17.jar
      [get] To: <https://builds.apache.org/job/POI-DSL-Windows-1.8/ws/lib\main\log4j-1.2.17.jar>
    [mkdir] Created dir: <https://builds.apache.org/job/POI-DSL-Windows-1.8/ws/lib\main-tests>
      [get] Getting: https://repo1.maven.org/maven2/junit/junit/4.13/junit-4.13.jar
      [get] To: <https://builds.apache.org/job/POI-DSL-Windows-1.8/ws/lib\main-tests\junit-4.13.jar>
      [get] Getting: https://repo1.maven.org/maven2/org/openjdk/jmh/jmh-core/1.19/jmh-core-1.19.jar
      [get] To: <https://builds.apache.org/job/POI-DSL-Windows-1.8/ws/lib\main-tests\jmh-core-1.19.jar>
      [get] Getting: https://repo1.maven.org/maven2/org/openjdk/jmh/jmh-generator-annprocess/1.19/jmh-generator-annprocess-1.19.jar
      [get] To: <https://builds.apache.org/job/POI-DSL-Windows-1.8/ws/lib\main-tests\jmh-generator-annprocess-1.19.jar>
      [get] Getting: https://repo1.maven.org/maven2/org/hamcrest/hamcrest-core/1.3/hamcrest-core-1.3.jar
      [get] To: <https://builds.apache.org/job/POI-DSL-Windows-1.8/ws/lib\main-tests\hamcrest-core-1.3.jar>
      [get] Getting: https://repo1.maven.org/maven2/org/xmlunit/xmlunit-core/2.5.1/xmlunit-core-2.5.1.jar
      [get] To: <https://builds.apache.org/job/POI-DSL-Windows-1.8/ws/lib\main-tests\xmlunit-core-2.5.1.jar>
      [get] Getting: https://repo1.maven.org/maven2/org/mockito/mockito-core/3.3.3/mockito-core-3.3.3.jar
      [get] To: <https://builds.apache.org/job/POI-DSL-Windows-1.8/ws/lib\main-tests\mockito-core-3.3.3.jar>
      [get] Getting: https://repo1.maven.org/maven2/net/bytebuddy/byte-buddy/1.10.1/byte-buddy-1.10.1.jar
      [get] To: <https://builds.apache.org/job/POI-DSL-Windows-1.8/ws/lib\main-tests\byte-buddy-1.10.1.jar>
      [get] Getting: https://repo1.maven.org/maven2/net/bytebuddy/byte-buddy-agent/1.10.1/byte-buddy-agent-1.10.1.jar
      [get] To: <https://builds.apache.org/job/POI-DSL-Windows-1.8/ws/lib\main-tests\byte-buddy-agent-1.10.1.jar>
      [get] Getting: https://repo1.maven.org/maven2/org/objenesis/objenesis/2.6/objenesis-2.6.jar
      [get] To: <https://builds.apache.org/job/POI-DSL-Windows-1.8/ws/lib\main-tests\objenesis-2.6.jar>
    [mkdir] Created dir: <https://builds.apache.org/job/POI-DSL-Windows-1.8/ws/lib\excelant>
      [get] Getting: https://repo1.maven.org/maven2/org/apache/ant/ant/1.10.8/ant-1.10.8.jar
      [get] To: <https://builds.apache.org/job/POI-DSL-Windows-1.8/ws/lib\excelant\ant-1.10.8.jar>
      [get] Getting: https://repo1.maven.org/maven2/org/apache/ant/ant-launcher/1.10.8/ant-launcher-1.10.8.jar
      [get] To: <https://builds.apache.org/job/POI-DSL-Windows-1.8/ws/lib\excelant\ant-launcher-1.10.8.jar>
    [mkdir] Created dir: <https://builds.apache.org/job/POI-DSL-Windows-1.8/ws/lib\util>
      [get] Getting: https://repo1.maven.org/maven2/org/ow2/asm/asm/8.0.1/asm-8.0.1.jar
      [get] To: <https://builds.apache.org/job/POI-DSL-Windows-1.8/ws/lib\util\asm-8.0.1.jar>
      [get] Getting: https://repo1.maven.org/maven2/org/ow2/asm/asm-commons/8.0.1/asm-commons-8.0.1.jar
      [get] To: <https://builds.apache.org/job/POI-DSL-Windows-1.8/ws/lib\util\asm-commons-8.0.1.jar>
      [get] Getting: https://repo1.maven.org/maven2/org/ow2/asm/asm-tree/8.0.1/asm-tree-8.0.1.jar
      [get] To: <https://builds.apache.org/job/POI-DSL-Windows-1.8/ws/lib\util\asm-tree-8.0.1.jar>
      [get] Getting: https://repo1.maven.org/maven2/org/jacoco/jacoco/0.8.5/jacoco-0.8.5.zip
      [get] To: <https://builds.apache.org/job/POI-DSL-Windows-1.8/ws/lib\util\jacoco-0.8.5.zip>
      [get] Getting: https://repo1.maven.org/maven2/org/apache/commons/commons-collections4/4.4/commons-collections4-4.4.jar
      [get] To: <https://builds.apache.org/job/POI-DSL-Windows-1.8/ws/lib\main\commons-collections4-4.4.jar>
      [get] Getting: https://repo1.maven.org/maven2/org/apache/commons/commons-math3/3.6.1/commons-math3-3.6.1.jar
      [get] To: <https://builds.apache.org/job/POI-DSL-Windows-1.8/ws/lib\main\commons-math3-3.6.1.jar>
      [get] Getting: https://repo1.maven.org/maven2/com/zaxxer/SparseBitSet/1.2/SparseBitSet-1.2.jar
      [get] To: <https://builds.apache.org/job/POI-DSL-Windows-1.8/ws/lib\main\SparseBitSet-1.2.jar>
    [unzip] Expanding: <https://builds.apache.org/job/POI-DSL-Windows-1.8/ws/lib\util\jacoco-0.8.5.zip> into <https://builds.apache.org/job/POI-DSL-Windows-1.8/ws/lib\util>
      [get] Getting: https://repo1.maven.org/maven2/org/apache/rat/apache-rat/0.12/apache-rat-0.12.jar
      [get] To: <https://builds.apache.org/job/POI-DSL-Windows-1.8/ws/lib\util\apache-rat-0.12.jar>
      [get] Getting: https://repo1.maven.org/maven2/de/thetaphi/forbiddenapis/2.6/forbiddenapis-2.6.jar
      [get] To: <https://builds.apache.org/job/POI-DSL-Windows-1.8/ws/lib\util\forbiddenapis-2.6.jar>
    [mkdir] Created dir: <https://builds.apache.org/job/POI-DSL-Windows-1.8/ws/lib\ooxml-provided>
      [get] Getting: https://repo1.maven.org/maven2/org/bouncycastle/bcprov-ext-jdk15on/1.66/bcprov-ext-jdk15on-1.66.jar
      [get] To: <https://builds.apache.org/job/POI-DSL-Windows-1.8/ws/lib\ooxml-provided\bcprov-ext-jdk15on-1.66.jar>
      [get] Getting: https://repo1.maven.org/maven2/org/bouncycastle/bcpkix-jdk15on/1.66/bcpkix-jdk15on-1.66.jar
      [get] To: <https://builds.apache.org/job/POI-DSL-Windows-1.8/ws/lib\ooxml-provided\bcpkix-jdk15on-1.66.jar>
      [get] Getting: https://repo1.maven.org/maven2/org/apache/santuario/xmlsec/2.1.5/xmlsec-2.1.5.jar
      [get] To: <https://builds.apache.org/job/POI-DSL-Windows-1.8/ws/lib\ooxml-provided\xmlsec-2.1.5.jar>
      [get] Getting: https://repo1.maven.org/maven2/org/slf4j/slf4j-api/1.7.30/slf4j-api-1.7.30.jar
      [get] To: <https://builds.apache.org/job/POI-DSL-Windows-1.8/ws/lib\ooxml-provided\slf4j-api-1.7.30.jar>

check-ooxml-jars:

fetch-ooxml-jars:
      [get] Getting: https://repo1.maven.org/maven2/com/github/virtuald/curvesapi/1.06/curvesapi-1.06.jar
      [get] To: <https://builds.apache.org/job/POI-DSL-Windows-1.8/ws/lib\ooxml\curvesapi-1.06.jar>
      [get] Getting: https://builds.apache.org/view/P/view/POI/job/POI-XMLBeans-DSL-1.8/lastSuccessfulBuild/artifact/build/xmlbeans-4.0.0.jar
      [get] To: <https://builds.apache.org/job/POI-DSL-Windows-1.8/ws/lib\ooxml\xmlbeans-4.0.0.jar>
      [get] Getting: https://repo1.maven.org/maven2/org/apache/commons/commons-compress/1.20/commons-compress-1.20.jar
      [get] To: <https://builds.apache.org/job/POI-DSL-Windows-1.8/ws/lib\ooxml\commons-compress-1.20.jar>
      [get] Getting: https://repo1.maven.org/maven2/org/reflections/reflections/0.9.11/reflections-0.9.11.jar
      [get] To: <https://builds.apache.org/job/POI-DSL-Windows-1.8/ws/lib\ooxml-tests\reflections-0.9.11.jar>
      [get] Getting: https://repo1.maven.org/maven2/com/google/guava/guava/29.0-jre/guava-29.0-jre.jar
      [get] To: <https://builds.apache.org/job/POI-DSL-Windows-1.8/ws/lib\ooxml-tests\guava-29.0-jre.jar>
      [get] Getting: https://repo1.maven.org/maven2/org/javassist/javassist/3.21.0-GA/javassist-3.21.0-GA.jar
      [get] To: <https://builds.apache.org/job/POI-DSL-Windows-1.8/ws/lib\ooxml-tests\javassist-3.21.0-GA.jar>
      [get] Getting: https://repo1.maven.org/maven2/org/apache/xmlgraphics/batik-all/1.12/batik-all-1.12.jar
      [get] To: <https://builds.apache.org/job/POI-DSL-Windows-1.8/ws/lib\ooxml-provided\batik-all-1.12.jar>
      [get] Getting: https://repo1.maven.org/maven2/xml-apis/xml-apis-ext/1.3.04/xml-apis-ext-1.3.04.jar
      [get] To: <https://builds.apache.org/job/POI-DSL-Windows-1.8/ws/lib\ooxml-provided\xml-apis-ext-1.3.04.jar>
      [get] Getting: https://repo1.maven.org/maven2/org/apache/xmlgraphics/xmlgraphics-commons/2.3/xmlgraphics-commons-2.3.jar
      [get] To: <https://builds.apache.org/job/POI-DSL-Windows-1.8/ws/lib\ooxml-provided\xmlgraphics-commons-2.3.jar>

init:
    [mkdir] Created dir: <https://builds.apache.org/job/POI-DSL-Windows-1.8/ws/build>
    [mkdir] Created dir: <https://builds.apache.org/job/POI-DSL-Windows-1.8/ws/build\classes>
    [mkdir] Created dir: <https://builds.apache.org/job/POI-DSL-Windows-1.8/ws/build\test-classes>
    [mkdir] Created dir: <https://builds.apache.org/job/POI-DSL-Windows-1.8/ws/build\test-results>
    [mkdir] Created dir: <https://builds.apache.org/job/POI-DSL-Windows-1.8/ws/build\scratchpad-classes>
    [mkdir] Created dir: <https://builds.apache.org/job/POI-DSL-Windows-1.8/ws/build\scratchpad-test-classes>
    [mkdir] Created dir: <https://builds.apache.org/job/POI-DSL-Windows-1.8/ws/build\scratchpad-test-results>
    [mkdir] Created dir: <https://builds.apache.org/job/POI-DSL-Windows-1.8/ws/build\geometry-java>
    [mkdir] Created dir: <https://builds.apache.org/job/POI-DSL-Windows-1.8/ws/build\ooxml-classes>
    [mkdir] Created dir: <https://builds.apache.org/job/POI-DSL-Windows-1.8/ws/build\ooxml-test-classes>
    [mkdir] Created dir: <https://builds.apache.org/job/POI-DSL-Windows-1.8/ws/build\ooxml-test-results>
    [mkdir] Created dir: <https://builds.apache.org/job/POI-DSL-Windows-1.8/ws/build\excelant-classes>
    [mkdir] Created dir: <https://builds.apache.org/job/POI-DSL-Windows-1.8/ws/build\excelant-test-classes>
    [mkdir] Created dir: <https://builds.apache.org/job/POI-DSL-Windows-1.8/ws/build\excelant-test-results>
    [mkdir] Created dir: <https://builds.apache.org/job/POI-DSL-Windows-1.8/ws/build\examples-classes>
    [mkdir] Created dir: <https://builds.apache.org/job/POI-DSL-Windows-1.8/ws/build\integration-test-classes>
    [mkdir] Created dir: <https://builds.apache.org/job/POI-DSL-Windows-1.8/ws/build\integration-test-results>
    [mkdir] Created dir: <https://builds.apache.org/job/POI-DSL-Windows-1.8/ws/build\dist>
    [mkdir] Created dir: <https://builds.apache.org/job/POI-DSL-Windows-1.8/ws/build\site>
     [echo] Using Ant: Apache Ant(TM) version 1.10.5 compiled on July 10 2018 from F:\\jenkins\\tools\\ant\\latest1.10, Ant detected Java 1.8 (may be different than actual Java sometimes...)
     [echo] Using Java: 1.8.0_152/1.8.0_152-b16/25.152-b16/Java HotSpot(TM) 64-Bit Server VM from Oracle Corporation on Windows Server 2016: 10.0
     [echo] Building Apache POI version 5.0.0-SNAPSHOT and RC: RC1

-version-java-check:

compile-version:
     [copy] Copying 1 file to <https://builds.apache.org/job/POI-DSL-Windows-1.8/ws/build\classes\org\apache\poi>
    [javac] Compiling 1 source file to <https://builds.apache.org/job/POI-DSL-Windows-1.8/ws/build\classes>
   [delete] Deleting: <https://builds.apache.org/job/POI-DSL-Windows-1.8/ws/build\classes\org\apache\poi\Version.java>

compile-main:

BUILD FAILED
<https://builds.apache.org/job/POI-DSL-Windows-1.8/ws/build.xml>:998: The following error occurred while executing this line:
<https://builds.apache.org/job/POI-DSL-Windows-1.8/ws/build.xml>:850: java.util.regex.PatternSyntaxException: Illegal/unsupported escape sequence near index 4
^<https://builds.apache.org/job/POI-DSL-Windows-1.8/ws/[/\\](.*)$>
    ^
        at java.util.regex.Pattern.error(Pattern.java:1957)
        at java.util.regex.Pattern.escape(Pattern.java:2473)
        at java.util.regex.Pattern.atom(Pattern.java:2200)
        at java.util.regex.Pattern.sequence(Pattern.java:2132)
        at java.util.regex.Pattern.expr(Pattern.java:1998)
        at java.util.regex.Pattern.compile(Pattern.java:1698)
        at java.util.regex.Pattern.<init>(Pattern.java:1351)
        at java.util.regex.Pattern.compile(Pattern.java:1054)
        at org.apache.tools.ant.util.regexp.Jdk14RegexpMatcher.getCompiledPattern(Jdk14RegexpMatcher.java:65)
        at org.apache.tools.ant.util.regexp.Jdk14RegexpMatcher.matches(Jdk14RegexpMatcher.java:93)
        at org.apache.tools.ant.util.RegexpPatternMapper.mapFileName(RegexpPatternMapper.java:127)
        at org.apache.tools.ant.util.CompositeMapper.lambda$mapFileName$0(CompositeMapper.java:32)
        at java.util.stream.ReferencePipeline$3$1.accept(ReferencePipeline.java:193)
        at java.util.stream.ReferencePipeline$2$1.accept(ReferencePipeline.java:175)
        at java.util.ArrayList$ArrayListSpliterator.forEachRemaining(ArrayList.java:1382)
        at java.util.stream.AbstractPipeline.copyInto(AbstractPipeline.java:481)
        at java.util.stream.AbstractPipeline.wrapAndCopyInto(AbstractPipeline.java:471)
        at java.util.stream.AbstractPipeline.evaluate(AbstractPipeline.java:545)
        at java.util.stream.AbstractPipeline.evaluateToArrayNode(AbstractPipeline.java:260)
        at java.util.stream.ReferencePipeline.toArray(ReferencePipeline.java:438)
        at org.apache.tools.ant.util.CompositeMapper.mapFileName(CompositeMapper.java:33)
        at org.apache.tools.ant.taskdefs.PathConvert.execute(PathConvert.java:363)
        at org.apache.tools.ant.UnknownElement.execute(UnknownElement.java:292)
        at sun.reflect.GeneratedMethodAccessor4.invoke(Unknown Source)
        at sun.reflect.DelegatingMethodAccessorImpl.invoke(DelegatingMethodAccessorImpl.java:43)
        at java.lang.reflect.Method.invoke(Method.java:498)
        at org.apache.tools.ant.dispatch.DispatchUtils.execute(DispatchUtils.java:99)
        at org.apache.tools.ant.Task.perform(Task.java:350)
        at java.util.Vector.forEach(Vector.java:1249)
        at org.apache.tools.ant.taskdefs.Sequential.execute(Sequential.java:67)
        at org.apache.tools.ant.UnknownElement.execute(UnknownElement.java:292)
        at sun.reflect.GeneratedMethodAccessor4.invoke(Unknown Source)
        at sun.reflect.DelegatingMethodAccessorImpl.invoke(DelegatingMethodAccessorImpl.java:43)
        at java.lang.reflect.Method.invoke(Method.java:498)
        at org.apache.tools.ant.dispatch.DispatchUtils.execute(DispatchUtils.java:99)
        at org.apache.tools.ant.Task.perform(Task.java:350)
        at org.apache.tools.ant.taskdefs.MacroInstance.execute(MacroInstance.java:391)
        at org.apache.tools.ant.UnknownElement.execute(UnknownElement.java:292)
        at sun.reflect.GeneratedMethodAccessor4.invoke(Unknown Source)
        at sun.reflect.DelegatingMethodAccessorImpl.invoke(DelegatingMethodAccessorImpl.java:43)
        at java.lang.reflect.Method.invoke(Method.java:498)
        at org.apache.tools.ant.dispatch.DispatchUtils.execute(DispatchUtils.java:99)
        at org.apache.tools.ant.Task.perform(Task.java:350)
        at org.apache.tools.ant.Target.execute(Target.java:449)
        at org.apache.tools.ant.Target.performTasks(Target.java:470)
        at org.apache.tools.ant.Project.executeSortedTargets(Project.java:1388)
        at org.apache.tools.ant.Project.executeTarget(Project.java:1361)
        at org.apache.tools.ant.helper.DefaultExecutor.executeTargets(DefaultExecutor.java:41)
        at org.apache.tools.ant.Project.executeTargets(Project.java:1251)
        at org.apache.tools.ant.Main.runBuild(Main.java:834)
        at org.apache.tools.ant.Main.startAnt(Main.java:223)
        at org.apache.tools.ant.launch.Launcher.run(Launcher.java:284)
        at org.apache.tools.ant.launch.Launcher.main(Launcher.java:101)

Total time: 6 seconds
Build step 'Invoke Ant' marked build as failure
Skipping publisher since build result is FAILURE
Archiving artifacts
[Fast Archiver] Compressed 3.04 MB of artifacts by 22.6% relative to #690
Skipping publisher since build result is FAILURE
Recording test results
ERROR: Step ‘Publish JUnit test result report’ failed: No test report files were found. Configuration error?

---------------------------------------------------------------------
To unsubscribe, e-mail: [hidden email]
For additional commands, e-mail: [hidden email]

Reply | Threaded
Open this post in threaded view
|

Build failed in Jenkins: POI-DSL-Windows-1.8 #694

Apache Jenkins Server
See <https://builds.apache.org/job/POI-DSL-Windows-1.8/694/display/redirect?page=changes>

Changes:

[kiwiwings] examples had been moved due to jigsaw modules migration


------------------------------------------
[...truncated 32.10 KB...]
A         src\testcases\org\apache\poi\TestJDK12.java
D         src\testcases\org\apache\poi\hssf\dev\BaseXLSIteratingTest.java
AU        src\testcases\org\apache\poi\hssf\dev\BaseTestIteratingXLS.java
U         src\testcases\org\apache\poi\hssf\dev\TestBiffDrawingToXml.java
U         src\testcases\org\apache\poi\hssf\dev\TestBiffViewer.java
U         src\testcases\org\apache\poi\hssf\dev\TestEFBiffViewer.java
U         src\testcases\org\apache\poi\hssf\dev\TestFormulaViewer.java
U         src\testcases\org\apache\poi\hssf\dev\TestReSave.java
U         src\testcases\org\apache\poi\hssf\dev\TestRecordLister.java
AU        src\testcases\org\apache\poi\hssf\usermodel\TestHSSFChart.java
U         src\testcases\org\apache\poi\hssf\usermodel\TestHSSFRangeCopier.java
D         src\testcases\org\apache\poi\sl\TestCommonSL.java
AU        src\testcases\org\apache\poi\sl\draw\geom\TestFormulaParser.java
U         src\testcases\org\apache\poi\sl\usermodel\BaseTestSlideShow.java
U         src\testcases\org\apache\poi\ss\format\TestCellFormat.java
D         src\testcases\org\apache\poi\ss\formula\TestMissingWorkbook.java
U         src\testcases\org\apache\poi\ss\formula\AllSSFormulaTests.java
AU        src\testcases\org\apache\poi\ss\formula\BaseTestMissingWorkbook.java
D         src\testcases\org\apache\poi\ss\formula\eval\forked\TestForkedEvaluator.java
AU        src\testcases\org\apache\poi\ss\formula\eval\forked\BaseTestForkedEvaluator.java
D         src\testcases\org\apache\poi\ss\formula\functions\AbstractNumericTestCase.java
AU        src\testcases\org\apache\poi\ss\formula\functions\BaseTestNumeric.java
U         src\testcases\org\apache\poi\ss\formula\functions\TestFinanceLib.java
U         src\testcases\org\apache\poi\ss\formula\functions\TestMathX.java
U         src\testcases\org\apache\poi\ss\formula\functions\TestStatsLib.java
U         src\testcases\org\apache\poi\ss\formula\functions\TestTrunc.java
D         src\testcases\org\apache\poi\ss\formula\ptg\AbstractPtgTestCase.java
AU        src\testcases\org\apache\poi\ss\formula\ptg\BaseTestPtg.java
U         src\testcases\org\apache\poi\ss\formula\ptg\TestArea3DPtg.java
U         src\testcases\org\apache\poi\ss\formula\ptg\TestAreaErrPtg.java
U         src\testcases\org\apache\poi\ss\formula\ptg\TestAttrPtg.java
U         src\testcases\org\apache\poi\ss\formula\ptg\TestErrPtg.java
U         src\testcases\org\apache\poi\ss\formula\ptg\TestIntersectionPtg.java
U         src\testcases\org\apache\poi\ss\formula\ptg\TestPercentPtg.java
U         src\testcases\org\apache\poi\ss\formula\ptg\TestRangePtg.java
U         src\testcases\org\apache\poi\ss\formula\ptg\TestRef3DPtg.java
U         src\testcases\org\apache\poi\ss\formula\ptg\TestUnionPtg.java
D         src\testcases\org\apache\poi\ss\usermodel\TestRangeCopier.java
AU        src\testcases\org\apache\poi\ss\usermodel\BaseTestRangeCopier.java
U         build.xml
U         jenkins\create_jobs.groovy
AU        test-data\spreadsheet\64508.xlsx

<-- Got one external: documentation, svn url: https://svn.apache.org/repos/asf/poi/site/src/documentation -->
Fetching 'https://svn.apache.org/repos/asf/poi/site/src/documentation' at -1 into 'F:\jenkins\jenkins-slave\workspace\POI-DSL-Windows-1.8\src\documentation'
U         src\documentation\content\xdocs\changes.xml
At revision 1880266


<-- Got one external: forrest.properties, svn url: https://svn.apache.org/repos/asf/poi/site/forrest.properties -->
Fetching 'https://svn.apache.org/repos/asf/poi/site/forrest.properties' at -1 into 'F:\jenkins\jenkins-slave\workspace\POI-DSL-Windows-1.8\forrest.properties'
At revision 1880266

At revision 1880266

No changes for https://svn.apache.org/repos/asf/poi/site/src/documentation since the previous build
No changes for https://svn.apache.org/repos/asf/poi/site/forrest.properties since the previous build
[POI-DSL-Windows-1.8] $ cmd /c call F:\jenkins\jenkins-slave\temp\jenkins7833146929247995222.bat
    X   forrest.properties
X       src\documentation
?       src\integrationtest\build

Performing status on external item at 'src\documentation':
Java-Home: f:\\jenkins\\tools\\java\\latest1.8
 Volume in drive F is data
 Volume Serial Number is 86B6-2F62

 Directory of f:\jenkins\tools\java\latest1.8

07/01/2019  02:14 PM    <DIR>          .
07/01/2019  02:14 PM    <DIR>          ..
07/01/2019  02:12 PM    <DIR>          bin
07/01/2019  02:12 PM    <DIR>          db
07/01/2019  02:12 PM    <DIR>          include
09/14/2017  05:43 AM         5,202,881 javafx-src.zip
07/01/2019  02:12 PM    <DIR>          jre
07/01/2019  02:13 PM    <DIR>          lib
09/14/2017  10:15 AM                40 LICENSE
09/14/2017  10:15 AM               159 README.html
09/14/2017  10:15 AM               426 release
09/14/2017  05:43 AM            63,933 THIRDPARTYLICENSEREADME-JAVAFX.txt
09/14/2017  10:15 AM           145,180 THIRDPARTYLICENSEREADME.txt
               6 File(s)      5,412,619 bytes
               7 Dir(s)  1,951,267,356,672 bytes free
java version "1.8.0_152"
Java(TM) SE Runtime Environment (build 1.8.0_152-b16)
Java HotSpot(TM) 64-Bit Server VM (build 25.152-b16, mixed mode)
[POI-DSL-Windows-1.8] $ cmd.exe /C "F:\jenkins\tools\ant\latest1.10\bin\ant.bat -Dcoverage.enabled=true clean jenkins && exit %%ERRORLEVEL%%"
Buildfile: <https://builds.apache.org/job/POI-DSL-Windows-1.8/ws/build.xml>

clean:
   [delete] Deleting directory <https://builds.apache.org/job/POI-DSL-Windows-1.8/ws/build>

replaceVersion:

check-jars:
   [delete] Deleting <https://builds.apache.org/job/POI-DSL-Windows-1.8/ws/lib\ooxml-provided\bcpkix-jdk15on-1.65.jar>
   [delete] Deleting <https://builds.apache.org/job/POI-DSL-Windows-1.8/ws/lib\ooxml-provided\bcprov-ext-jdk15on-1.65.jar>
   [delete] Deleting <https://builds.apache.org/job/POI-DSL-Windows-1.8/ws/lib\ooxml-tests\guava-20.0.jar>

fetch-jars:
      [get] Destination already exists (skipping): <https://builds.apache.org/job/POI-DSL-Windows-1.8/ws/lib\main\commons-logging-1.2.jar>
      [get] Destination already exists (skipping): <https://builds.apache.org/job/POI-DSL-Windows-1.8/ws/lib\main\commons-codec-1.14.jar>
      [get] Destination already exists (skipping): <https://builds.apache.org/job/POI-DSL-Windows-1.8/ws/lib\main\log4j-1.2.17.jar>
      [get] Destination already exists (skipping): <https://builds.apache.org/job/POI-DSL-Windows-1.8/ws/lib\main-tests\junit-4.13.jar>
      [get] Destination already exists (skipping): <https://builds.apache.org/job/POI-DSL-Windows-1.8/ws/lib\main-tests\jmh-core-1.19.jar>
      [get] Destination already exists (skipping): <https://builds.apache.org/job/POI-DSL-Windows-1.8/ws/lib\main-tests\jmh-generator-annprocess-1.19.jar>
      [get] Destination already exists (skipping): <https://builds.apache.org/job/POI-DSL-Windows-1.8/ws/lib\main-tests\hamcrest-core-1.3.jar>
      [get] Destination already exists (skipping): <https://builds.apache.org/job/POI-DSL-Windows-1.8/ws/lib\main-tests\xmlunit-core-2.5.1.jar>
      [get] Destination already exists (skipping): <https://builds.apache.org/job/POI-DSL-Windows-1.8/ws/lib\main-tests\mockito-core-3.3.3.jar>
      [get] Destination already exists (skipping): <https://builds.apache.org/job/POI-DSL-Windows-1.8/ws/lib\main-tests\byte-buddy-1.10.1.jar>
      [get] Destination already exists (skipping): <https://builds.apache.org/job/POI-DSL-Windows-1.8/ws/lib\main-tests\byte-buddy-agent-1.10.1.jar>
      [get] Destination already exists (skipping): <https://builds.apache.org/job/POI-DSL-Windows-1.8/ws/lib\main-tests\objenesis-2.6.jar>
      [get] Getting: https://repo1.maven.org/maven2/org/apache/ant/ant/1.10.8/ant-1.10.8.jar
      [get] To: <https://builds.apache.org/job/POI-DSL-Windows-1.8/ws/lib\excelant\ant-1.10.8.jar>
      [get] Getting: https://repo1.maven.org/maven2/org/apache/ant/ant-launcher/1.10.8/ant-launcher-1.10.8.jar
      [get] To: <https://builds.apache.org/job/POI-DSL-Windows-1.8/ws/lib\excelant\ant-launcher-1.10.8.jar>
      [get] Destination already exists (skipping): <https://builds.apache.org/job/POI-DSL-Windows-1.8/ws/lib\util\asm-8.0.1.jar>
      [get] Destination already exists (skipping): <https://builds.apache.org/job/POI-DSL-Windows-1.8/ws/lib\util\asm-commons-8.0.1.jar>
      [get] Destination already exists (skipping): <https://builds.apache.org/job/POI-DSL-Windows-1.8/ws/lib\util\asm-tree-8.0.1.jar>
      [get] Destination already exists (skipping): <https://builds.apache.org/job/POI-DSL-Windows-1.8/ws/lib\util\jacoco-0.8.5.zip>
      [get] Destination already exists (skipping): <https://builds.apache.org/job/POI-DSL-Windows-1.8/ws/lib\main\commons-collections4-4.4.jar>
      [get] Destination already exists (skipping): <https://builds.apache.org/job/POI-DSL-Windows-1.8/ws/lib\main\commons-math3-3.6.1.jar>
      [get] Destination already exists (skipping): <https://builds.apache.org/job/POI-DSL-Windows-1.8/ws/lib\main\SparseBitSet-1.2.jar>
    [unzip] Expanding: <https://builds.apache.org/job/POI-DSL-Windows-1.8/ws/lib\util\jacoco-0.8.5.zip> into <https://builds.apache.org/job/POI-DSL-Windows-1.8/ws/lib\util>
      [get] Destination already exists (skipping): <https://builds.apache.org/job/POI-DSL-Windows-1.8/ws/lib\util\apache-rat-0.12.jar>
      [get] Destination already exists (skipping): <https://builds.apache.org/job/POI-DSL-Windows-1.8/ws/lib\util\forbiddenapis-2.6.jar>
      [get] Getting: https://repo1.maven.org/maven2/org/bouncycastle/bcprov-ext-jdk15on/1.66/bcprov-ext-jdk15on-1.66.jar
      [get] To: <https://builds.apache.org/job/POI-DSL-Windows-1.8/ws/lib\ooxml-provided\bcprov-ext-jdk15on-1.66.jar>
      [get] Getting: https://repo1.maven.org/maven2/org/bouncycastle/bcpkix-jdk15on/1.66/bcpkix-jdk15on-1.66.jar
      [get] To: <https://builds.apache.org/job/POI-DSL-Windows-1.8/ws/lib\ooxml-provided\bcpkix-jdk15on-1.66.jar>
      [get] Destination already exists (skipping): <https://builds.apache.org/job/POI-DSL-Windows-1.8/ws/lib\ooxml-provided\xmlsec-2.1.5.jar>
      [get] Destination already exists (skipping): <https://builds.apache.org/job/POI-DSL-Windows-1.8/ws/lib\ooxml-provided\slf4j-api-1.7.30.jar>

check-ooxml-jars:

fetch-ooxml-jars:
      [get] Destination already exists (skipping): <https://builds.apache.org/job/POI-DSL-Windows-1.8/ws/lib\ooxml\curvesapi-1.06.jar>
      [get] Getting: https://builds.apache.org/view/P/view/POI/job/POI-XMLBeans-DSL-1.8/lastSuccessfulBuild/artifact/build/xmlbeans-4.0.0.jar
      [get] To: <https://builds.apache.org/job/POI-DSL-Windows-1.8/ws/lib\ooxml\xmlbeans-4.0.0.jar>
      [get] Destination already exists (skipping): <https://builds.apache.org/job/POI-DSL-Windows-1.8/ws/lib\ooxml\commons-compress-1.20.jar>
      [get] Destination already exists (skipping): <https://builds.apache.org/job/POI-DSL-Windows-1.8/ws/lib\ooxml-tests\reflections-0.9.11.jar>
      [get] Getting: https://repo1.maven.org/maven2/com/google/guava/guava/29.0-jre/guava-29.0-jre.jar
      [get] To: <https://builds.apache.org/job/POI-DSL-Windows-1.8/ws/lib\ooxml-tests\guava-29.0-jre.jar>
      [get] Destination already exists (skipping): <https://builds.apache.org/job/POI-DSL-Windows-1.8/ws/lib\ooxml-tests\javassist-3.21.0-GA.jar>
      [get] Destination already exists (skipping): <https://builds.apache.org/job/POI-DSL-Windows-1.8/ws/lib\ooxml-provided\batik-all-1.12.jar>
      [get] Destination already exists (skipping): <https://builds.apache.org/job/POI-DSL-Windows-1.8/ws/lib\ooxml-provided\xml-apis-ext-1.3.04.jar>
      [get] Destination already exists (skipping): <https://builds.apache.org/job/POI-DSL-Windows-1.8/ws/lib\ooxml-provided\xmlgraphics-commons-2.3.jar>

init:
    [mkdir] Created dir: <https://builds.apache.org/job/POI-DSL-Windows-1.8/ws/build>
    [mkdir] Created dir: <https://builds.apache.org/job/POI-DSL-Windows-1.8/ws/build\classes>
    [mkdir] Created dir: <https://builds.apache.org/job/POI-DSL-Windows-1.8/ws/build\test-classes>
    [mkdir] Created dir: <https://builds.apache.org/job/POI-DSL-Windows-1.8/ws/build\test-results>
    [mkdir] Created dir: <https://builds.apache.org/job/POI-DSL-Windows-1.8/ws/build\scratchpad-classes>
    [mkdir] Created dir: <https://builds.apache.org/job/POI-DSL-Windows-1.8/ws/build\scratchpad-test-classes>
    [mkdir] Created dir: <https://builds.apache.org/job/POI-DSL-Windows-1.8/ws/build\scratchpad-test-results>
    [mkdir] Created dir: <https://builds.apache.org/job/POI-DSL-Windows-1.8/ws/build\geometry-java>
    [mkdir] Created dir: <https://builds.apache.org/job/POI-DSL-Windows-1.8/ws/build\ooxml-classes>
    [mkdir] Created dir: <https://builds.apache.org/job/POI-DSL-Windows-1.8/ws/build\ooxml-test-classes>
    [mkdir] Created dir: <https://builds.apache.org/job/POI-DSL-Windows-1.8/ws/build\ooxml-test-results>
    [mkdir] Created dir: <https://builds.apache.org/job/POI-DSL-Windows-1.8/ws/build\excelant-classes>
    [mkdir] Created dir: <https://builds.apache.org/job/POI-DSL-Windows-1.8/ws/build\excelant-test-classes>
    [mkdir] Created dir: <https://builds.apache.org/job/POI-DSL-Windows-1.8/ws/build\excelant-test-results>
    [mkdir] Created dir: <https://builds.apache.org/job/POI-DSL-Windows-1.8/ws/build\examples-classes>
    [mkdir] Created dir: <https://builds.apache.org/job/POI-DSL-Windows-1.8/ws/build\integration-test-classes>
    [mkdir] Created dir: <https://builds.apache.org/job/POI-DSL-Windows-1.8/ws/build\integration-test-results>
    [mkdir] Created dir: <https://builds.apache.org/job/POI-DSL-Windows-1.8/ws/build\dist>
    [mkdir] Created dir: <https://builds.apache.org/job/POI-DSL-Windows-1.8/ws/build\site>
     [echo] Using Ant: Apache Ant(TM) version 1.10.5 compiled on July 10 2018 from F:\\jenkins\\tools\\ant\\latest1.10, Ant detected Java 1.8 (may be different than actual Java sometimes...)
     [echo] Using Java: 1.8.0_152/1.8.0_152-b16/25.152-b16/Java HotSpot(TM) 64-Bit Server VM from Oracle Corporation on Windows Server 2016: 10.0
     [echo] Building Apache POI version 5.0.0-SNAPSHOT and RC: RC1

-version-java-check:

compile-version:
     [copy] Copying 1 file to <https://builds.apache.org/job/POI-DSL-Windows-1.8/ws/build\classes\org\apache\poi>
    [javac] Compiling 1 source file to <https://builds.apache.org/job/POI-DSL-Windows-1.8/ws/build\classes>
   [delete] Deleting: <https://builds.apache.org/job/POI-DSL-Windows-1.8/ws/build\classes\org\apache\poi\Version.java>

compile-main:

BUILD FAILED
<https://builds.apache.org/job/POI-DSL-Windows-1.8/ws/build.xml>:998: The following error occurred while executing this line:
<https://builds.apache.org/job/POI-DSL-Windows-1.8/ws/build.xml>:850: java.util.regex.PatternSyntaxException: Illegal/unsupported escape sequence near index 4
^<https://builds.apache.org/job/POI-DSL-Windows-1.8/ws/[/\\](.*)$>
    ^
        at java.util.regex.Pattern.error(Pattern.java:1957)
        at java.util.regex.Pattern.escape(Pattern.java:2473)
        at java.util.regex.Pattern.atom(Pattern.java:2200)
        at java.util.regex.Pattern.sequence(Pattern.java:2132)
        at java.util.regex.Pattern.expr(Pattern.java:1998)
        at java.util.regex.Pattern.compile(Pattern.java:1698)
        at java.util.regex.Pattern.<init>(Pattern.java:1351)
        at java.util.regex.Pattern.compile(Pattern.java:1054)
        at org.apache.tools.ant.util.regexp.Jdk14RegexpMatcher.getCompiledPattern(Jdk14RegexpMatcher.java:65)
        at org.apache.tools.ant.util.regexp.Jdk14RegexpMatcher.matches(Jdk14RegexpMatcher.java:93)
        at org.apache.tools.ant.util.RegexpPatternMapper.mapFileName(RegexpPatternMapper.java:127)
        at org.apache.tools.ant.util.CompositeMapper.lambda$mapFileName$0(CompositeMapper.java:32)
        at java.util.stream.ReferencePipeline$3$1.accept(ReferencePipeline.java:193)
        at java.util.stream.ReferencePipeline$2$1.accept(ReferencePipeline.java:175)
        at java.util.ArrayList$ArrayListSpliterator.forEachRemaining(ArrayList.java:1382)
        at java.util.stream.AbstractPipeline.copyInto(AbstractPipeline.java:481)
        at java.util.stream.AbstractPipeline.wrapAndCopyInto(AbstractPipeline.java:471)
        at java.util.stream.AbstractPipeline.evaluate(AbstractPipeline.java:545)
        at java.util.stream.AbstractPipeline.evaluateToArrayNode(AbstractPipeline.java:260)
        at java.util.stream.ReferencePipeline.toArray(ReferencePipeline.java:438)
        at org.apache.tools.ant.util.CompositeMapper.mapFileName(CompositeMapper.java:33)
        at org.apache.tools.ant.taskdefs.PathConvert.execute(PathConvert.java:363)
        at org.apache.tools.ant.UnknownElement.execute(UnknownElement.java:292)
        at sun.reflect.GeneratedMethodAccessor4.invoke(Unknown Source)
        at sun.reflect.DelegatingMethodAccessorImpl.invoke(DelegatingMethodAccessorImpl.java:43)
        at java.lang.reflect.Method.invoke(Method.java:498)
        at org.apache.tools.ant.dispatch.DispatchUtils.execute(DispatchUtils.java:99)
        at org.apache.tools.ant.Task.perform(Task.java:350)
        at java.util.Vector.forEach(Vector.java:1249)
        at org.apache.tools.ant.taskdefs.Sequential.execute(Sequential.java:67)
        at org.apache.tools.ant.UnknownElement.execute(UnknownElement.java:292)
        at sun.reflect.GeneratedMethodAccessor4.invoke(Unknown Source)
        at sun.reflect.DelegatingMethodAccessorImpl.invoke(DelegatingMethodAccessorImpl.java:43)
        at java.lang.reflect.Method.invoke(Method.java:498)
        at org.apache.tools.ant.dispatch.DispatchUtils.execute(DispatchUtils.java:99)
        at org.apache.tools.ant.Task.perform(Task.java:350)
        at org.apache.tools.ant.taskdefs.MacroInstance.execute(MacroInstance.java:391)
        at org.apache.tools.ant.UnknownElement.execute(UnknownElement.java:292)
        at sun.reflect.GeneratedMethodAccessor4.invoke(Unknown Source)
        at sun.reflect.DelegatingMethodAccessorImpl.invoke(DelegatingMethodAccessorImpl.java:43)
        at java.lang.reflect.Method.invoke(Method.java:498)
        at org.apache.tools.ant.dispatch.DispatchUtils.execute(DispatchUtils.java:99)
        at org.apache.tools.ant.Task.perform(Task.java:350)
        at org.apache.tools.ant.Target.execute(Target.java:449)
        at org.apache.tools.ant.Target.performTasks(Target.java:470)
        at org.apache.tools.ant.Project.executeSortedTargets(Project.java:1388)
        at org.apache.tools.ant.Project.executeTarget(Project.java:1361)
        at org.apache.tools.ant.helper.DefaultExecutor.executeTargets(DefaultExecutor.java:41)
        at org.apache.tools.ant.Project.executeTargets(Project.java:1251)
        at org.apache.tools.ant.Main.runBuild(Main.java:834)
        at org.apache.tools.ant.Main.startAnt(Main.java:223)
        at org.apache.tools.ant.launch.Launcher.run(Launcher.java:284)
        at org.apache.tools.ant.launch.Launcher.main(Launcher.java:101)

Total time: 14 seconds
Build step 'Invoke Ant' marked build as failure
Skipping publisher since build result is FAILURE
Archiving artifacts
[Fast Archiver] Compressed 3.04 MB of artifacts by 22.6% relative to #690
Skipping publisher since build result is FAILURE
Recording test results
ERROR: Step ‘Publish JUnit test result report’ failed: No test report files were found. Configuration error?

---------------------------------------------------------------------
To unsubscribe, e-mail: [hidden email]
For additional commands, e-mail: [hidden email]

Reply | Threaded
Open this post in threaded view
|

Build failed in Jenkins: POI-DSL-Windows-1.8 #695

Apache Jenkins Server
See <https://builds.apache.org/job/POI-DSL-Windows-1.8/695/display/redirect?page=changes>

Changes:

[fanningpj] try to fix changes.xml

[fanningpj] try to fix changes.xml

[fanningpj] try to fix paths for examples


------------------------------------------
Started by an SCM change
Running as SYSTEM
[EnvInject] - Loading node environment variables.
[EnvInject] - Preparing an environment for the build.
[EnvInject] - Keeping Jenkins system variables.
[EnvInject] - Keeping Jenkins build variables.
[EnvInject] - Injecting as environment variables the properties content
LANG=en_US.UTF-8
FORREST_HOME=f:\jenkins\tools\forrest\latest

[EnvInject] - Variables injected successfully.
[EnvInject] - Injecting contributions.
Building remotely on jenkins-win-he-de-2 (Windows) in workspace <https://builds.apache.org/job/POI-DSL-Windows-1.8/ws/>
[WS-CLEANUP] Deleting project workspace...
[WS-CLEANUP] Done
Updating https://svn.apache.org/repos/asf/poi/trunk at revision '2020-07-30T05:18:17.539 -0700'

<-- Got one external: documentation, svn url: https://svn.apache.org/repos/asf/poi/site/src/documentation -->
Fetching 'https://svn.apache.org/repos/asf/poi/site/src/documentation' at -1 into 'F:\jenkins\jenkins-slave\workspace\POI-DSL-Windows-1.8\src\documentation'
U         src\documentation\content\xdocs\changes.xml
U         src\documentation\content\xdocs\components\spreadsheet\examples.xml
U         src\documentation\content\xdocs\components\spreadsheet\excelant.xml
U         src\documentation\content\xdocs\components\spreadsheet\quick-guide.xml
U         src\documentation\content\xdocs\components\spreadsheet\user-defined-functions.xml
U         src\documentation\content\xdocs\help\faq.xml
At revision 1880444


<-- Got one external: forrest.properties, svn url: https://svn.apache.org/repos/asf/poi/site/forrest.properties -->
Fetching 'https://svn.apache.org/repos/asf/poi/site/forrest.properties' at -1 into 'F:\jenkins\jenkins-slave\workspace\POI-DSL-Windows-1.8\forrest.properties'
At revision 1880444

At revision 1880444

No changes for https://svn.apache.org/repos/asf/poi/trunk since the previous build
No changes for https://svn.apache.org/repos/asf/poi/site/forrest.properties since the previous build
[POI-DSL-Windows-1.8] $ cmd /c call F:\jenkins\jenkins-slave\temp\jenkins881294369367319323.bat
    X   forrest.properties
X       src\documentation
?       src\integrationtest\build

Performing status on external item at 'src\documentation':
Java-Home: f:\\jenkins\\tools\\java\\latest1.8
 Volume in drive F is data
 Volume Serial Number is 86B6-2F62

 Directory of f:\jenkins\tools\java\latest1.8

07/01/2019  02:14 PM    <DIR>          .
07/01/2019  02:14 PM    <DIR>          ..
07/01/2019  02:12 PM    <DIR>          bin
07/01/2019  02:12 PM    <DIR>          db
07/01/2019  02:12 PM    <DIR>          include
09/14/2017  05:43 AM         5,202,881 javafx-src.zip
07/01/2019  02:12 PM    <DIR>          jre
07/01/2019  02:13 PM    <DIR>          lib
09/14/2017  10:15 AM                40 LICENSE
09/14/2017  10:15 AM               159 README.html
09/14/2017  10:15 AM               426 release
09/14/2017  05:43 AM            63,933 THIRDPARTYLICENSEREADME-JAVAFX.txt
09/14/2017  10:15 AM           145,180 THIRDPARTYLICENSEREADME.txt
               6 File(s)      5,412,619 bytes
               7 Dir(s)  1,947,696,742,400 bytes free
java version "1.8.0_152"
Java(TM) SE Runtime Environment (build 1.8.0_152-b16)
Java HotSpot(TM) 64-Bit Server VM (build 25.152-b16, mixed mode)
[POI-DSL-Windows-1.8] $ cmd.exe /C "F:\jenkins\tools\ant\latest1.10\bin\ant.bat -Dcoverage.enabled=true clean jenkins && exit %%ERRORLEVEL%%"
Buildfile: <https://builds.apache.org/job/POI-DSL-Windows-1.8/ws/build.xml>

clean:
   [delete] Deleting directory <https://builds.apache.org/job/POI-DSL-Windows-1.8/ws/build>

replaceVersion:

check-jars:

fetch-jars:

check-ooxml-jars:

fetch-ooxml-jars:
      [get] Destination already exists (skipping): <https://builds.apache.org/job/POI-DSL-Windows-1.8/ws/lib\ooxml\curvesapi-1.06.jar>
      [get] Getting: https://builds.apache.org/view/P/view/POI/job/POI-XMLBeans-DSL-1.8/lastSuccessfulBuild/artifact/build/xmlbeans-4.0.0.jar
      [get] To: <https://builds.apache.org/job/POI-DSL-Windows-1.8/ws/lib\ooxml\xmlbeans-4.0.0.jar>
      [get] Destination already exists (skipping): <https://builds.apache.org/job/POI-DSL-Windows-1.8/ws/lib\ooxml\commons-compress-1.20.jar>
      [get] Destination already exists (skipping): <https://builds.apache.org/job/POI-DSL-Windows-1.8/ws/lib\ooxml-tests\reflections-0.9.11.jar>
      [get] Destination already exists (skipping): <https://builds.apache.org/job/POI-DSL-Windows-1.8/ws/lib\ooxml-tests\guava-29.0-jre.jar>
      [get] Destination already exists (skipping): <https://builds.apache.org/job/POI-DSL-Windows-1.8/ws/lib\ooxml-tests\javassist-3.21.0-GA.jar>
      [get] Destination already exists (skipping): <https://builds.apache.org/job/POI-DSL-Windows-1.8/ws/lib\ooxml-provided\batik-all-1.12.jar>
      [get] Destination already exists (skipping): <https://builds.apache.org/job/POI-DSL-Windows-1.8/ws/lib\ooxml-provided\xml-apis-ext-1.3.04.jar>
      [get] Destination already exists (skipping): <https://builds.apache.org/job/POI-DSL-Windows-1.8/ws/lib\ooxml-provided\xmlgraphics-commons-2.3.jar>

init:
    [mkdir] Created dir: <https://builds.apache.org/job/POI-DSL-Windows-1.8/ws/build>
    [mkdir] Created dir: <https://builds.apache.org/job/POI-DSL-Windows-1.8/ws/build\classes>
    [mkdir] Created dir: <https://builds.apache.org/job/POI-DSL-Windows-1.8/ws/build\test-classes>
    [mkdir] Created dir: <https://builds.apache.org/job/POI-DSL-Windows-1.8/ws/build\test-results>
    [mkdir] Created dir: <https://builds.apache.org/job/POI-DSL-Windows-1.8/ws/build\scratchpad-classes>
    [mkdir] Created dir: <https://builds.apache.org/job/POI-DSL-Windows-1.8/ws/build\scratchpad-test-classes>
    [mkdir] Created dir: <https://builds.apache.org/job/POI-DSL-Windows-1.8/ws/build\scratchpad-test-results>
    [mkdir] Created dir: <https://builds.apache.org/job/POI-DSL-Windows-1.8/ws/build\geometry-java>
    [mkdir] Created dir: <https://builds.apache.org/job/POI-DSL-Windows-1.8/ws/build\ooxml-classes>
    [mkdir] Created dir: <https://builds.apache.org/job/POI-DSL-Windows-1.8/ws/build\ooxml-test-classes>
    [mkdir] Created dir: <https://builds.apache.org/job/POI-DSL-Windows-1.8/ws/build\ooxml-test-results>
    [mkdir] Created dir: <https://builds.apache.org/job/POI-DSL-Windows-1.8/ws/build\excelant-classes>
    [mkdir] Created dir: <https://builds.apache.org/job/POI-DSL-Windows-1.8/ws/build\excelant-test-classes>
    [mkdir] Created dir: <https://builds.apache.org/job/POI-DSL-Windows-1.8/ws/build\excelant-test-results>
    [mkdir] Created dir: <https://builds.apache.org/job/POI-DSL-Windows-1.8/ws/build\examples-classes>
    [mkdir] Created dir: <https://builds.apache.org/job/POI-DSL-Windows-1.8/ws/build\integration-test-classes>
    [mkdir] Created dir: <https://builds.apache.org/job/POI-DSL-Windows-1.8/ws/build\integration-test-results>
    [mkdir] Created dir: <https://builds.apache.org/job/POI-DSL-Windows-1.8/ws/build\dist>
    [mkdir] Created dir: <https://builds.apache.org/job/POI-DSL-Windows-1.8/ws/build\site>
     [echo] Using Ant: Apache Ant(TM) version 1.10.5 compiled on July 10 2018 from F:\\jenkins\\tools\\ant\\latest1.10, Ant detected Java 1.8 (may be different than actual Java sometimes...)
     [echo] Using Java: 1.8.0_152/1.8.0_152-b16/25.152-b16/Java HotSpot(TM) 64-Bit Server VM from Oracle Corporation on Windows Server 2016: 10.0
     [echo] Building Apache POI version 5.0.0-SNAPSHOT and RC: RC1

-version-java-check:

compile-version:
     [copy] Copying 1 file to <https://builds.apache.org/job/POI-DSL-Windows-1.8/ws/build\classes\org\apache\poi>
    [javac] Compiling 1 source file to <https://builds.apache.org/job/POI-DSL-Windows-1.8/ws/build\classes>
   [delete] Deleting: <https://builds.apache.org/job/POI-DSL-Windows-1.8/ws/build\classes\org\apache\poi\Version.java>

compile-main:

BUILD FAILED
<https://builds.apache.org/job/POI-DSL-Windows-1.8/ws/build.xml>:998: The following error occurred while executing this line:
<https://builds.apache.org/job/POI-DSL-Windows-1.8/ws/build.xml>:850: java.util.regex.PatternSyntaxException: Illegal/unsupported escape sequence near index 4
^<https://builds.apache.org/job/POI-DSL-Windows-1.8/ws/[/\\](.*)$>
    ^
        at java.util.regex.Pattern.error(Pattern.java:1957)
        at java.util.regex.Pattern.escape(Pattern.java:2473)
        at java.util.regex.Pattern.atom(Pattern.java:2200)
        at java.util.regex.Pattern.sequence(Pattern.java:2132)
        at java.util.regex.Pattern.expr(Pattern.java:1998)
        at java.util.regex.Pattern.compile(Pattern.java:1698)
        at java.util.regex.Pattern.<init>(Pattern.java:1351)
        at java.util.regex.Pattern.compile(Pattern.java:1054)
        at org.apache.tools.ant.util.regexp.Jdk14RegexpMatcher.getCompiledPattern(Jdk14RegexpMatcher.java:65)
        at org.apache.tools.ant.util.regexp.Jdk14RegexpMatcher.matches(Jdk14RegexpMatcher.java:93)
        at org.apache.tools.ant.util.RegexpPatternMapper.mapFileName(RegexpPatternMapper.java:127)
        at org.apache.tools.ant.util.CompositeMapper.lambda$mapFileName$0(CompositeMapper.java:32)
        at java.util.stream.ReferencePipeline$3$1.accept(ReferencePipeline.java:193)
        at java.util.stream.ReferencePipeline$2$1.accept(ReferencePipeline.java:175)
        at java.util.ArrayList$ArrayListSpliterator.forEachRemaining(ArrayList.java:1382)
        at java.util.stream.AbstractPipeline.copyInto(AbstractPipeline.java:481)
        at java.util.stream.AbstractPipeline.wrapAndCopyInto(AbstractPipeline.java:471)
        at java.util.stream.AbstractPipeline.evaluate(AbstractPipeline.java:545)
        at java.util.stream.AbstractPipeline.evaluateToArrayNode(AbstractPipeline.java:260)
        at java.util.stream.ReferencePipeline.toArray(ReferencePipeline.java:438)
        at org.apache.tools.ant.util.CompositeMapper.mapFileName(CompositeMapper.java:33)
        at org.apache.tools.ant.taskdefs.PathConvert.execute(PathConvert.java:363)
        at org.apache.tools.ant.UnknownElement.execute(UnknownElement.java:292)
        at sun.reflect.GeneratedMethodAccessor4.invoke(Unknown Source)
        at sun.reflect.DelegatingMethodAccessorImpl.invoke(DelegatingMethodAccessorImpl.java:43)
        at java.lang.reflect.Method.invoke(Method.java:498)
        at org.apache.tools.ant.dispatch.DispatchUtils.execute(DispatchUtils.java:99)
        at org.apache.tools.ant.Task.perform(Task.java:350)
        at java.util.Vector.forEach(Vector.java:1249)
        at org.apache.tools.ant.taskdefs.Sequential.execute(Sequential.java:67)
        at org.apache.tools.ant.UnknownElement.execute(UnknownElement.java:292)
        at sun.reflect.GeneratedMethodAccessor4.invoke(Unknown Source)
        at sun.reflect.DelegatingMethodAccessorImpl.invoke(DelegatingMethodAccessorImpl.java:43)
        at java.lang.reflect.Method.invoke(Method.java:498)
        at org.apache.tools.ant.dispatch.DispatchUtils.execute(DispatchUtils.java:99)
        at org.apache.tools.ant.Task.perform(Task.java:350)
        at org.apache.tools.ant.taskdefs.MacroInstance.execute(MacroInstance.java:391)
        at org.apache.tools.ant.UnknownElement.execute(UnknownElement.java:292)
        at sun.reflect.GeneratedMethodAccessor4.invoke(Unknown Source)
        at sun.reflect.DelegatingMethodAccessorImpl.invoke(DelegatingMethodAccessorImpl.java:43)
        at java.lang.reflect.Method.invoke(Method.java:498)
        at org.apache.tools.ant.dispatch.DispatchUtils.execute(DispatchUtils.java:99)
        at org.apache.tools.ant.Task.perform(Task.java:350)
        at org.apache.tools.ant.Target.execute(Target.java:449)
        at org.apache.tools.ant.Target.performTasks(Target.java:470)
        at org.apache.tools.ant.Project.executeSortedTargets(Project.java:1388)
        at org.apache.tools.ant.Project.executeTarget(Project.java:1361)
        at org.apache.tools.ant.helper.DefaultExecutor.executeTargets(DefaultExecutor.java:41)
        at org.apache.tools.ant.Project.executeTargets(Project.java:1251)
        at org.apache.tools.ant.Main.runBuild(Main.java:834)
        at org.apache.tools.ant.Main.startAnt(Main.java:223)
        at org.apache.tools.ant.launch.Launcher.run(Launcher.java:284)
        at org.apache.tools.ant.launch.Launcher.main(Launcher.java:101)

Total time: 4 seconds
Build step 'Invoke Ant' marked build as failure
Skipping publisher since build result is FAILURE
Archiving artifacts
[Fast Archiver] Compressed 3.04 MB of artifacts by 22.6% relative to #690
Skipping publisher since build result is FAILURE
Recording test results
ERROR: Step ‘Publish JUnit test result report’ failed: No test report files were found. Configuration error?

---------------------------------------------------------------------
To unsubscribe, e-mail: [hidden email]
For additional commands, e-mail: [hidden email]

Reply | Threaded
Open this post in threaded view
|

Build failed in Jenkins: POI-DSL-Windows-1.8 #696

Apache Jenkins Server
See <https://builds.apache.org/job/POI-DSL-Windows-1.8/696/display/redirect?page=changes>

Changes:

[fanningpj] try to fix paths for examples


------------------------------------------
Started by an SCM change
Running as SYSTEM
[EnvInject] - Loading node environment variables.
[EnvInject] - Preparing an environment for the build.
[EnvInject] - Keeping Jenkins system variables.
[EnvInject] - Keeping Jenkins build variables.
[EnvInject] - Injecting as environment variables the properties content
LANG=en_US.UTF-8
FORREST_HOME=f:\jenkins\tools\forrest\latest

[EnvInject] - Variables injected successfully.
[EnvInject] - Injecting contributions.
Building remotely on jenkins-win-he-de-2 (Windows) in workspace <https://builds.apache.org/job/POI-DSL-Windows-1.8/ws/>
[WS-CLEANUP] Deleting project workspace...
[WS-CLEANUP] Done
Updating https://svn.apache.org/repos/asf/poi/trunk at revision '2020-07-30T17:18:11.682 -0700'

<-- Got one external: documentation, svn url: https://svn.apache.org/repos/asf/poi/site/src/documentation -->
Fetching 'https://svn.apache.org/repos/asf/poi/site/src/documentation' at -1 into 'F:\jenkins\jenkins-slave\workspace\POI-DSL-Windows-1.8\src\documentation'
U         src\documentation\content\xdocs\components\document\index.xml
U         src\documentation\content\xdocs\components\document\quick-guide-xwpf.xml
U         src\documentation\content\xdocs\components\hsmf\index.xml
U         src\documentation\content\xdocs\components\index.xml
U         src\documentation\content\xdocs\components\poifs\how-to.xml
U         src\documentation\content\xdocs\components\slideshow\xslf-cookbook.xml
U         src\documentation\content\xdocs\components\spreadsheet\examples.xml
U         src\documentation\content\xdocs\components\spreadsheet\how-to.xml
U         src\documentation\content\xdocs\components\spreadsheet\limitations.xml
U         src\documentation\content\xdocs\components\spreadsheet\quick-guide.xml
U         src\documentation\content\xdocs\help\faq.xml
At revision 1880458


<-- Got one external: forrest.properties, svn url: https://svn.apache.org/repos/asf/poi/site/forrest.properties -->
Fetching 'https://svn.apache.org/repos/asf/poi/site/forrest.properties' at -1 into 'F:\jenkins\jenkins-slave\workspace\POI-DSL-Windows-1.8\forrest.properties'
At revision 1880458

At revision 1880458

No changes for https://svn.apache.org/repos/asf/poi/trunk since the previous build
No changes for https://svn.apache.org/repos/asf/poi/site/forrest.properties since the previous build
[POI-DSL-Windows-1.8] $ cmd /c call F:\jenkins\jenkins-slave\temp\jenkins4862090834062721536.bat
    X   forrest.properties
X       src\documentation
?       src\integrationtest\build

Performing status on external item at 'src\documentation':
Java-Home: f:\\jenkins\\tools\\java\\latest1.8
 Volume in drive F is data
 Volume Serial Number is 86B6-2F62

 Directory of f:\jenkins\tools\java\latest1.8

07/01/2019  02:14 PM    <DIR>          .
07/01/2019  02:14 PM    <DIR>          ..
07/01/2019  02:12 PM    <DIR>          bin
07/01/2019  02:12 PM    <DIR>          db
07/01/2019  02:12 PM    <DIR>          include
09/14/2017  05:43 AM         5,202,881 javafx-src.zip
07/01/2019  02:12 PM    <DIR>          jre
07/01/2019  02:13 PM    <DIR>          lib
09/14/2017  10:15 AM                40 LICENSE
09/14/2017  10:15 AM               159 README.html
09/14/2017  10:15 AM               426 release
09/14/2017  05:43 AM            63,933 THIRDPARTYLICENSEREADME-JAVAFX.txt
09/14/2017  10:15 AM           145,180 THIRDPARTYLICENSEREADME.txt
               6 File(s)      5,412,619 bytes
               7 Dir(s)  1,947,693,248,512 bytes free
java version "1.8.0_152"
Java(TM) SE Runtime Environment (build 1.8.0_152-b16)
Java HotSpot(TM) 64-Bit Server VM (build 25.152-b16, mixed mode)
[POI-DSL-Windows-1.8] $ cmd.exe /C "F:\jenkins\tools\ant\latest1.10\bin\ant.bat -Dcoverage.enabled=true clean jenkins && exit %%ERRORLEVEL%%"
Buildfile: <https://builds.apache.org/job/POI-DSL-Windows-1.8/ws/build.xml>

clean:
   [delete] Deleting directory <https://builds.apache.org/job/POI-DSL-Windows-1.8/ws/build>

replaceVersion:

check-jars:

fetch-jars:

check-ooxml-jars:

fetch-ooxml-jars:
      [get] Destination already exists (skipping): <https://builds.apache.org/job/POI-DSL-Windows-1.8/ws/lib\ooxml\curvesapi-1.06.jar>
      [get] Getting: https://builds.apache.org/view/P/view/POI/job/POI-XMLBeans-DSL-1.8/lastSuccessfulBuild/artifact/build/xmlbeans-4.0.0.jar
      [get] To: <https://builds.apache.org/job/POI-DSL-Windows-1.8/ws/lib\ooxml\xmlbeans-4.0.0.jar>
      [get] Destination already exists (skipping): <https://builds.apache.org/job/POI-DSL-Windows-1.8/ws/lib\ooxml\commons-compress-1.20.jar>
      [get] Destination already exists (skipping): <https://builds.apache.org/job/POI-DSL-Windows-1.8/ws/lib\ooxml-tests\reflections-0.9.11.jar>
      [get] Destination already exists (skipping): <https://builds.apache.org/job/POI-DSL-Windows-1.8/ws/lib\ooxml-tests\guava-29.0-jre.jar>
      [get] Destination already exists (skipping): <https://builds.apache.org/job/POI-DSL-Windows-1.8/ws/lib\ooxml-tests\javassist-3.21.0-GA.jar>
      [get] Destination already exists (skipping): <https://builds.apache.org/job/POI-DSL-Windows-1.8/ws/lib\ooxml-provided\batik-all-1.12.jar>
      [get] Destination already exists (skipping): <https://builds.apache.org/job/POI-DSL-Windows-1.8/ws/lib\ooxml-provided\xml-apis-ext-1.3.04.jar>
      [get] Destination already exists (skipping): <https://builds.apache.org/job/POI-DSL-Windows-1.8/ws/lib\ooxml-provided\xmlgraphics-commons-2.3.jar>

init:
    [mkdir] Created dir: <https://builds.apache.org/job/POI-DSL-Windows-1.8/ws/build>
    [mkdir] Created dir: <https://builds.apache.org/job/POI-DSL-Windows-1.8/ws/build\classes>
    [mkdir] Created dir: <https://builds.apache.org/job/POI-DSL-Windows-1.8/ws/build\test-classes>
    [mkdir] Created dir: <https://builds.apache.org/job/POI-DSL-Windows-1.8/ws/build\test-results>
    [mkdir] Created dir: <https://builds.apache.org/job/POI-DSL-Windows-1.8/ws/build\scratchpad-classes>
    [mkdir] Created dir: <https://builds.apache.org/job/POI-DSL-Windows-1.8/ws/build\scratchpad-test-classes>
    [mkdir] Created dir: <https://builds.apache.org/job/POI-DSL-Windows-1.8/ws/build\scratchpad-test-results>
    [mkdir] Created dir: <https://builds.apache.org/job/POI-DSL-Windows-1.8/ws/build\geometry-java>
    [mkdir] Created dir: <https://builds.apache.org/job/POI-DSL-Windows-1.8/ws/build\ooxml-classes>
    [mkdir] Created dir: <https://builds.apache.org/job/POI-DSL-Windows-1.8/ws/build\ooxml-test-classes>
    [mkdir] Created dir: <https://builds.apache.org/job/POI-DSL-Windows-1.8/ws/build\ooxml-test-results>
    [mkdir] Created dir: <https://builds.apache.org/job/POI-DSL-Windows-1.8/ws/build\excelant-classes>
    [mkdir] Created dir: <https://builds.apache.org/job/POI-DSL-Windows-1.8/ws/build\excelant-test-classes>
    [mkdir] Created dir: <https://builds.apache.org/job/POI-DSL-Windows-1.8/ws/build\excelant-test-results>
    [mkdir] Created dir: <https://builds.apache.org/job/POI-DSL-Windows-1.8/ws/build\examples-classes>
    [mkdir] Created dir: <https://builds.apache.org/job/POI-DSL-Windows-1.8/ws/build\integration-test-classes>
    [mkdir] Created dir: <https://builds.apache.org/job/POI-DSL-Windows-1.8/ws/build\integration-test-results>
    [mkdir] Created dir: <https://builds.apache.org/job/POI-DSL-Windows-1.8/ws/build\dist>
    [mkdir] Created dir: <https://builds.apache.org/job/POI-DSL-Windows-1.8/ws/build\site>
     [echo] Using Ant: Apache Ant(TM) version 1.10.5 compiled on July 10 2018 from F:\\jenkins\\tools\\ant\\latest1.10, Ant detected Java 1.8 (may be different than actual Java sometimes...)
     [echo] Using Java: 1.8.0_152/1.8.0_152-b16/25.152-b16/Java HotSpot(TM) 64-Bit Server VM from Oracle Corporation on Windows Server 2016: 10.0
     [echo] Building Apache POI version 5.0.0-SNAPSHOT and RC: RC1

-version-java-check:

compile-version:
     [copy] Copying 1 file to <https://builds.apache.org/job/POI-DSL-Windows-1.8/ws/build\classes\org\apache\poi>
    [javac] Compiling 1 source file to <https://builds.apache.org/job/POI-DSL-Windows-1.8/ws/build\classes>
   [delete] Deleting: <https://builds.apache.org/job/POI-DSL-Windows-1.8/ws/build\classes\org\apache\poi\Version.java>

compile-main:

BUILD FAILED
<https://builds.apache.org/job/POI-DSL-Windows-1.8/ws/build.xml>:998: The following error occurred while executing this line:
<https://builds.apache.org/job/POI-DSL-Windows-1.8/ws/build.xml>:850: java.util.regex.PatternSyntaxException: Illegal/unsupported escape sequence near index 4
^<https://builds.apache.org/job/POI-DSL-Windows-1.8/ws/[/\\](.*)$>
    ^
        at java.util.regex.Pattern.error(Pattern.java:1957)
        at java.util.regex.Pattern.escape(Pattern.java:2473)
        at java.util.regex.Pattern.atom(Pattern.java:2200)
        at java.util.regex.Pattern.sequence(Pattern.java:2132)
        at java.util.regex.Pattern.expr(Pattern.java:1998)
        at java.util.regex.Pattern.compile(Pattern.java:1698)
        at java.util.regex.Pattern.<init>(Pattern.java:1351)
        at java.util.regex.Pattern.compile(Pattern.java:1054)
        at org.apache.tools.ant.util.regexp.Jdk14RegexpMatcher.getCompiledPattern(Jdk14RegexpMatcher.java:65)
        at org.apache.tools.ant.util.regexp.Jdk14RegexpMatcher.matches(Jdk14RegexpMatcher.java:93)
        at org.apache.tools.ant.util.RegexpPatternMapper.mapFileName(RegexpPatternMapper.java:127)
        at org.apache.tools.ant.util.CompositeMapper.lambda$mapFileName$0(CompositeMapper.java:32)
        at java.util.stream.ReferencePipeline$3$1.accept(ReferencePipeline.java:193)
        at java.util.stream.ReferencePipeline$2$1.accept(ReferencePipeline.java:175)
        at java.util.ArrayList$ArrayListSpliterator.forEachRemaining(ArrayList.java:1382)
        at java.util.stream.AbstractPipeline.copyInto(AbstractPipeline.java:481)
        at java.util.stream.AbstractPipeline.wrapAndCopyInto(AbstractPipeline.java:471)
        at java.util.stream.AbstractPipeline.evaluate(AbstractPipeline.java:545)
        at java.util.stream.AbstractPipeline.evaluateToArrayNode(AbstractPipeline.java:260)
        at java.util.stream.ReferencePipeline.toArray(ReferencePipeline.java:438)
        at org.apache.tools.ant.util.CompositeMapper.mapFileName(CompositeMapper.java:33)
        at org.apache.tools.ant.taskdefs.PathConvert.execute(PathConvert.java:363)
        at org.apache.tools.ant.UnknownElement.execute(UnknownElement.java:292)
        at sun.reflect.GeneratedMethodAccessor4.invoke(Unknown Source)
        at sun.reflect.DelegatingMethodAccessorImpl.invoke(DelegatingMethodAccessorImpl.java:43)
        at java.lang.reflect.Method.invoke(Method.java:498)
        at org.apache.tools.ant.dispatch.DispatchUtils.execute(DispatchUtils.java:99)
        at org.apache.tools.ant.Task.perform(Task.java:350)
        at java.util.Vector.forEach(Vector.java:1249)
        at org.apache.tools.ant.taskdefs.Sequential.execute(Sequential.java:67)
        at org.apache.tools.ant.UnknownElement.execute(UnknownElement.java:292)
        at sun.reflect.GeneratedMethodAccessor4.invoke(Unknown Source)
        at sun.reflect.DelegatingMethodAccessorImpl.invoke(DelegatingMethodAccessorImpl.java:43)
        at java.lang.reflect.Method.invoke(Method.java:498)
        at org.apache.tools.ant.dispatch.DispatchUtils.execute(DispatchUtils.java:99)
        at org.apache.tools.ant.Task.perform(Task.java:350)
        at org.apache.tools.ant.taskdefs.MacroInstance.execute(MacroInstance.java:391)
        at org.apache.tools.ant.UnknownElement.execute(UnknownElement.java:292)
        at sun.reflect.GeneratedMethodAccessor4.invoke(Unknown Source)
        at sun.reflect.DelegatingMethodAccessorImpl.invoke(DelegatingMethodAccessorImpl.java:43)
        at java.lang.reflect.Method.invoke(Method.java:498)
        at org.apache.tools.ant.dispatch.DispatchUtils.execute(DispatchUtils.java:99)
        at org.apache.tools.ant.Task.perform(Task.java:350)
        at org.apache.tools.ant.Target.execute(Target.java:449)
        at org.apache.tools.ant.Target.performTasks(Target.java:470)
        at org.apache.tools.ant.Project.executeSortedTargets(Project.java:1388)
        at org.apache.tools.ant.Project.executeTarget(Project.java:1361)
        at org.apache.tools.ant.helper.DefaultExecutor.executeTargets(DefaultExecutor.java:41)
        at org.apache.tools.ant.Project.executeTargets(Project.java:1251)
        at org.apache.tools.ant.Main.runBuild(Main.java:834)
        at org.apache.tools.ant.Main.startAnt(Main.java:223)
        at org.apache.tools.ant.launch.Launcher.run(Launcher.java:284)
        at org.apache.tools.ant.launch.Launcher.main(Launcher.java:101)

Total time: 3 seconds
Build step 'Invoke Ant' marked build as failure
Skipping publisher since build result is FAILURE
Archiving artifacts
[Fast Archiver] Compressed 3.04 MB of artifacts by 22.6% relative to #690
Skipping publisher since build result is FAILURE
Recording test results
ERROR: Step ‘Publish JUnit test result report’ failed: No test report files were found. Configuration error?

---------------------------------------------------------------------
To unsubscribe, e-mail: [hidden email]
For additional commands, e-mail: [hidden email]

Reply | Threaded
Open this post in threaded view
|

Build failed in Jenkins: POI-DSL-Windows-1.8 #697

Apache Jenkins Server
See <https://builds.apache.org/job/POI-DSL-Windows-1.8/697/display/redirect?page=changes>

Changes:

[fanningpj] fix up some example links


------------------------------------------
Started by an SCM change
Running as SYSTEM
[EnvInject] - Loading node environment variables.
[EnvInject] - Preparing an environment for the build.
[EnvInject] - Keeping Jenkins system variables.
[EnvInject] - Keeping Jenkins build variables.
[EnvInject] - Injecting as environment variables the properties content
LANG=en_US.UTF-8
FORREST_HOME=f:\jenkins\tools\forrest\latest

[EnvInject] - Variables injected successfully.
[EnvInject] - Injecting contributions.
Building remotely on jenkins-win-he-de-2 (Windows) in workspace <https://builds.apache.org/job/POI-DSL-Windows-1.8/ws/>
[WS-CLEANUP] Deleting project workspace...
[WS-CLEANUP] Done
Updating https://svn.apache.org/repos/asf/poi/trunk at revision '2020-07-31T05:18:11.578 -0700'

<-- Got one external: documentation, svn url: https://svn.apache.org/repos/asf/poi/site/src/documentation -->
Fetching 'https://svn.apache.org/repos/asf/poi/site/src/documentation' at -1 into 'F:\jenkins\jenkins-slave\workspace\POI-DSL-Windows-1.8\src\documentation'
U         src\documentation\content\xdocs\components\spreadsheet\examples.xml
U         src\documentation\content\xdocs\components\spreadsheet\how-to.xml
U         src\documentation\content\xdocs\components\spreadsheet\quick-guide.xml
At revision 1880480


<-- Got one external: forrest.properties, svn url: https://svn.apache.org/repos/asf/poi/site/forrest.properties -->
Fetching 'https://svn.apache.org/repos/asf/poi/site/forrest.properties' at -1 into 'F:\jenkins\jenkins-slave\workspace\POI-DSL-Windows-1.8\forrest.properties'
At revision 1880480

At revision 1880480

No changes for https://svn.apache.org/repos/asf/poi/trunk since the previous build
No changes for https://svn.apache.org/repos/asf/poi/site/forrest.properties since the previous build
[POI-DSL-Windows-1.8] $ cmd /c call F:\jenkins\jenkins-slave\temp\jenkins9007576001658975436.bat
    X   forrest.properties
X       src\documentation
?       src\integrationtest\build

Performing status on external item at 'src\documentation':
Java-Home: f:\\jenkins\\tools\\java\\latest1.8
 Volume in drive F is data
 Volume Serial Number is 86B6-2F62

 Directory of f:\jenkins\tools\java\latest1.8

07/01/2019  02:14 PM    <DIR>          .
07/01/2019  02:14 PM    <DIR>          ..
07/01/2019  02:12 PM    <DIR>          bin
07/01/2019  02:12 PM    <DIR>          db
07/01/2019  02:12 PM    <DIR>          include
09/14/2017  05:43 AM         5,202,881 javafx-src.zip
07/01/2019  02:12 PM    <DIR>          jre
07/01/2019  02:13 PM    <DIR>          lib
09/14/2017  10:15 AM                40 LICENSE
09/14/2017  10:15 AM               159 README.html
09/14/2017  10:15 AM               426 release
09/14/2017  05:43 AM            63,933 THIRDPARTYLICENSEREADME-JAVAFX.txt
09/14/2017  10:15 AM           145,180 THIRDPARTYLICENSEREADME.txt
               6 File(s)      5,412,619 bytes
               7 Dir(s)  1,947,707,424,768 bytes free
java version "1.8.0_152"
Java(TM) SE Runtime Environment (build 1.8.0_152-b16)
Java HotSpot(TM) 64-Bit Server VM (build 25.152-b16, mixed mode)
[POI-DSL-Windows-1.8] $ cmd.exe /C "F:\jenkins\tools\ant\latest1.10\bin\ant.bat -Dcoverage.enabled=true clean jenkins && exit %%ERRORLEVEL%%"
Buildfile: <https://builds.apache.org/job/POI-DSL-Windows-1.8/ws/build.xml>

clean:
   [delete] Deleting directory <https://builds.apache.org/job/POI-DSL-Windows-1.8/ws/build>

replaceVersion:

check-jars:

fetch-jars:

check-ooxml-jars:

fetch-ooxml-jars:
      [get] Destination already exists (skipping): <https://builds.apache.org/job/POI-DSL-Windows-1.8/ws/lib\ooxml\curvesapi-1.06.jar>
      [get] Getting: https://builds.apache.org/view/P/view/POI/job/POI-XMLBeans-DSL-1.8/lastSuccessfulBuild/artifact/build/xmlbeans-4.0.0.jar
      [get] To: <https://builds.apache.org/job/POI-DSL-Windows-1.8/ws/lib\ooxml\xmlbeans-4.0.0.jar>
      [get] Destination already exists (skipping): <https://builds.apache.org/job/POI-DSL-Windows-1.8/ws/lib\ooxml\commons-compress-1.20.jar>
      [get] Destination already exists (skipping): <https://builds.apache.org/job/POI-DSL-Windows-1.8/ws/lib\ooxml-tests\reflections-0.9.11.jar>
      [get] Destination already exists (skipping): <https://builds.apache.org/job/POI-DSL-Windows-1.8/ws/lib\ooxml-tests\guava-29.0-jre.jar>
      [get] Destination already exists (skipping): <https://builds.apache.org/job/POI-DSL-Windows-1.8/ws/lib\ooxml-tests\javassist-3.21.0-GA.jar>
      [get] Destination already exists (skipping): <https://builds.apache.org/job/POI-DSL-Windows-1.8/ws/lib\ooxml-provided\batik-all-1.12.jar>
      [get] Destination already exists (skipping): <https://builds.apache.org/job/POI-DSL-Windows-1.8/ws/lib\ooxml-provided\xml-apis-ext-1.3.04.jar>
      [get] Destination already exists (skipping): <https://builds.apache.org/job/POI-DSL-Windows-1.8/ws/lib\ooxml-provided\xmlgraphics-commons-2.3.jar>

init:
    [mkdir] Created dir: <https://builds.apache.org/job/POI-DSL-Windows-1.8/ws/build>
    [mkdir] Created dir: <https://builds.apache.org/job/POI-DSL-Windows-1.8/ws/build\classes>
    [mkdir] Created dir: <https://builds.apache.org/job/POI-DSL-Windows-1.8/ws/build\test-classes>
    [mkdir] Created dir: <https://builds.apache.org/job/POI-DSL-Windows-1.8/ws/build\test-results>
    [mkdir] Created dir: <https://builds.apache.org/job/POI-DSL-Windows-1.8/ws/build\scratchpad-classes>
    [mkdir] Created dir: <https://builds.apache.org/job/POI-DSL-Windows-1.8/ws/build\scratchpad-test-classes>
    [mkdir] Created dir: <https://builds.apache.org/job/POI-DSL-Windows-1.8/ws/build\scratchpad-test-results>
    [mkdir] Created dir: <https://builds.apache.org/job/POI-DSL-Windows-1.8/ws/build\geometry-java>
    [mkdir] Created dir: <https://builds.apache.org/job/POI-DSL-Windows-1.8/ws/build\ooxml-classes>
    [mkdir] Created dir: <https://builds.apache.org/job/POI-DSL-Windows-1.8/ws/build\ooxml-test-classes>
    [mkdir] Created dir: <https://builds.apache.org/job/POI-DSL-Windows-1.8/ws/build\ooxml-test-results>
    [mkdir] Created dir: <https://builds.apache.org/job/POI-DSL-Windows-1.8/ws/build\excelant-classes>
    [mkdir] Created dir: <https://builds.apache.org/job/POI-DSL-Windows-1.8/ws/build\excelant-test-classes>
    [mkdir] Created dir: <https://builds.apache.org/job/POI-DSL-Windows-1.8/ws/build\excelant-test-results>
    [mkdir] Created dir: <https://builds.apache.org/job/POI-DSL-Windows-1.8/ws/build\examples-classes>
    [mkdir] Created dir: <https://builds.apache.org/job/POI-DSL-Windows-1.8/ws/build\integration-test-classes>
    [mkdir] Created dir: <https://builds.apache.org/job/POI-DSL-Windows-1.8/ws/build\integration-test-results>
    [mkdir] Created dir: <https://builds.apache.org/job/POI-DSL-Windows-1.8/ws/build\dist>
    [mkdir] Created dir: <https://builds.apache.org/job/POI-DSL-Windows-1.8/ws/build\site>
     [echo] Using Ant: Apache Ant(TM) version 1.10.5 compiled on July 10 2018 from F:\\jenkins\\tools\\ant\\latest1.10, Ant detected Java 1.8 (may be different than actual Java sometimes...)
     [echo] Using Java: 1.8.0_152/1.8.0_152-b16/25.152-b16/Java HotSpot(TM) 64-Bit Server VM from Oracle Corporation on Windows Server 2016: 10.0
     [echo] Building Apache POI version 5.0.0-SNAPSHOT and RC: RC1

-version-java-check:

compile-version:
     [copy] Copying 1 file to <https://builds.apache.org/job/POI-DSL-Windows-1.8/ws/build\classes\org\apache\poi>
    [javac] Compiling 1 source file to <https://builds.apache.org/job/POI-DSL-Windows-1.8/ws/build\classes>
   [delete] Deleting: <https://builds.apache.org/job/POI-DSL-Windows-1.8/ws/build\classes\org\apache\poi\Version.java>

compile-main:

BUILD FAILED
<https://builds.apache.org/job/POI-DSL-Windows-1.8/ws/build.xml>:998: The following error occurred while executing this line:
<https://builds.apache.org/job/POI-DSL-Windows-1.8/ws/build.xml>:850: java.util.regex.PatternSyntaxException: Illegal/unsupported escape sequence near index 4
^<https://builds.apache.org/job/POI-DSL-Windows-1.8/ws/[/\\](.*)$>
    ^
        at java.util.regex.Pattern.error(Pattern.java:1957)
        at java.util.regex.Pattern.escape(Pattern.java:2473)
        at java.util.regex.Pattern.atom(Pattern.java:2200)
        at java.util.regex.Pattern.sequence(Pattern.java:2132)
        at java.util.regex.Pattern.expr(Pattern.java:1998)
        at java.util.regex.Pattern.compile(Pattern.java:1698)
        at java.util.regex.Pattern.<init>(Pattern.java:1351)
        at java.util.regex.Pattern.compile(Pattern.java:1054)
        at org.apache.tools.ant.util.regexp.Jdk14RegexpMatcher.getCompiledPattern(Jdk14RegexpMatcher.java:65)
        at org.apache.tools.ant.util.regexp.Jdk14RegexpMatcher.matches(Jdk14RegexpMatcher.java:93)
        at org.apache.tools.ant.util.RegexpPatternMapper.mapFileName(RegexpPatternMapper.java:127)
        at org.apache.tools.ant.util.CompositeMapper.lambda$mapFileName$0(CompositeMapper.java:32)
        at java.util.stream.ReferencePipeline$3$1.accept(ReferencePipeline.java:193)
        at java.util.stream.ReferencePipeline$2$1.accept(ReferencePipeline.java:175)
        at java.util.ArrayList$ArrayListSpliterator.forEachRemaining(ArrayList.java:1382)
        at java.util.stream.AbstractPipeline.copyInto(AbstractPipeline.java:481)
        at java.util.stream.AbstractPipeline.wrapAndCopyInto(AbstractPipeline.java:471)
        at java.util.stream.AbstractPipeline.evaluate(AbstractPipeline.java:545)
        at java.util.stream.AbstractPipeline.evaluateToArrayNode(AbstractPipeline.java:260)
        at java.util.stream.ReferencePipeline.toArray(ReferencePipeline.java:438)
        at org.apache.tools.ant.util.CompositeMapper.mapFileName(CompositeMapper.java:33)
        at org.apache.tools.ant.taskdefs.PathConvert.execute(PathConvert.java:363)
        at org.apache.tools.ant.UnknownElement.execute(UnknownElement.java:292)
        at sun.reflect.GeneratedMethodAccessor4.invoke(Unknown Source)
        at sun.reflect.DelegatingMethodAccessorImpl.invoke(DelegatingMethodAccessorImpl.java:43)
        at java.lang.reflect.Method.invoke(Method.java:498)
        at org.apache.tools.ant.dispatch.DispatchUtils.execute(DispatchUtils.java:99)
        at org.apache.tools.ant.Task.perform(Task.java:350)
        at java.util.Vector.forEach(Vector.java:1249)
        at org.apache.tools.ant.taskdefs.Sequential.execute(Sequential.java:67)
        at org.apache.tools.ant.UnknownElement.execute(UnknownElement.java:292)
        at sun.reflect.GeneratedMethodAccessor4.invoke(Unknown Source)
        at sun.reflect.DelegatingMethodAccessorImpl.invoke(DelegatingMethodAccessorImpl.java:43)
        at java.lang.reflect.Method.invoke(Method.java:498)
        at org.apache.tools.ant.dispatch.DispatchUtils.execute(DispatchUtils.java:99)
        at org.apache.tools.ant.Task.perform(Task.java:350)
        at org.apache.tools.ant.taskdefs.MacroInstance.execute(MacroInstance.java:391)
        at org.apache.tools.ant.UnknownElement.execute(UnknownElement.java:292)
        at sun.reflect.GeneratedMethodAccessor4.invoke(Unknown Source)
        at sun.reflect.DelegatingMethodAccessorImpl.invoke(DelegatingMethodAccessorImpl.java:43)
        at java.lang.reflect.Method.invoke(Method.java:498)
        at org.apache.tools.ant.dispatch.DispatchUtils.execute(DispatchUtils.java:99)
        at org.apache.tools.ant.Task.perform(Task.java:350)
        at org.apache.tools.ant.Target.execute(Target.java:449)
        at org.apache.tools.ant.Target.performTasks(Target.java:470)
        at org.apache.tools.ant.Project.executeSortedTargets(Project.java:1388)
        at org.apache.tools.ant.Project.executeTarget(Project.java:1361)
        at org.apache.tools.ant.helper.DefaultExecutor.executeTargets(DefaultExecutor.java:41)
        at org.apache.tools.ant.Project.executeTargets(Project.java:1251)
        at org.apache.tools.ant.Main.runBuild(Main.java:834)
        at org.apache.tools.ant.Main.startAnt(Main.java:223)
        at org.apache.tools.ant.launch.Launcher.run(Launcher.java:284)
        at org.apache.tools.ant.launch.Launcher.main(Launcher.java:101)

Total time: 3 seconds
Build step 'Invoke Ant' marked build as failure
Skipping publisher since build result is FAILURE
Archiving artifacts
[Fast Archiver] Compressed 3.04 MB of artifacts by 22.6% relative to #690
Skipping publisher since build result is FAILURE
Recording test results
ERROR: Step ‘Publish JUnit test result report’ failed: No test report files were found. Configuration error?

---------------------------------------------------------------------
To unsubscribe, e-mail: [hidden email]
For additional commands, e-mail: [hidden email]

Reply | Threaded
Open this post in threaded view
|

Jenkins build is back to normal : POI-DSL-Windows-1.8 #698

Apache Jenkins Server
See <https://builds.apache.org/job/POI-DSL-Windows-1.8/698/display/redirect?page=changes>


---------------------------------------------------------------------
To unsubscribe, e-mail: [hidden email]
For additional commands, e-mail: [hidden email]