Build failed in Jenkins: POI-DSL-Windows-1.8 #522

classic Classic list List threaded Threaded
2 messages Options
Reply | Threaded
Open this post in threaded view
|

Build failed in Jenkins: POI-DSL-Windows-1.8 #522

Apache Jenkins Server
See <https://builds.apache.org/job/POI-DSL-Windows-1.8/522/display/redirect?page=changes>

Changes:

[kiwiwings] Update Jacoco version and activate it again in the Sonar run

[kiwiwings] Sonar Fixes - fix/annotate type "vulnerability" / severity "blocker"


------------------------------------------
[...truncated 374.67 KB...]
    [junit] Running org.apache.poi.xssf.usermodel.TestXSSFColGrouping
    [junit] Tests run: 6, Failures: 0, Errors: 0, Skipped: 0, Time elapsed: 0.065 sec
    [junit] Running org.apache.poi.xssf.usermodel.TestXSSFColor
    [junit] Tests run: 4, Failures: 0, Errors: 0, Skipped: 0, Time elapsed: 0.05 sec
    [junit] Running org.apache.poi.xssf.usermodel.TestXSSFComment
    [junit] Tests run: 19, Failures: 0, Errors: 0, Skipped: 1, Time elapsed: 0.242 sec
    [junit] Running org.apache.poi.xssf.usermodel.TestXSSFConditionalFormatting
    [junit] Tests run: 23, Failures: 0, Errors: 0, Skipped: 0, Time elapsed: 0.23 sec
    [junit] Running org.apache.poi.xssf.usermodel.TestXSSFDataFormat
    [junit] Tests run: 8, Failures: 0, Errors: 0, Skipped: 0, Time elapsed: 0.075 sec
    [junit] Running org.apache.poi.xssf.usermodel.TestXSSFDataValidation
    [junit] Tests run: 9, Failures: 0, Errors: 0, Skipped: 0, Time elapsed: 0.296 sec
    [junit] Running org.apache.poi.xssf.usermodel.TestXSSFDataValidationConstraint
    [junit] Tests run: 4, Failures: 0, Errors: 0, Skipped: 0, Time elapsed: 0.03 sec
    [junit] Running org.apache.poi.xssf.usermodel.TestXSSFDialogSheet
    [junit] Tests run: 14, Failures: 0, Errors: 0, Skipped: 0, Time elapsed: 0.152 sec
    [junit] Running org.apache.poi.xssf.usermodel.TestXSSFDrawing
    [junit] Tests run: 21, Failures: 0, Errors: 0, Skipped: 0, Time elapsed: 0.493 sec
    [junit] Running org.apache.poi.xssf.usermodel.TestXSSFEvaluationSheet
    [junit] Tests run: 2, Failures: 0, Errors: 0, Skipped: 0, Time elapsed: 0.005 sec
    [junit] Running org.apache.poi.xssf.usermodel.TestXSSFEvenFooter
    [junit] Tests run: 1, Failures: 0, Errors: 0, Skipped: 0, Time elapsed: 0.007 sec
    [junit] Running org.apache.poi.xssf.usermodel.TestXSSFEvenHeader
    [junit] Tests run: 1, Failures: 0, Errors: 0, Skipped: 0, Time elapsed: 0.005 sec
    [junit] Running org.apache.poi.xssf.usermodel.TestXSSFExternalFunctions
    [junit] Tests run: 2, Failures: 0, Errors: 0, Skipped: 0, Time elapsed: 0.024 sec
    [junit] Running org.apache.poi.xssf.usermodel.TestXSSFFirstFooter
    [junit] Tests run: 1, Failures: 0, Errors: 0, Skipped: 0, Time elapsed: 0.004 sec
    [junit] Running org.apache.poi.xssf.usermodel.TestXSSFFirstHeader
    [junit] Tests run: 1, Failures: 0, Errors: 0, Skipped: 0, Time elapsed: 0.003 sec
    [junit] Running org.apache.poi.xssf.usermodel.TestXSSFFont
    [junit] Tests run: 22, Failures: 0, Errors: 0, Skipped: 0, Time elapsed: 0.188 sec
    [junit] Running org.apache.poi.xssf.usermodel.TestXSSFForkedEvaluator
    [junit] Tests run: 2, Failures: 0, Errors: 0, Skipped: 0, Time elapsed: 0.024 sec
    [junit] Running org.apache.poi.xssf.usermodel.TestXSSFFormulaEvaluation
    [junit] Tests run: 38, Failures: 0, Errors: 0, Skipped: 3, Time elapsed: 1.146 sec
    [junit] Running org.apache.poi.xssf.usermodel.TestXSSFFormulaParser
    [junit] Tests run: 12, Failures: 0, Errors: 0, Skipped: 0, Time elapsed: 0.147 sec
    [junit] Running org.apache.poi.xssf.usermodel.TestXSSFHeaderFooterProperties
    [junit] Tests run: 8, Failures: 0, Errors: 0, Skipped: 0, Time elapsed: 0.053 sec
    [junit] Running org.apache.poi.xssf.usermodel.TestXSSFHyperlink
    [junit] Tests run: 12, Failures: 0, Errors: 0, Skipped: 0, Time elapsed: 0.276 sec
    [junit] Running org.apache.poi.xssf.usermodel.TestXSSFName
    [junit] Tests run: 26, Failures: 0, Errors: 0, Skipped: 0, Time elapsed: 0.297 sec
    [junit] Running org.apache.poi.xssf.usermodel.TestXSSFOddFooter
    [junit] Tests run: 1, Failures: 0, Errors: 0, Skipped: 0, Time elapsed: 0.004 sec
    [junit] Running org.apache.poi.xssf.usermodel.TestXSSFOddHeader
    [junit] Tests run: 1, Failures: 0, Errors: 0, Skipped: 0, Time elapsed: 0.005 sec
    [junit] Running org.apache.poi.xssf.usermodel.TestXSSFPicture
    [junit] Tests run: 6, Failures: 0, Errors: 0, Skipped: 0, Time elapsed: 0.096 sec
    [junit] Running org.apache.poi.xssf.usermodel.TestXSSFPictureData
    [junit] Tests run: 3, Failures: 0, Errors: 0, Skipped: 0, Time elapsed: 0.07 sec
    [junit] Running org.apache.poi.xssf.usermodel.TestXSSFPivotTableName
    [junit] Tests run: 18, Failures: 0, Errors: 0, Skipped: 0, Time elapsed: 0.534 sec
    [junit] Running org.apache.poi.xssf.usermodel.TestXSSFPivotTableRef
    [junit] Tests run: 18, Failures: 0, Errors: 0, Skipped: 0, Time elapsed: 0.297 sec
    [junit] Running org.apache.poi.xssf.usermodel.TestXSSFPrintSetup
    [junit] Tests run: 19, Failures: 0, Errors: 0, Skipped: 0, Time elapsed: 0.088 sec
    [junit] Running org.apache.poi.xssf.usermodel.TestXSSFRichTextString
    [junit] Tests run: 18, Failures: 0, Errors: 0, Skipped: 0, Time elapsed: 0.095 sec
    [junit] Running org.apache.poi.xssf.usermodel.TestXSSFRow
    [junit] Tests run: 16, Failures: 0, Errors: 0, Skipped: 0, Time elapsed: 0.347 sec
    [junit] Running org.apache.poi.xssf.usermodel.TestXSSFShape
    [junit] Tests run: 2, Failures: 0, Errors: 0, Skipped: 0, Time elapsed: 0.058 sec
    [junit] Running org.apache.poi.xssf.usermodel.TestXSSFSheet
    [junit] Tests run: 95, Failures: 0, Errors: 0, Skipped: 0, Time elapsed: 4.092 sec
    [junit] Running org.apache.poi.xssf.usermodel.TestXSSFSheetAutosizeColumn
    [junit] Tests run: 7, Failures: 0, Errors: 0, Skipped: 0, Time elapsed: 0.112 sec
    [junit] Running org.apache.poi.xssf.usermodel.TestXSSFSheetMergeRegions
    [junit] Tests run: 1, Failures: 0, Errors: 0, Skipped: 0, Time elapsed: 0.79 sec
    [junit] Running org.apache.poi.xssf.usermodel.TestXSSFSheetRowGrouping
    [junit] Tests run: 6, Failures: 0, Errors: 0, Skipped: 0, Time elapsed: 0.213 sec
    [junit] Running org.apache.poi.xssf.usermodel.TestXSSFSheetShiftColumns
    [junit] Tests run: 10, Failures: 0, Errors: 0, Skipped: 0, Time elapsed: 0.133 sec
    [junit] Running org.apache.poi.xssf.usermodel.TestXSSFSheetShiftRows
    [junit] Tests run: 34, Failures: 0, Errors: 0, Skipped: 3, Time elapsed: 28.06 sec
    [junit] Running org.apache.poi.xssf.usermodel.TestXSSFSheetShiftRowsAndColumns
    [junit] Tests run: 5, Failures: 0, Errors: 0, Skipped: 2, Time elapsed: 0.073 sec
    [junit] Running org.apache.poi.xssf.usermodel.TestXSSFSheetUpdateArrayFormulas
    [junit] Tests run: 18, Failures: 0, Errors: 0, Skipped: 1, Time elapsed: 0.173 sec
    [junit] Running org.apache.poi.xssf.usermodel.TestXSSFSimpleShape
    [junit] Tests run: 1, Failures: 0, Errors: 0, Skipped: 0, Time elapsed: 0.024 sec
    [junit] Running org.apache.poi.xssf.usermodel.TestXSSFTable
    [junit] Tests run: 29, Failures: 0, Errors: 0, Skipped: 0, Time elapsed: 0.504 sec
    [junit] Running org.apache.poi.xssf.usermodel.TestXSSFTableColumn
    [junit] Tests run: 3, Failures: 0, Errors: 0, Skipped: 0, Time elapsed: 0.073 sec
    [junit] Running org.apache.poi.xssf.usermodel.TestXSSFTextParagraph
    [junit] Tests run: 1, Failures: 0, Errors: 0, Skipped: 0, Time elapsed: 0.019 sec
    [junit] Running org.apache.poi.xssf.usermodel.TestXSSFTextRun
    [junit] Tests run: 1, Failures: 0, Errors: 0, Skipped: 0, Time elapsed: 0.009 sec
    [junit] Running org.apache.poi.xssf.usermodel.TestXSSFUnicodeSurrogates
    [junit] Tests run: 1, Failures: 0, Errors: 0, Skipped: 0, Time elapsed: 0.03 sec
    [junit] Running org.apache.poi.xssf.usermodel.TestXSSFVMLDrawing
    [junit] Tests run: 4, Failures: 0, Errors: 0, Skipped: 0, Time elapsed: 0.152 sec
    [junit] Running org.apache.poi.xssf.usermodel.TestXSSFWorkbook
    [junit] Tests run: 62, Failures: 0, Errors: 0, Skipped: 0, Time elapsed: 1.385 sec
    [junit] Running org.apache.poi.xssf.usermodel.charts.TestXSSFCategoryAxis
    [junit] Tests run: 1, Failures: 0, Errors: 0, Skipped: 0, Time elapsed: 0.013 sec
    [junit] Running org.apache.poi.xssf.usermodel.charts.TestXSSFChartAxis
    [junit] Tests run: 8, Failures: 0, Errors: 0, Skipped: 0, Time elapsed: 0.062 sec
    [junit] Running org.apache.poi.xssf.usermodel.charts.TestXSSFChartLegend
    [junit] Tests run: 3, Failures: 0, Errors: 0, Skipped: 0, Time elapsed: 0.027 sec
    [junit] Running org.apache.poi.xssf.usermodel.charts.TestXSSFChartTitle
    [junit] Tests run: 4, Failures: 0, Errors: 0, Skipped: 0, Time elapsed: 0.055 sec
    [junit] Running org.apache.poi.xssf.usermodel.charts.TestXSSFDateAxis
    [junit] Tests run: 1, Failures: 0, Errors: 0, Skipped: 0, Time elapsed: 0.009 sec
    [junit] Running org.apache.poi.xssf.usermodel.charts.TestXSSFLineChartData
    [junit] Tests run: 1, Failures: 0, Errors: 0, Skipped: 0, Time elapsed: 0.011 sec
    [junit] Running org.apache.poi.xssf.usermodel.charts.TestXSSFManualLayout
    [junit] Tests run: 2, Failures: 0, Errors: 0, Skipped: 0, Time elapsed: 0.015 sec
    [junit] Running org.apache.poi.xssf.usermodel.charts.TestXSSFScatterChartData
    [junit] Tests run: 1, Failures: 0, Errors: 0, Skipped: 0, Time elapsed: 0.006 sec
    [junit] Running org.apache.poi.xssf.usermodel.charts.TestXSSFValueAxis
    [junit] Tests run: 1, Failures: 0, Errors: 0, Skipped: 0, Time elapsed: 0.01 sec
    [junit] Running org.apache.poi.xssf.usermodel.extensions.TestXSSFBorder
    [junit] Tests run: 1, Failures: 0, Errors: 0, Skipped: 0, Time elapsed: 0.006 sec
    [junit] Running org.apache.poi.xssf.usermodel.extensions.TestXSSFCellFill
    [junit] Tests run: 6, Failures: 0, Errors: 0, Skipped: 0, Time elapsed: 0.045 sec
    [junit] Running org.apache.poi.xssf.usermodel.extensions.TestXSSFHeaderFooter
    [junit] Tests run: 10, Failures: 0, Errors: 0, Skipped: 0, Time elapsed: 0.06 sec
    [junit] Running org.apache.poi.xssf.usermodel.extensions.TestXSSFSheetComments
    [junit] Tests run: 1, Failures: 0, Errors: 0, Skipped: 0, Time elapsed: 0.005 sec
    [junit] Running org.apache.poi.xssf.usermodel.helpers.TestColumnHelper
    [junit] Tests run: 16, Failures: 0, Errors: 0, Skipped: 0, Time elapsed: 0.102 sec
    [junit] Running org.apache.poi.xssf.usermodel.helpers.TestHeaderFooterHelper
    [junit] Tests run: 2, Failures: 0, Errors: 0, Skipped: 0, Time elapsed: 0.011 sec
    [junit] Running org.apache.poi.xssf.usermodel.helpers.TestXSSFColumnShifting
    [junit] Tests run: 2, Failures: 0, Errors: 0, Skipped: 0, Time elapsed: 0.013 sec
    [junit] Running org.apache.poi.xssf.util.TestCTColComparator
    [junit] Tests run: 2, Failures: 0, Errors: 0, Skipped: 0, Time elapsed: 0.011 sec
    [junit] Running org.apache.poi.xssf.util.TestEvilUnclosedBRFixingInputStream
    [junit] Tests run: 3, Failures: 0, Errors: 0, Skipped: 0, Time elapsed: 0.015 sec
    [junit] Running org.apache.poi.xssf.util.TestNumericRanges
    [junit] Tests run: 2, Failures: 0, Errors: 0, Skipped: 0, Time elapsed: 0.01 sec
    [junit] Running org.apache.poi.xwpf.TestAllExtendedProperties
    [junit] Tests run: 1, Failures: 0, Errors: 0, Skipped: 0, Time elapsed: 0.034 sec
    [junit] Running org.apache.poi.xwpf.TestDocumentProtection
    [junit] Tests run: 10, Failures: 0, Errors: 0, Skipped: 0, Time elapsed: 0.446 sec
    [junit] Running org.apache.poi.xwpf.TestNecessaryOOXMLClasses
    [junit] Tests run: 1, Failures: 0, Errors: 0, Skipped: 0, Time elapsed: 0.019 sec
    [junit] Running org.apache.poi.xwpf.TestPackageCorePropertiesGetKeywords
    [junit] Tests run: 1, Failures: 0, Errors: 0, Skipped: 0, Time elapsed: 0.019 sec
    [junit] Running org.apache.poi.xwpf.TestXWPFBugs
    [junit] Tests run: 4, Failures: 0, Errors: 0, Skipped: 1, Time elapsed: 0.172 sec
    [junit] Running org.apache.poi.xwpf.extractor.TestExternalEntities
    [junit] Tests run: 1, Failures: 0, Errors: 0, Skipped: 0, Time elapsed: 0.015 sec
    [junit] Running org.apache.poi.xwpf.extractor.TestXWPFWordExtractor
    [junit] Tests run: 23, Failures: 0, Errors: 0, Skipped: 0, Time elapsed: 0.818 sec
    [junit] Running org.apache.poi.xwpf.model.TestXWPFDecorators
    [junit] Tests run: 2, Failures: 0, Errors: 0, Skipped: 0, Time elapsed: 0.081 sec
    [junit] Running org.apache.poi.xwpf.model.TestXWPFHeaderFooterPolicy
    [junit] Tests run: 3, Failures: 0, Errors: 0, Skipped: 0, Time elapsed: 0.205 sec
    [junit] Running org.apache.poi.xwpf.usermodel.TestChangeTracking
    [junit] Tests run: 3, Failures: 0, Errors: 0, Skipped: 0, Time elapsed: 0.066 sec
    [junit] Running org.apache.poi.xwpf.usermodel.TestXWPFBugs
    [junit] Tests run: 9, Failures: 0, Errors: 0, Skipped: 0, Time elapsed: 0.283 sec
    [junit] Running org.apache.poi.xwpf.usermodel.TestXWPFChart
    [junit] Tests run: 4, Failures: 0, Errors: 0, Skipped: 0, Time elapsed: 0.072 sec
    [junit] Running org.apache.poi.xwpf.usermodel.TestXWPFComment
    [junit] Tests run: 1, Failures: 0, Errors: 0, Skipped: 0, Time elapsed: 0.016 sec
    [junit] Running org.apache.poi.xwpf.usermodel.TestXWPFDocument
    [junit] Tests run: 21, Failures: 0, Errors: 0, Skipped: 1, Time elapsed: 0.476 sec
    [junit] Running org.apache.poi.xwpf.usermodel.TestXWPFEndnote
    [junit] Tests run: 4, Failures: 0, Errors: 0, Skipped: 0, Time elapsed: 0.041 sec
    [junit] Running org.apache.poi.xwpf.usermodel.TestXWPFEndnotes
    [junit] Tests run: 2, Failures: 0, Errors: 0, Skipped: 0, Time elapsed: 0.021 sec
    [junit] Running org.apache.poi.xwpf.usermodel.TestXWPFFootnote
    [junit] Tests run: 4, Failures: 0, Errors: 0, Skipped: 0, Time elapsed: 0.037 sec
    [junit] Running org.apache.poi.xwpf.usermodel.TestXWPFFootnotes
    [junit] Tests run: 3, Failures: 0, Errors: 0, Skipped: 0, Time elapsed: 0.044 sec
    [junit] Running org.apache.poi.xwpf.usermodel.TestXWPFHeader
    [junit] Tests run: 9, Failures: 0, Errors: 0, Skipped: 0, Time elapsed: 0.18 sec
    [junit] Running org.apache.poi.xwpf.usermodel.TestXWPFHeadings
    [junit] Tests run: 1, Failures: 0, Errors: 0, Skipped: 0, Time elapsed: 0.06 sec
    [junit] Running org.apache.poi.xwpf.usermodel.TestXWPFNumbering
    [junit] Tests run: 6, Failures: 0, Errors: 0, Skipped: 0, Time elapsed: 0.12 sec
    [junit] Running org.apache.poi.xwpf.usermodel.TestXWPFParagraph
    [junit] Tests run: 23, Failures: 0, Errors: 0, Skipped: 0, Time elapsed: 0.305 sec
    [junit] Running org.apache.poi.xwpf.usermodel.TestXWPFPictureData
    [junit] Tests run: 5, Failures: 0, Errors: 0, Skipped: 0, Time elapsed: 0.22 sec
    [junit] Running org.apache.poi.xwpf.usermodel.TestXWPFRun
    [junit] Tests run: 33, Failures: 0, Errors: 0, Skipped: 0, Time elapsed: 0.34 sec
    [junit] Running org.apache.poi.xwpf.usermodel.TestXWPFSDT
    [junit] Tests run: 6, Failures: 0, Errors: 0, Skipped: 0, Time elapsed: 0.104 sec
    [junit] Running org.apache.poi.xwpf.usermodel.TestXWPFSmartTag
    [junit] Tests run: 1, Failures: 0, Errors: 0, Skipped: 0, Time elapsed: 0.02 sec
    [junit] Running org.apache.poi.xwpf.usermodel.TestXWPFStyles
    [junit] Tests run: 10, Failures: 0, Errors: 0, Skipped: 0, Time elapsed: 0.164 sec
    [junit] Running org.apache.poi.xwpf.usermodel.TestXWPFTable
    [junit] Tests run: 17, Failures: 0, Errors: 0, Skipped: 0, Time elapsed: 0.202 sec
    [junit] Running org.apache.poi.xwpf.usermodel.TestXWPFTableCell
    [junit] Tests run: 6, Failures: 0, Errors: 0, Skipped: 1, Time elapsed: 0.058 sec
    [junit] Running org.apache.poi.xwpf.usermodel.TestXWPFTableRow
    [junit] Tests run: 6, Failures: 0, Errors: 0, Skipped: 0, Time elapsed: 0.058 sec
[jacoco:coverage] Enhancing junit with coverage
    [junit] Running org.apache.poi.poifs.crypt.TestSignatureInfo
    [junit] Tests run: 14, Failures: 0, Errors: 0, Skipped: 1, Time elapsed: 9.479 sec

testcoveragereport:
    [mkdir] Created dir: <https://builds.apache.org/job/POI-DSL-Windows-1.8/ws/build\coverage>
[jacoco:report] Loading execution data file <https://builds.apache.org/job/POI-DSL-Windows-1.8/ws/build\jacoco-excelant.exec>
[jacoco:report] Loading execution data file <https://builds.apache.org/job/POI-DSL-Windows-1.8/ws/build\jacoco-integration.exec>
[jacoco:report] Loading execution data file <https://builds.apache.org/job/POI-DSL-Windows-1.8/ws/build\jacoco-main.exec>
[jacoco:report] Loading execution data file <https://builds.apache.org/job/POI-DSL-Windows-1.8/ws/build\jacoco-ooxml-lite-xmlsec.exec>
[jacoco:report] Loading execution data file <https://builds.apache.org/job/POI-DSL-Windows-1.8/ws/build\jacoco-ooxml-lite.exec>
[jacoco:report] Loading execution data file <https://builds.apache.org/job/POI-DSL-Windows-1.8/ws/build\jacoco-ooxml-xmlsec.exec>
[jacoco:report] Loading execution data file <https://builds.apache.org/job/POI-DSL-Windows-1.8/ws/build\jacoco-ooxml.exec>
[jacoco:report] Loading execution data file <https://builds.apache.org/job/POI-DSL-Windows-1.8/ws/build\jacoco-scratchpad.exec>

BUILD FAILED
<https://builds.apache.org/job/POI-DSL-Windows-1.8/ws/build.xml>:1425: java.lang.NoSuchMethodError: org.objectweb.asm.tree.InsnList.iterator()Ljava/util/Iterator;
        at org.jacoco.core.internal.analysis.MethodAnalyzer.accept(MethodAnalyzer.java:50)
        at org.jacoco.core.internal.analysis.ClassAnalyzer$1.accept(ClassAnalyzer.java:107)
        at org.jacoco.core.internal.flow.ClassProbesAdapter$2.visitEnd(ClassProbesAdapter.java:91)
        at org.objectweb.asm.ClassReader.readMethod(ClassReader.java:1279)
        at org.objectweb.asm.ClassReader.accept(ClassReader.java:679)
        at org.objectweb.asm.ClassReader.accept(ClassReader.java:391)
        at org.jacoco.core.analysis.Analyzer.analyzeClass(Analyzer.java:116)
        at org.jacoco.core.analysis.Analyzer.analyzeClass(Analyzer.java:132)
        at org.jacoco.core.analysis.Analyzer.analyzeClass(Analyzer.java:157)
        at org.jacoco.core.analysis.Analyzer.analyzeAll(Analyzer.java:193)
        at org.jacoco.ant.ReportTask.createBundle(ReportTask.java:573)
        at org.jacoco.ant.ReportTask.createReport(ReportTask.java:545)
        at org.jacoco.ant.ReportTask.createReport(ReportTask.java:558)
        at org.jacoco.ant.ReportTask.execute(ReportTask.java:496)
        at org.apache.tools.ant.UnknownElement.execute(UnknownElement.java:293)
        at sun.reflect.GeneratedMethodAccessor4.invoke(Unknown Source)
        at sun.reflect.DelegatingMethodAccessorImpl.invoke(DelegatingMethodAccessorImpl.java:43)
        at java.lang.reflect.Method.invoke(Method.java:498)
        at org.apache.tools.ant.dispatch.DispatchUtils.execute(DispatchUtils.java:106)
        at org.apache.tools.ant.Task.perform(Task.java:352)
        at org.apache.tools.ant.Target.execute(Target.java:437)
        at org.apache.tools.ant.Target.performTasks(Target.java:458)
        at org.apache.tools.ant.Project.executeSortedTargets(Project.java:1406)
        at org.apache.tools.ant.Project.executeTarget(Project.java:1377)
        at org.apache.tools.ant.helper.DefaultExecutor.executeTargets(DefaultExecutor.java:41)
        at org.apache.tools.ant.Project.executeTargets(Project.java:1261)
        at org.apache.tools.ant.Main.runBuild(Main.java:857)
        at org.apache.tools.ant.Main.startAnt(Main.java:236)
        at org.apache.tools.ant.launch.Launcher.run(Launcher.java:287)
        at org.apache.tools.ant.launch.Launcher.main(Launcher.java:112)

Total time: 33 minutes 50 seconds
Build step 'Invoke Ant' marked build as failure
Skipping publisher since build result is FAILURE
Archiving artifacts
[Fast Archiver] Compressed 61.17 MB of artifacts by 58.7% relative to #521
Skipping publisher since build result is FAILURE
Recording test results

---------------------------------------------------------------------
To unsubscribe, e-mail: [hidden email]
For additional commands, e-mail: [hidden email]

Reply | Threaded
Open this post in threaded view
|

Jenkins build is back to normal : POI-DSL-Windows-1.8 #523

Apache Jenkins Server
See <https://builds.apache.org/job/POI-DSL-Windows-1.8/523/display/redirect?page=changes>


---------------------------------------------------------------------
To unsubscribe, e-mail: [hidden email]
For additional commands, e-mail: [hidden email]