Build failed in Jenkins: POI-DSL-Windows-1.8 #124

classic Classic list List threaded Threaded
3 messages Options
Reply | Threaded
Open this post in threaded view
|

Build failed in Jenkins: POI-DSL-Windows-1.8 #124

Apache Jenkins Server
See <https://builds.apache.org/job/POI-DSL-Windows-1.8/124/display/redirect?page=changes>

Changes:

[fanningpj] [bug-62038] add mockito based unit test

------------------------------------------
[...truncated 1.44 KB...]
No changes for https://svn.apache.org/repos/asf/poi/site/src/documentation since the previous build
No changes for https://svn.apache.org/repos/asf/poi/site/forrest.properties since the previous build
[POI-DSL-Windows-1.8] $ cmd /c call C:\Users\jenkins\AppData\Local\Temp\1\jenkins1839008408133418590.bat
    X   forrest.properties
X       src\documentation

Performing status on external item at 'src\documentation':
Java-Home: f:\\jenkins\\tools\\java\\latest1.8
 Volume in drive F is data
 Volume Serial Number is B868-5A84

 Directory of f:\jenkins\tools\java\latest1.8

10/30/2017  03:48 PM    <DIR>          .
10/30/2017  03:48 PM    <DIR>          ..
10/30/2017  03:48 PM    <DIR>          bin
10/30/2017  03:48 PM    <DIR>          db
10/30/2017  03:48 PM    <DIR>          include
10/30/2017  03:48 PM         5,202,881 javafx-src.zip
10/30/2017  03:48 PM    <DIR>          jre
10/30/2017  03:48 PM    <DIR>          lib
10/30/2017  03:48 PM                40 LICENSE
10/30/2017  03:48 PM               159 README.html
10/30/2017  03:48 PM               426 release
10/30/2017  03:48 PM            63,933 THIRDPARTYLICENSEREADME-JAVAFX.txt
10/30/2017  03:48 PM           145,180 THIRDPARTYLICENSEREADME.txt
               6 File(s)      5,412,619 bytes
               7 Dir(s)  139,558,903,808 bytes free
java version "1.8.0_152"
Java(TM) SE Runtime Environment (build 1.8.0_152-b16)
Java HotSpot(TM) 64-Bit Server VM (build 25.152-b16, mixed mode)
[POI-DSL-Windows-1.8] $ cmd.exe /C "F:\jenkins\tools\ant\apache-ant-1.9.9\bin\ant.bat -Dcoverage.enabled=true clean jenkins && exit %%ERRORLEVEL%%"
Buildfile: <https://builds.apache.org/job/POI-DSL-Windows-1.8/ws/build.xml>

clean:
   [delete] Deleting directory <https://builds.apache.org/job/POI-DSL-Windows-1.8/ws/build>

check-jars:

fetch-jars:
      [get] Destination already exists (skipping): <https://builds.apache.org/job/POI-DSL-Windows-1.8/ws/lib\commons-logging-1.2.jar>
      [get] Destination already exists (skipping): <https://builds.apache.org/job/POI-DSL-Windows-1.8/ws/lib\commons-codec-1.11.jar>
      [get] Destination already exists (skipping): <https://builds.apache.org/job/POI-DSL-Windows-1.8/ws/lib\log4j-1.2.17.jar>
      [get] Destination already exists (skipping): <https://builds.apache.org/job/POI-DSL-Windows-1.8/ws/lib\junit-4.12.jar>
      [get] Destination already exists (skipping): <https://builds.apache.org/job/POI-DSL-Windows-1.8/ws/lib\jmh-core-1.19.jar>
      [get] Destination already exists (skipping): <https://builds.apache.org/job/POI-DSL-Windows-1.8/ws/lib\jmh-generator-annprocess-1.19.jar>
      [get] Destination already exists (skipping): <https://builds.apache.org/job/POI-DSL-Windows-1.8/ws/lib\hamcrest-core-1.3.jar>
      [get] Getting: https://repo1.maven.org/maven2/org/mockito/mockito-core/2.13.0/mockito-core-2.13.0.jar
      [get] To: <https://builds.apache.org/job/POI-DSL-Windows-1.8/ws/lib\mockito-core-2.13.0.jar>
      [get] Destination already exists (skipping): <https://builds.apache.org/job/POI-DSL-Windows-1.8/ws/lib\ant-1.10.1.jar>
      [get] Destination already exists (skipping): <https://builds.apache.org/job/POI-DSL-Windows-1.8/ws/lib\ant-launcher-1.10.1.jar>
      [get] Destination already exists (skipping): <https://builds.apache.org/job/POI-DSL-Windows-1.8/ws/lib\asm-all-5.2.jar>
      [get] Destination already exists (skipping): <https://builds.apache.org/job/POI-DSL-Windows-1.8/ws/lib\jacoco-0.7.9.zip>
      [get] Destination already exists (skipping): <https://builds.apache.org/job/POI-DSL-Windows-1.8/ws/lib\commons-collections4-4.1.jar>
      [get] Destination already exists (skipping): <https://builds.apache.org/job/POI-DSL-Windows-1.8/ws/lib\commons-math3-3.6.1.jar>
    [unzip] Expanding: <https://builds.apache.org/job/POI-DSL-Windows-1.8/ws/lib\jacoco-0.7.9.zip> into <https://builds.apache.org/job/POI-DSL-Windows-1.8/ws/>
      [get] Destination already exists (skipping): <https://builds.apache.org/job/POI-DSL-Windows-1.8/ws/lib\apache-rat-0.12.jar>
      [get] Destination already exists (skipping): <https://builds.apache.org/job/POI-DSL-Windows-1.8/ws/lib\forbiddenapis-2.3.jar>
      [get] Destination already exists (skipping): <https://builds.apache.org/job/POI-DSL-Windows-1.8/ws/compile-lib\bcprov-ext-jdk15on-1.59.jar>
      [get] Destination already exists (skipping): <https://builds.apache.org/job/POI-DSL-Windows-1.8/ws/compile-lib\bcpkix-jdk15on-1.59.jar>
      [get] Destination already exists (skipping): <https://builds.apache.org/job/POI-DSL-Windows-1.8/ws/compile-lib\xmlsec-2.1.0.jar>
      [get] Destination already exists (skipping): <https://builds.apache.org/job/POI-DSL-Windows-1.8/ws/compile-lib\slf4j-api-1.7.25.jar>

check-ooxml-jars:

fetch-ooxml-jars:

init:
    [mkdir] Created dir: <https://builds.apache.org/job/POI-DSL-Windows-1.8/ws/build>
    [mkdir] Created dir: <https://builds.apache.org/job/POI-DSL-Windows-1.8/ws/build\classes>
    [mkdir] Created dir: <https://builds.apache.org/job/POI-DSL-Windows-1.8/ws/build\test-classes>
    [mkdir] Created dir: <https://builds.apache.org/job/POI-DSL-Windows-1.8/ws/build\test-results>
    [mkdir] Created dir: <https://builds.apache.org/job/POI-DSL-Windows-1.8/ws/build\scratchpad-classes>
    [mkdir] Created dir: <https://builds.apache.org/job/POI-DSL-Windows-1.8/ws/build\scratchpad-test-classes>
    [mkdir] Created dir: <https://builds.apache.org/job/POI-DSL-Windows-1.8/ws/build\scratchpad-test-results>
    [mkdir] Created dir: <https://builds.apache.org/job/POI-DSL-Windows-1.8/ws/build\geometry-java>
    [mkdir] Created dir: <https://builds.apache.org/job/POI-DSL-Windows-1.8/ws/build\ooxml-classes>
    [mkdir] Created dir: <https://builds.apache.org/job/POI-DSL-Windows-1.8/ws/build\ooxml-test-classes>
    [mkdir] Created dir: <https://builds.apache.org/job/POI-DSL-Windows-1.8/ws/build\ooxml-test-results>
    [mkdir] Created dir: <https://builds.apache.org/job/POI-DSL-Windows-1.8/ws/build\excelant-classes>
    [mkdir] Created dir: <https://builds.apache.org/job/POI-DSL-Windows-1.8/ws/build\excelant-test-classes>
    [mkdir] Created dir: <https://builds.apache.org/job/POI-DSL-Windows-1.8/ws/build\excelant-test-results>
    [mkdir] Created dir: <https://builds.apache.org/job/POI-DSL-Windows-1.8/ws/build\examples-classes>
    [mkdir] Created dir: <https://builds.apache.org/job/POI-DSL-Windows-1.8/ws/build\integration-test-classes>
    [mkdir] Created dir: <https://builds.apache.org/job/POI-DSL-Windows-1.8/ws/build\integration-test-results>
    [mkdir] Created dir: <https://builds.apache.org/job/POI-DSL-Windows-1.8/ws/build\dist>
    [mkdir] Created dir: <https://builds.apache.org/job/POI-DSL-Windows-1.8/ws/build\tmp\site\build\site>
     [echo] Using Ant: Apache Ant(TM) version 1.9.9 compiled on February 2 2017 from F:\\jenkins\\tools\\ant\\apache-ant-1.9.9, Ant detected Java 1.8 (may be different than actual Java sometimes...)
     [echo] Using Java: 1.8.0_152/1.8.0_152-b16/25.152-b16/Java HotSpot(TM) 64-Bit Server VM from Oracle Corporation on Windows Server 2012 R2: 6.3

compile-main:
    [javac] Compiling 1212 source files to <https://builds.apache.org/job/POI-DSL-Windows-1.8/ws/build\classes>
    [javac] Note: Some input files use or override a deprecated API.
    [javac] Note: Recompile with -Xlint:deprecation for details.
    [javac] Note: Some input files use unchecked or unsafe operations.
    [javac] Note: Recompile with -Xlint:unchecked for details.
    [javac] Compiling 540 source files to <https://builds.apache.org/job/POI-DSL-Windows-1.8/ws/build\test-classes>
    [javac] Note: Some input files use or override a deprecated API.
    [javac] Note: Recompile with -Xlint:deprecation for details.
     [copy] Copying 4 files to <https://builds.apache.org/job/POI-DSL-Windows-1.8/ws/build\classes>

check-ooxml-xsds:

fetch-ooxml-xsds:

generate-geometry:

compile-scratchpad:
    [javac] Compiling 488 source files to <https://builds.apache.org/job/POI-DSL-Windows-1.8/ws/build\scratchpad-classes>
    [javac] Note: Some input files use or override a deprecated API.
    [javac] Note: Recompile with -Xlint:deprecation for details.
    [javac] Compiling 190 source files to <https://builds.apache.org/job/POI-DSL-Windows-1.8/ws/build\scratchpad-test-classes>
    [javac] Note: Some input files use or override a deprecated API.
    [javac] Note: Recompile with -Xlint:deprecation for details.
     [copy] Copying 2 files to <https://builds.apache.org/job/POI-DSL-Windows-1.8/ws/build\scratchpad-classes>

check-compiled-ooxml-xsds:

compile-ooxml-xsds:

compile-ooxml:
    [javac] Compiling 539 source files to <https://builds.apache.org/job/POI-DSL-Windows-1.8/ws/build\ooxml-classes>
    [javac] Note: Some input files use or override a deprecated API.
    [javac] Note: Recompile with -Xlint:deprecation for details.
    [javac] Compiling 248 source files to <https://builds.apache.org/job/POI-DSL-Windows-1.8/ws/build\ooxml-test-classes>
    [javac] Note: Some input files use or override a deprecated API.
    [javac] Note: Recompile with -Xlint:deprecation for details.
     [copy] Copying 3 files to <https://builds.apache.org/job/POI-DSL-Windows-1.8/ws/build\ooxml-classes>

compile-examples:
    [javac] Compiling 151 source files to <https://builds.apache.org/job/POI-DSL-Windows-1.8/ws/build\examples-classes>
    [javac] Note: <https://builds.apache.org/job/POI-DSL-Windows-1.8/ws/src\examples\src\org\apache\poi\xssf\eventusermodel\examples\FromHowTo.java> uses or overrides a deprecated API.
    [javac] Note: Recompile with -Xlint:deprecation for details.
     [copy] Copying 1 file to <https://builds.apache.org/job/POI-DSL-Windows-1.8/ws/build\examples-classes>

compile-excelant:
    [javac] Compiling 14 source files to <https://builds.apache.org/job/POI-DSL-Windows-1.8/ws/build\excelant-classes>
    [javac] Compiling 13 source files to <https://builds.apache.org/job/POI-DSL-Windows-1.8/ws/build\excelant-test-classes>
     [copy] Copying 1 file to <https://builds.apache.org/job/POI-DSL-Windows-1.8/ws/build\excelant-classes>

compile:

-compile-ooxml-lite-check:

compile-ooxml-lite:
     [echo] Running ooxml-lite generator
    [mkdir] Created dir: <https://builds.apache.org/job/POI-DSL-Windows-1.8/ws/build\ooxml-lite-merged>
      [jar] Building jar: <https://builds.apache.org/job/POI-DSL-Windows-1.8/ws/build\ooxml-lite-merged\ooxml-lite-merged.jar>
     [java] Collecting unit tests from <https://builds.apache.org/job/POI-DSL-Windows-1.8/ws/build\ooxml-test-classes>
     [java] Class org.apache.poi.benchmark.generated.AddImageBench_jmhType does not derive from TestCase and does not have a @Test annotation
     [java] Inner class org.apache.poi.dev.TestOOXMLLister$1.class not included
     [java] Inner class org.apache.poi.dev.TestOOXMLPrettyPrint$1.class not included
     [java] Inner class org.apache.poi.sl.TestOleShape$1.class not included
     [java] Inner class org.apache.poi.sl.TestOleShape$Api.class not included
     [java] Inner class org.apache.poi.TestPOIXMLDocument$1.class not included
     [java] Inner class org.apache.poi.TestPOIXMLDocument$UncaughtHandler.class not included
     [java] Inner class org.apache.poi.xssf.usermodel.TestMatrixFormulasFromXMLSpreadsheet$1.class not included
     [java] Inner class org.apache.poi.xssf.usermodel.TestMatrixFormulasFromXMLSpreadsheet$Navigator.class not included
     [java] Found 225 classes
     [java] SLF4J: Failed to load class "org.slf4j.impl.StaticLoggerBinder".
     [java] SLF4J: Defaulting to no-operation (NOP) logger implementation
     [java] SLF4J: See http://www.slf4j.org/codes.html#StaticLoggerBinder for further details.
     [java] ...III.........................................I.........................I........................................I.......................................................................I...........................I.................................................................................................................................I.......................................I.............................................................................................................................E.....................I..........................................................I......................................................................................................................................................................................................................I..I..I.I.....................................................................................................................................................................................................................................................................................................................................................................................................................................................................................................................................................III.I..I.......I.......I.....I..............................................................................I......II...........I.I........................I.........I.....I................................................................................................................................I...........................................................................................................................I.I...I...................................................................................................................................................................................................................................................................................................................................................I............................................................................................................................................................I.................................................................................................................I......
     [java] Time: 126.73
     [java] There was 1 failure:
     [java] 1) testCopyNullFontSize(org.apache.poi.xslf.usermodel.TestXSLFTextRun)
     [java] java.lang.IllegalStateException: Could not initialize plugin: interface org.mockito.plugins.MockMaker
     [java] at org.mockito.internal.configuration.plugins.PluginLoader$1.invoke(PluginLoader.java:60)
     [java] at com.sun.proxy.$Proxy36.isTypeMockable(Unknown Source)
     [java] at org.mockito.internal.util.MockUtil.typeMockabilityOf(MockUtil.java:29)
     [java] at org.mockito.internal.util.MockCreationValidator.validateType(MockCreationValidator.java:22)
     [java] at org.mockito.internal.creation.MockSettingsImpl.validatedSettings(MockSettingsImpl.java:232)
     [java] at org.mockito.internal.creation.MockSettingsImpl.build(MockSettingsImpl.java:226)
     [java] at org.mockito.internal.MockitoCore.mock(MockitoCore.java:64)
     [java] at org.mockito.Mockito.mock(Mockito.java:1821)
     [java] at org.mockito.Mockito.mock(Mockito.java:1734)
     [java] at org.apache.poi.xslf.usermodel.TestXSLFTextRun.testCopyNullFontSize(TestXSLFTextRun.java:109)
     [java] at sun.reflect.NativeMethodAccessorImpl.invoke0(Native Method)
     [java] at sun.reflect.NativeMethodAccessorImpl.invoke(NativeMethodAccessorImpl.java:62)
     [java] at sun.reflect.DelegatingMethodAccessorImpl.invoke(DelegatingMethodAccessorImpl.java:43)
     [java] at java.lang.reflect.Method.invoke(Method.java:498)
     [java] at org.junit.runners.model.FrameworkMethod$1.runReflectiveCall(FrameworkMethod.java:50)
     [java] at org.junit.internal.runners.model.ReflectiveCallable.run(ReflectiveCallable.java:12)
     [java] at org.junit.runners.model.FrameworkMethod.invokeExplosively(FrameworkMethod.java:47)
     [java] at org.junit.internal.runners.statements.InvokeMethod.evaluate(InvokeMethod.java:17)
     [java] at org.junit.runners.ParentRunner.runLeaf(ParentRunner.java:325)
     [java] at org.junit.runners.BlockJUnit4ClassRunner.runChild(BlockJUnit4ClassRunner.java:78)
     [java] at org.junit.runners.BlockJUnit4ClassRunner.runChild(BlockJUnit4ClassRunner.java:57)
     [java] at org.junit.runners.ParentRunner$3.run(ParentRunner.java:290)
     [java] at org.junit.runners.ParentRunner$1.schedule(ParentRunner.java:71)
     [java] at org.junit.runners.ParentRunner.runChildren(ParentRunner.java:288)
     [java] at org.junit.runners.ParentRunner.access$000(ParentRunner.java:58)
     [java] at org.junit.runners.ParentRunner$2.evaluate(ParentRunner.java:268)
     [java] at org.junit.runners.ParentRunner.run(ParentRunner.java:363)
     [java] at org.junit.runners.Suite.runChild(Suite.java:128)
     [java] at org.junit.runners.Suite.runChild(Suite.java:27)
     [java] at org.junit.runners.ParentRunner$3.run(ParentRunner.java:290)
     [java] at org.junit.runners.ParentRunner$1.schedule(ParentRunner.java:71)
     [java] at org.junit.runners.ParentRunner.runChildren(ParentRunner.java:288)
     [java] at org.junit.runners.ParentRunner.access$000(ParentRunner.java:58)
     [java] at org.junit.runners.ParentRunner$2.evaluate(ParentRunner.java:268)
     [java] at org.junit.runners.ParentRunner.run(ParentRunner.java:363)
     [java] at org.junit.runner.JUnitCore.run(JUnitCore.java:137)
     [java] at org.junit.runner.JUnitCore.run(JUnitCore.java:115)
     [java] at org.junit.runner.JUnitCore.run(JUnitCore.java:105)
     [java] at org.junit.runner.JUnitCore.run(JUnitCore.java:94)
     [java] at org.apache.poi.util.OOXMLLite.build(OOXMLLite.java:149)
     [java] at org.apache.poi.util.OOXMLLite.main(OOXMLLite.java:94)
     [java] Caused by: java.lang.NoClassDefFoundError: net/bytebuddy/dynamic/loading/ClassLoadingStrategy
     [java] at org.mockito.internal.creation.bytebuddy.SubclassByteBuddyMockMaker.<init>(SubclassByteBuddyMockMaker.java:33)
     [java] at org.mockito.internal.creation.bytebuddy.ByteBuddyMockMaker.<init>(ByteBuddyMockMaker.java:21)
     [java] at sun.reflect.NativeConstructorAccessorImpl.newInstance0(Native Method)
     [java] at sun.reflect.NativeConstructorAccessorImpl.newInstance(NativeConstructorAccessorImpl.java:62)
     [java] at sun.reflect.DelegatingConstructorAccessorImpl.newInstance(DelegatingConstructorAccessorImpl.java:45)
     [java] at java.lang.reflect.Constructor.newInstance(Constructor.java:423)
     [java] at java.lang.Class.newInstance(Class.java:442)
     [java] at org.mockito.internal.configuration.plugins.DefaultMockitoPlugins.create(DefaultMockitoPlugins.java:57)
     [java] at org.mockito.internal.configuration.plugins.DefaultMockitoPlugins.getDefaultPlugin(DefaultMockitoPlugins.java:35)
     [java] at org.mockito.internal.configuration.plugins.PluginLoader.loadPlugin(PluginLoader.java:53)
     [java] at org.mockito.internal.configuration.plugins.PluginRegistry.<init>(PluginRegistry.java:20)
     [java] at org.mockito.internal.configuration.plugins.Plugins.<clinit>(Plugins.java:18)
     [java] at org.mockito.internal.util.MockUtil.<clinit>(MockUtil.java:24)
     [java] ... 38 more
     [java] Caused by: java.lang.ClassNotFoundException: net.bytebuddy.dynamic.loading.ClassLoadingStrategy
     [java] at java.net.URLClassLoader.findClass(URLClassLoader.java:381)
     [java] at java.lang.ClassLoader.loadClass(ClassLoader.java:424)
     [java] at sun.misc.Launcher$AppClassLoader.loadClass(Launcher.java:338)
     [java] at java.lang.ClassLoader.loadClass(ClassLoader.java:357)
     [java] ... 51 more
     [java]
     [java] FAILURES!!!
     [java] Tests run: 2356,  Failures: 1
     [java]
     [java] Exception in thread "main" java.lang.RuntimeException: Tests did not succeed, cannot build ooxml-lite jar
     [java] at org.apache.poi.util.OOXMLLite.build(OOXMLLite.java:151)
     [java] at org.apache.poi.util.OOXMLLite.main(OOXMLLite.java:94)

BUILD FAILED
<https://builds.apache.org/job/POI-DSL-Windows-1.8/ws/build.xml>:1523: Java returned: 1

Total time: 3 minutes 36 seconds
Build step 'Invoke Ant' marked build as failure
Skipping publisher since build result is FAILURE
Archiving artifacts
[Fast Archiver] Compressed 63.95 MB of artifacts by 100.0% relative to #123
Skipping publisher since build result is FAILURE
Recording test results
ERROR: Step ‘Publish JUnit test result report’ failed: No test report files were found. Configuration error?


---------------------------------------------------------------------
To unsubscribe, e-mail: [hidden email]
For additional commands, e-mail: [hidden email]

Reply | Threaded
Open this post in threaded view
|

Build failed in Jenkins: POI-DSL-Windows-1.8 #125

Apache Jenkins Server
See <https://builds.apache.org/job/POI-DSL-Windows-1.8/125/display/redirect?page=changes>

Changes:

[fanningpj] use spaces for indents in some files

[fanningpj] [bug-55713] Wrong ErrorStyle for DataValidations. Thanks to Philemon Schucker. This closes #95

[fanningpj] add missing licenses to source code

[fanningpj] [github-81] Formula adjusting in context of column shifting. Thanks to Dragan Jovanović. This closes #81

[fanningpj] add byte-buddy and objenesis dependencies for mockito

------------------------------------------
[...truncated 584.08 KB...]
  [javadoc]        &lt;color theme="1" />
  [javadoc]                             ^
  [javadoc] <https://builds.apache.org/job/POI-DSL-Windows-1.8/ws/src\ooxml\java\org\apache\poi\xssf\eventusermodel\ReadOnlySharedStringsTable.java>:66: error: bad use of '>'
  [javadoc]        &lt;rFont val="Calibri" />
  [javadoc]                                 ^
  [javadoc] <https://builds.apache.org/job/POI-DSL-Windows-1.8/ws/src\ooxml\java\org\apache\poi\xssf\eventusermodel\ReadOnlySharedStringsTable.java>:67: error: bad use of '>'
  [javadoc]        &lt;family val="2" />
  [javadoc]                            ^
  [javadoc] <https://builds.apache.org/job/POI-DSL-Windows-1.8/ws/src\ooxml\java\org\apache\poi\xssf\eventusermodel\ReadOnlySharedStringsTable.java>:68: error: bad use of '>'
  [javadoc]        &lt;scheme val="minor" />
  [javadoc]                                ^
  [javadoc] <https://builds.apache.org/job/POI-DSL-Windows-1.8/ws/src\ooxml\java\org\apache\poi\xssf\eventusermodel\ReadOnlySharedStringsTable.java>:69: error: bad use of '>'
  [javadoc]      &lt;/rPr>
  [javadoc]              ^
  [javadoc] <https://builds.apache.org/job/POI-DSL-Windows-1.8/ws/src\ooxml\java\org\apache\poi\xssf\eventusermodel\ReadOnlySharedStringsTable.java>:70: error: bad use of '>'
  [javadoc]      &lt;t xml:space="preserve">Causes Problems&lt;/t>
  [javadoc]                                ^
  [javadoc] <https://builds.apache.org/job/POI-DSL-Windows-1.8/ws/src\ooxml\java\org\apache\poi\xssf\eventusermodel\ReadOnlySharedStringsTable.java>:70: error: bad use of '>'
  [javadoc]      &lt;t xml:space="preserve">Causes Problems&lt;/t>
  [javadoc]                                                      ^
  [javadoc] <https://builds.apache.org/job/POI-DSL-Windows-1.8/ws/src\ooxml\java\org\apache\poi\xssf\eventusermodel\ReadOnlySharedStringsTable.java>:71: error: bad use of '>'
  [javadoc]    &lt;/r>
  [javadoc]          ^
  [javadoc] <https://builds.apache.org/job/POI-DSL-Windows-1.8/ws/src\ooxml\java\org\apache\poi\xssf\eventusermodel\ReadOnlySharedStringsTable.java>:72: error: bad use of '>'
  [javadoc]  &lt;/si>
  [javadoc]         ^
  [javadoc] <https://builds.apache.org/job/POI-DSL-Windows-1.8/ws/src\ooxml\java\org\apache\poi\xssf\eventusermodel\ReadOnlySharedStringsTable.java>:73: error: bad use of '>'
  [javadoc]  &lt;si>
  [javadoc]        ^
  [javadoc] <https://builds.apache.org/job/POI-DSL-Windows-1.8/ws/src\ooxml\java\org\apache\poi\xssf\eventusermodel\ReadOnlySharedStringsTable.java>:74: error: bad use of '>'
  [javadoc]    &lt;t>This does not&lt;/t>
  [javadoc]         ^
  [javadoc] <https://builds.apache.org/job/POI-DSL-Windows-1.8/ws/src\ooxml\java\org\apache\poi\xssf\eventusermodel\ReadOnlySharedStringsTable.java>:74: error: bad use of '>'
  [javadoc]    &lt;t>This does not&lt;/t>
  [javadoc]                             ^
  [javadoc] <https://builds.apache.org/job/POI-DSL-Windows-1.8/ws/src\ooxml\java\org\apache\poi\xssf\eventusermodel\ReadOnlySharedStringsTable.java>:75: error: bad use of '>'
  [javadoc]  &lt;/si>
  [javadoc]         ^
  [javadoc] <https://builds.apache.org/job/POI-DSL-Windows-1.8/ws/src\ooxml\java\org\apache\poi\xssf\eventusermodel\ReadOnlySharedStringsTable.java>:76: error: bad use of '>'
  [javadoc] &lt;/sst>
  [javadoc]         ^
  [javadoc] <https://builds.apache.org/job/POI-DSL-Windows-1.8/ws/src\ooxml\java\org\apache\poi\xssf\extractor\XSSFImportFromXML.java>:86: error: exception not thrown: javax.xml.parsers.ParserConfigurationException
  [javadoc]      * @throws ParserConfigurationException if there are problems with XML parser configuration
  [javadoc]                ^
  [javadoc] <https://builds.apache.org/job/POI-DSL-Windows-1.8/ws/src\ooxml\java\org\apache\poi\xssf\model\StylesTable.java>:92: error: malformed HTML
  [javadoc]      * @throws IllegalArgumentException if <code>num</code> < 0
  [javadoc]                                                             ^
  [javadoc] <https://builds.apache.org/job/POI-DSL-Windows-1.8/ws/src\ooxml\java\org\apache\poi\xssf\model\StylesTable.java>:93: error: malformed HTML
  [javadoc]      * @throws IllegalStateException if <code>num</code> < current number of data formats in the style table.
  [javadoc]                                                          ^
  [javadoc] <https://builds.apache.org/job/POI-DSL-Windows-1.8/ws/src\ooxml\java\org\apache\poi\xssf\streaming\SXSSFRow.java>:118: error: malformed HTML
  [javadoc]      * @throws IllegalArgumentException if columnIndex < 0 or greater than the maximum number of supported columns
  [javadoc]                                                        ^
  [javadoc] <https://builds.apache.org/job/POI-DSL-Windows-1.8/ws/src\ooxml\java\org\apache\poi\xssf\streaming\SXSSFRow.java>:135: error: malformed HTML
  [javadoc]      * @throws IllegalArgumentException if columnIndex < 0 or greater than a maximum number of supported columns
  [javadoc]                                                        ^
  [javadoc] <https://builds.apache.org/job/POI-DSL-Windows-1.8/ws/src\ooxml\java\org\apache\poi\xssf\streaming\SXSSFRow.java>:193: error: malformed HTML
  [javadoc]      * @throws IllegalArgumentException if rowNum < 0
  [javadoc]                                                   ^
  [javadoc] <https://builds.apache.org/job/POI-DSL-Windows-1.8/ws/src\ooxml\java\org\apache\poi\xssf\streaming\SXSSFRow.java>:232: error: malformed HTML
  [javadoc]      * @throws IllegalArgumentException if cellnum < 0 or the specified MissingCellPolicy is invalid
  [javadoc]                                                    ^
  [javadoc] <https://builds.apache.org/job/POI-DSL-Windows-1.8/ws/src\ooxml\java\org\apache\poi\xssf\usermodel\XSSFColor.java>:255: error: unknown tag: clrScheme
  [javadoc]      * Index into the <clrScheme> collection, referencing a particular <sysClr> or
  [javadoc]                       ^
  [javadoc] <https://builds.apache.org/job/POI-DSL-Windows-1.8/ws/src\ooxml\java\org\apache\poi\xssf\usermodel\XSSFColor.java>:255: error: unknown tag: sysClr
  [javadoc]      * Index into the <clrScheme> collection, referencing a particular <sysClr> or
  [javadoc]                                                                        ^
  [javadoc] <https://builds.apache.org/job/POI-DSL-Windows-1.8/ws/src\ooxml\java\org\apache\poi\xssf\usermodel\XSSFColor.java>:256: error: unknown tag: srgbClr
  [javadoc]      *  <srgbClr> value expressed in the Theme part.
  [javadoc]         ^
  [javadoc] <https://builds.apache.org/job/POI-DSL-Windows-1.8/ws/src\ooxml\java\org\apache\poi\xssf\usermodel\XSSFColor.java>:264: error: unknown tag: clrScheme
  [javadoc]      * Index into the <clrScheme> collection, referencing a particular <sysClr> or
  [javadoc]                       ^
  [javadoc] <https://builds.apache.org/job/POI-DSL-Windows-1.8/ws/src\ooxml\java\org\apache\poi\xssf\usermodel\XSSFColor.java>:264: error: unknown tag: sysClr
  [javadoc]      * Index into the <clrScheme> collection, referencing a particular <sysClr> or
  [javadoc]                                                                        ^
  [javadoc] <https://builds.apache.org/job/POI-DSL-Windows-1.8/ws/src\ooxml\java\org\apache\poi\xssf\usermodel\XSSFColor.java>:265: error: unknown tag: srgbClr
  [javadoc]      *  <srgbClr> value expressed in the Theme part.
  [javadoc]         ^
  [javadoc] <https://builds.apache.org/job/POI-DSL-Windows-1.8/ws/src\ooxml\java\org\apache\poi\xssf\usermodel\XSSFDxfStyleProvider.java>:42: error: bad use of '>'
  [javadoc]      * @param stripeSize 0 for non-stripe styles, > 1 for stripes
  [javadoc]                                                   ^
  [javadoc] <https://builds.apache.org/job/POI-DSL-Windows-1.8/ws/src\ooxml\java\org\apache\poi\xssf\usermodel\XSSFName.java>:146: error: tag not allowed here: <blockquote>
  [javadoc]      * <pre><blockquote>
  [javadoc]             ^
  [javadoc] <https://builds.apache.org/job/POI-DSL-Windows-1.8/ws/src\ooxml\java\org\apache\poi\xssf\usermodel\XSSFName.java>:165: error: unexpected end tag: </p>
  [javadoc]     * </p>
  [javadoc]       ^
  [javadoc] <https://builds.apache.org/job/POI-DSL-Windows-1.8/ws/src\ooxml\java\org\apache\poi\xssf\usermodel\XSSFName.java>:36: error: tag not allowed here: <blockquote>
  [javadoc]  * <pre><blockquote>
  [javadoc]         ^
  [javadoc] <https://builds.apache.org/job/POI-DSL-Windows-1.8/ws/src\ooxml\java\org\apache\poi\xssf\usermodel\XSSFName.java>:86: error: tag not allowed here: <li>
  [javadoc]      * <li> this defined name refers to a range to which an advanced filter has been
  [javadoc]        ^
  [javadoc] <https://builds.apache.org/job/POI-DSL-Windows-1.8/ws/src\ooxml\java\org\apache\poi\xssf\usermodel\XSSFName.java>:88: error: tag not allowed here: <li>
  [javadoc]      * <li> This defined name refers to a range to which an AutoFilter has been
  [javadoc]        ^
  [javadoc] <https://builds.apache.org/job/POI-DSL-Windows-1.8/ws/src\ooxml\java\org\apache\poi\xssf\usermodel\XSSFRichTextString.java>:431: error: bad use of '>'
  [javadoc]      * CTRPrElt --> CTFont adapter
  [javadoc]                   ^
  [javadoc] <https://builds.apache.org/job/POI-DSL-Windows-1.8/ws/src\ooxml\java\org\apache\poi\xssf\usermodel\XSSFRow.java>:104: error: unknown tag: Cell
  [javadoc]      * for (Iterator<Cell> it = row.cellIterator(); it.hasNext(); ) {
  [javadoc]                     ^
  [javadoc] <https://builds.apache.org/job/POI-DSL-Windows-1.8/ws/src\ooxml\java\org\apache\poi\xssf\usermodel\XSSFRow.java>:191: error: malformed HTML
  [javadoc]      * @throws IllegalArgumentException if columnIndex < 0 or greater than 16384,
  [javadoc]                                                        ^
  [javadoc] <https://builds.apache.org/job/POI-DSL-Windows-1.8/ws/src\ooxml\java\org\apache\poi\xssf\usermodel\XSSFRow.java>:205: error: malformed HTML
  [javadoc]      * @throws IllegalArgumentException if the specified cell type is invalid, columnIndex < 0
  [javadoc]                                                                                            ^
  [javadoc] <https://builds.apache.org/job/POI-DSL-Windows-1.8/ws/src\ooxml\java\org\apache\poi\xssf\usermodel\XSSFRow.java>:378: error: malformed HTML
  [javadoc]      * @throws IllegalArgumentException if rowNum < 0 or greater than 1048575
  [javadoc]                                                   ^
  [javadoc] <https://builds.apache.org/job/POI-DSL-Windows-1.8/ws/src\ooxml\java\org\apache\poi\xssf\usermodel\XSSFRow.java>:644: error: @param name not found
  [javadoc]      * @param startColumn the column to start shifting
  [javadoc]               ^
  [javadoc] <https://builds.apache.org/job/POI-DSL-Windows-1.8/ws/src\ooxml\java\org\apache\poi\xssf\usermodel\XSSFRow.java>:645: error: @param name not found
  [javadoc]      * @param endColumn the column to end shifting
  [javadoc]               ^
  [javadoc] <https://builds.apache.org/job/POI-DSL-Windows-1.8/ws/src\ooxml\java\org\apache\poi\xssf\usermodel\XSSFRow.java>:667: error: @param name not found
  [javadoc]      * @param startColumn the column to start shifting
  [javadoc]               ^
  [javadoc] <https://builds.apache.org/job/POI-DSL-Windows-1.8/ws/src\ooxml\java\org\apache\poi\xssf\usermodel\XSSFRow.java>:668: error: @param name not found
  [javadoc]      * @param endColumn the column to end shifting
  [javadoc]               ^
  [javadoc] <https://builds.apache.org/job/POI-DSL-Windows-1.8/ws/src\ooxml\java\org\apache\poi\xssf\usermodel\XSSFSheetConditionalFormatting.java>:70: error: unexpected end tag: </p>
  [javadoc]      * </p>
  [javadoc]        ^
  [javadoc] <https://builds.apache.org/job/POI-DSL-Windows-1.8/ws/src\ooxml\java\org\apache\poi\xssf\usermodel\XSSFWorkbook.java>:829: error: unexpected end tag: </p>
  [javadoc]      * </p>
  [javadoc]        ^
  [javadoc] <https://builds.apache.org/job/POI-DSL-Windows-1.8/ws/src\ooxml\java\org\apache\poi\xssf\usermodel\XSSFWorkbook.java>:846: error: unexpected end tag: </p>
  [javadoc]      * </p>
  [javadoc]        ^
  [javadoc] <https://builds.apache.org/job/POI-DSL-Windows-1.8/ws/src\ooxml\java\org\apache\poi\xssf\usermodel\extensions\XSSFHeaderFooter.java>:40: error: semicolon missing
  [javadoc]  * section), and the date on the second line (center section). &CCenter
  [javadoc]                                                                ^
  [javadoc] <https://builds.apache.org/job/POI-DSL-Windows-1.8/ws/src\ooxml\java\org\apache\poi\xssf\usermodel\extensions\XSSFHeaderFooter.java>:41: error: bad HTML entity
  [javadoc]  * &"-,Bold"Bold &"-,Regular"Header_x000A_&D
  [javadoc]    ^
  [javadoc] <https://builds.apache.org/job/POI-DSL-Windows-1.8/ws/src\ooxml\java\org\apache\poi\xssf\usermodel\extensions\XSSFHeaderFooter.java>:41: error: bad HTML entity
  [javadoc]  * &"-,Bold"Bold &"-,Regular"Header_x000A_&D
  [javadoc]                  ^
  [javadoc] <https://builds.apache.org/job/POI-DSL-Windows-1.8/ws/src\ooxml\java\org\apache\poi\xssf\usermodel\extensions\XSSFHeaderFooter.java>:41: error: semicolon missing
  [javadoc]  * &"-,Bold"Bold &"-,Regular"Header_x000A_&D
  [javadoc]                                           ^
  [javadoc] <https://builds.apache.org/job/POI-DSL-Windows-1.8/ws/src\ooxml\java\org\apache\poi\xssf\usermodel\extensions\XSSFHeaderFooter.java>:48: error: semicolon missing
  [javadoc]  * <dt>&L</dt>
  [javadoc]        ^
  [javadoc] <https://builds.apache.org/job/POI-DSL-Windows-1.8/ws/src\ooxml\java\org\apache\poi\xssf\usermodel\extensions\XSSFHeaderFooter.java>:53: error: semicolon missing
  [javadoc]  * <dt>&P</dt>
  [javadoc]        ^
  [javadoc] <https://builds.apache.org/job/POI-DSL-Windows-1.8/ws/src\ooxml\java\org\apache\poi\xssf\usermodel\extensions\XSSFHeaderFooter.java>:55: error: semicolon missing
  [javadoc]  * <dt>&N</dt>
  [javadoc]        ^
  [javadoc] 100 errors
  [javadoc] 100 warnings
      [jar] Building jar: <https://builds.apache.org/job/POI-DSL-Windows-1.8/ws/build\dist\maven\poi-ooxml\poi-ooxml-4.0.0-SNAPSHOT-javadoc.jar>

assemble:
      [zip] Building zip: <https://builds.apache.org/job/POI-DSL-Windows-1.8/ws/build\dist\poi-bin-4.0.0-SNAPSHOT-20180131.zip>
      [tar] Building tar: <https://builds.apache.org/job/POI-DSL-Windows-1.8/ws/build\dist\poi-bin-4.0.0-SNAPSHOT-20180131.tar.gz>
      [zip] Building zip: <https://builds.apache.org/job/POI-DSL-Windows-1.8/ws/build\dist\poi-src-4.0.0-SNAPSHOT-20180131.zip>
      [tar] Building tar: <https://builds.apache.org/job/POI-DSL-Windows-1.8/ws/build\dist\poi-src-4.0.0-SNAPSHOT-20180131.tar.gz>
     [echo] Creating Maven POMs

maven-poms:
     [copy] Copying 6 files to <https://builds.apache.org/job/POI-DSL-Windows-1.8/ws/build\dist\maven>
     [echo] Maven POMs are located in <https://builds.apache.org/job/POI-DSL-Windows-1.8/ws/build\dist>
     [echo] Use ant dist-nexus to deploy the artifacts in the remote repository
     [echo] Distribution located in <https://builds.apache.org/job/POI-DSL-Windows-1.8/ws/build\dist>
     [echo] Use "ant dist-checksum" to create md5/sha1/sha512 checksums and GPG signatures

findbugs:
      [get] Destination already exists (skipping): <https://builds.apache.org/job/POI-DSL-Windows-1.8/ws/lib\findbugs-noUpdateChecks-3.0.1.zip>
    [unzip] Expanding: <https://builds.apache.org/job/POI-DSL-Windows-1.8/ws/lib\findbugs-noUpdateChecks-3.0.1.zip> into <https://builds.apache.org/job/POI-DSL-Windows-1.8/ws/build\findbugs>
 [findbugs] Executing findbugs FindBugsTask from ant task
 [findbugs] Running FindBugs...
 [findbugs] Warnings generated: 55
 [findbugs] Calculating exit code...
 [findbugs] Setting 'bugs found' flag (1)
 [findbugs] Exit code set to: 1
 [findbugs] Java Result: 1
 [findbugs] Output saved to build/findbugs.xml
     [xslt] Transforming into <https://builds.apache.org/job/POI-DSL-Windows-1.8/ws/build>
     [xslt] Processing <https://builds.apache.org/job/POI-DSL-Windows-1.8/ws/build\findbugs.xml> to <https://builds.apache.org/job/POI-DSL-Windows-1.8/ws/build\findbugs.html>
     [xslt] Loading stylesheet jar:<https://builds.apache.org/job/POI-DSL-Windows-1.8/ws/build/findbugs/lib/findbugs.jar!/fancy-hist.xsl>

release-notes:
     [copy] Copying 1 file to <https://builds.apache.org/job/POI-DSL-Windows-1.8/ws/build\dist>

rat-check:
    [mkdir] Created dir: <https://builds.apache.org/job/POI-DSL-Windows-1.8/ws/build\rat>
     [echo]
     [echo] *****************************************************
     [echo] Summary
     [echo] -------
     [echo] Generated at: 2018-01-31T00:41:44+00:00
     [echo]
     [echo] Notes: 1
     [echo] Binaries: 120
     [echo] Archives: 0
     [echo] Standards: 3745
     [echo]
     [echo] Apache Licensed: 3745
     [echo] Generated Documents: 0
     [echo]
     [echo] JavaDocs are generated, thus a license header is optional.
     [echo] Generated files do not require license headers.
     [echo]
     [echo] 0 Unknown Licenses
     [echo]
     [echo] *****************************************************
     [echo]   Files with Apache License headers will be marked AL
     [echo]   Binary files (which do not require any license headers) will be marked B
     [echo]   Compressed archives will be marked A
     [echo]   Notices, licenses etc. will be marked N
     [echo]  
     [echo] *****************************************************

forbidden-apis-check:
[forbiddenapis] Reading bundled API signatures: jdk-unsafe-1.8
[forbiddenapis] Reading bundled API signatures: jdk-deprecated-1.8
[forbiddenapis] Reading bundled API signatures: jdk-internal-1.8
[forbiddenapis] Reading bundled API signatures: jdk-non-portable
[forbiddenapis] Reading bundled API signatures: jdk-reflection
[forbiddenapis] Reading API signatures: <https://builds.apache.org/job/POI-DSL-Windows-1.8/ws/src\resources\devtools\forbidden-signatures.txt>
[forbiddenapis] Loading classes to check...
[forbiddenapis] Scanning classes for violations...
[forbiddenapis] Forbidden method invocation: java.lang.String#format(java.lang.String,java.lang.Object[]) [Uses default locale]
[forbiddenapis]   in org.apache.poi.hssf.usermodel.HSSFRow (HSSFRow.java:732)
[forbiddenapis] Forbidden method invocation: java.lang.String#format(java.lang.String,java.lang.Object[]) [Uses default locale]
[forbiddenapis]   in org.apache.poi.hssf.usermodel.HSSFRow (HSSFRow.java:760)
[forbiddenapis] Forbidden method invocation: java.lang.String#format(java.lang.String,java.lang.Object[]) [Uses default locale]
[forbiddenapis]   in org.apache.poi.xssf.usermodel.XSSFRow (XSSFRow.java:653)
[forbiddenapis] Forbidden method invocation: java.lang.String#format(java.lang.String,java.lang.Object[]) [Uses default locale]
[forbiddenapis]   in org.apache.poi.xssf.usermodel.XSSFRow (XSSFRow.java:676)
[forbiddenapis] Scanned 4154 (and 1932 related) class file(s) for forbidden API invocations (in 8.95s), 4 error(s).

BUILD FAILED
<https://builds.apache.org/job/POI-DSL-Windows-1.8/ws/build.xml>:2104: Check for forbidden API calls failed, see log.

Total time: 22 minutes 12 seconds
Build step 'Invoke Ant' marked build as failure
Skipping publisher since build result is FAILURE
Archiving artifacts
[Fast Archiver] Compressed 235.58 MB of artifacts by 53.0% relative to #123
Skipping publisher since build result is FAILURE
Recording test results

---------------------------------------------------------------------
To unsubscribe, e-mail: [hidden email]
For additional commands, e-mail: [hidden email]

Reply | Threaded
Open this post in threaded view
|

Jenkins build is back to normal : POI-DSL-Windows-1.8 #126

Apache Jenkins Server
See <https://builds.apache.org/job/POI-DSL-Windows-1.8/126/display/redirect?page=changes>


---------------------------------------------------------------------
To unsubscribe, e-mail: [hidden email]
For additional commands, e-mail: [hidden email]