Build failed in Jenkins: POI-DSL-Windows-1.8 #122

classic Classic list List threaded Threaded
2 messages Options
Reply | Threaded
Open this post in threaded view
|

Build failed in Jenkins: POI-DSL-Windows-1.8 #122

Apache Jenkins Server
See <https://builds.apache.org/job/POI-DSL-Windows-1.8/122/display/redirect?page=changes>

Changes:

[fanningpj] [github-90] change default DSIG algorithm to SHA256. Thanks to Jörn Franke. This closes #90

[fanningpj] add gradle wrapper

[fanningpj] bouncycastle 1.59

[fanningpj] bouncycastle 1.59

------------------------------------------
[...truncated 149.76 KB...]
    [junit] Running org.apache.poi.xssf.usermodel.TestXSSFFormulaParser
    [junit] Tests run: 12, Failures: 0, Errors: 0, Skipped: 0, Time elapsed: 0.061 sec
    [junit] Running org.apache.poi.xssf.usermodel.TestXSSFHeaderFooterProperties
    [junit] Tests run: 8, Failures: 0, Errors: 0, Skipped: 0, Time elapsed: 0.018 sec
    [junit] Running org.apache.poi.xssf.usermodel.TestXSSFHyperlink
    [junit] Tests run: 12, Failures: 0, Errors: 0, Skipped: 0, Time elapsed: 0.169 sec
    [junit] Running org.apache.poi.xssf.usermodel.TestXSSFName
    [junit] Tests run: 26, Failures: 0, Errors: 0, Skipped: 0, Time elapsed: 0.062 sec
    [junit] Running org.apache.poi.xssf.usermodel.TestXSSFOddFooter
    [junit] Tests run: 1, Failures: 0, Errors: 0, Skipped: 0, Time elapsed: 0.004 sec
    [junit] Running org.apache.poi.xssf.usermodel.TestXSSFOddHeader
    [junit] Tests run: 1, Failures: 0, Errors: 0, Skipped: 0, Time elapsed: 0.005 sec
    [junit] Running org.apache.poi.xssf.usermodel.TestXSSFPicture
    [junit] Tests run: 6, Failures: 0, Errors: 0, Skipped: 0, Time elapsed: 0.056 sec
    [junit] Running org.apache.poi.xssf.usermodel.TestXSSFPictureData
    [junit] Tests run: 3, Failures: 0, Errors: 0, Skipped: 0, Time elapsed: 0.089 sec
    [junit] Running org.apache.poi.xssf.usermodel.TestXSSFPivotTableName
    [junit] Tests run: 18, Failures: 0, Errors: 0, Skipped: 0, Time elapsed: 0.413 sec
    [junit] Running org.apache.poi.xssf.usermodel.TestXSSFPivotTableRef
    [junit] Tests run: 18, Failures: 0, Errors: 0, Skipped: 0, Time elapsed: 0.307 sec
    [junit] Running org.apache.poi.xssf.usermodel.TestXSSFPrintSetup
    [junit] Tests run: 18, Failures: 0, Errors: 0, Skipped: 0, Time elapsed: 0.017 sec
    [junit] Running org.apache.poi.xssf.usermodel.TestXSSFRichTextString
    [junit] Tests run: 18, Failures: 0, Errors: 0, Skipped: 0, Time elapsed: 0.019 sec
    [junit] Running org.apache.poi.xssf.usermodel.TestXSSFRow
    [junit] Tests run: 13, Failures: 0, Errors: 0, Skipped: 0, Time elapsed: 3.181 sec
    [junit] Running org.apache.poi.xssf.usermodel.TestXSSFShape
    [junit] Tests run: 2, Failures: 0, Errors: 0, Skipped: 0, Time elapsed: 0.036 sec
    [junit] Running org.apache.poi.xssf.usermodel.TestXSSFSheet
    [junit] Tests run: 95, Failures: 0, Errors: 0, Skipped: 0, Time elapsed: 3.858 sec
    [junit] Running org.apache.poi.xssf.usermodel.TestXSSFSheetAutosizeColumn
    [junit] Tests run: 7, Failures: 0, Errors: 0, Skipped: 0, Time elapsed: 0.039 sec
    [junit] Running org.apache.poi.xssf.usermodel.TestXSSFSheetMergeRegions
    [junit] Tests run: 1, Failures: 0, Errors: 0, Skipped: 0, Time elapsed: 1.844 sec
    [junit] Running org.apache.poi.xssf.usermodel.TestXSSFSheetRowGrouping
    [junit] Tests run: 6, Failures: 0, Errors: 0, Skipped: 0, Time elapsed: 0.21 sec
    [junit] Running org.apache.poi.xssf.usermodel.TestXSSFSheetShiftRows
    [junit] Tests run: 34, Failures: 0, Errors: 0, Skipped: 3, Time elapsed: 27.435 sec
    [junit] Running org.apache.poi.xssf.usermodel.TestXSSFSheetUpdateArrayFormulas
    [junit] Tests run: 18, Failures: 0, Errors: 0, Skipped: 1, Time elapsed: 0.051 sec
    [junit] Running org.apache.poi.xssf.usermodel.TestXSSFSimpleShape
    [junit] Tests run: 1, Failures: 0, Errors: 0, Skipped: 0, Time elapsed: 0.016 sec
    [junit] Running org.apache.poi.xssf.usermodel.TestXSSFTable
    [junit] Tests run: 18, Failures: 0, Errors: 0, Skipped: 0, Time elapsed: 0.14 sec
    [junit] Running org.apache.poi.xssf.usermodel.TestXSSFTextParagraph
    [junit] Tests run: 1, Failures: 0, Errors: 0, Skipped: 0, Time elapsed: 0.016 sec
    [junit] Running org.apache.poi.xssf.usermodel.TestXSSFTextRun
    [junit] Tests run: 1, Failures: 0, Errors: 0, Skipped: 0, Time elapsed: 0.007 sec
    [junit] Running org.apache.poi.xssf.usermodel.TestXSSFVMLDrawing
    [junit] Tests run: 4, Failures: 0, Errors: 0, Skipped: 0, Time elapsed: 0.046 sec
    [junit] Running org.apache.poi.xssf.usermodel.TestXSSFWorkbook
    [junit] Tests run: 59, Failures: 0, Errors: 0, Skipped: 0, Time elapsed: 0.515 sec
    [junit] Running org.apache.poi.xssf.usermodel.charts.TestXSSFCategoryAxis
    [junit] Tests run: 1, Failures: 0, Errors: 0, Skipped: 0, Time elapsed: 0.012 sec
    [junit] Running org.apache.poi.xssf.usermodel.charts.TestXSSFChartAxis
    [junit] Tests run: 8, Failures: 0, Errors: 0, Skipped: 0, Time elapsed: 0.015 sec
    [junit] Running org.apache.poi.xssf.usermodel.charts.TestXSSFChartLegend
    [junit] Tests run: 3, Failures: 0, Errors: 0, Skipped: 0, Time elapsed: 0.013 sec
    [junit] Running org.apache.poi.xssf.usermodel.charts.TestXSSFChartTitle
    [junit] Tests run: 4, Failures: 0, Errors: 0, Skipped: 0, Time elapsed: 0.04 sec
    [junit] Running org.apache.poi.xssf.usermodel.charts.TestXSSFDateAxis
    [junit] Tests run: 1, Failures: 0, Errors: 0, Skipped: 0, Time elapsed: 0.013 sec
    [junit] Running org.apache.poi.xssf.usermodel.charts.TestXSSFLineChartData
    [junit] Tests run: 1, Failures: 0, Errors: 0, Skipped: 0, Time elapsed: 0.008 sec
    [junit] Running org.apache.poi.xssf.usermodel.charts.TestXSSFManualLayout
    [junit] Tests run: 2, Failures: 0, Errors: 0, Skipped: 0, Time elapsed: 0.007 sec
    [junit] Running org.apache.poi.xssf.usermodel.charts.TestXSSFScatterChartData
    [junit] Tests run: 1, Failures: 0, Errors: 0, Skipped: 0, Time elapsed: 0.01 sec
    [junit] Running org.apache.poi.xssf.usermodel.charts.TestXSSFValueAxis
    [junit] Tests run: 1, Failures: 0, Errors: 0, Skipped: 0, Time elapsed: 0.013 sec
    [junit] Running org.apache.poi.xssf.usermodel.extensions.TestXSSFBorder
    [junit] Tests run: 1, Failures: 0, Errors: 0, Skipped: 0, Time elapsed: 0.003 sec
    [junit] Running org.apache.poi.xssf.usermodel.extensions.TestXSSFCellFill
    [junit] Tests run: 6, Failures: 0, Errors: 0, Skipped: 0, Time elapsed: 0.017 sec
    [junit] Running org.apache.poi.xssf.usermodel.extensions.TestXSSFHeaderFooter
    [junit] Tests run: 10, Failures: 0, Errors: 0, Skipped: 0, Time elapsed: 0.015 sec
    [junit] Running org.apache.poi.xssf.usermodel.extensions.TestXSSFSheetComments
    [junit] Tests run: 1, Failures: 0, Errors: 0, Skipped: 0, Time elapsed: 0.001 sec
    [junit] Running org.apache.poi.xssf.usermodel.helpers.TestColumnHelper
    [junit] Tests run: 15, Failures: 0, Errors: 0, Skipped: 0, Time elapsed: 0.021 sec
    [junit] Running org.apache.poi.xssf.usermodel.helpers.TestHeaderFooterHelper
    [junit] Tests run: 2, Failures: 0, Errors: 0, Skipped: 0, Time elapsed: 0.002 sec
    [junit] Running org.apache.poi.xssf.util.TestCTColComparator
    [junit] Tests run: 2, Failures: 0, Errors: 0, Skipped: 0, Time elapsed: 0.001 sec
    [junit] Running org.apache.poi.xssf.util.TestEvilUnclosedBRFixingInputStream
    [junit] Tests run: 3, Failures: 0, Errors: 0, Skipped: 0, Time elapsed: 0.003 sec
    [junit] Running org.apache.poi.xssf.util.TestNumericRanges
    [junit] Tests run: 2, Failures: 0, Errors: 0, Skipped: 0, Time elapsed: 0.001 sec
    [junit] Running org.apache.poi.xwpf.TestAllExtendedProperties
    [junit] Tests run: 1, Failures: 0, Errors: 0, Skipped: 0, Time elapsed: 0.028 sec
    [junit] Running org.apache.poi.xwpf.TestDocumentProtection
    [junit] Tests run: 10, Failures: 0, Errors: 0, Skipped: 0, Time elapsed: 0.321 sec
    [junit] Running org.apache.poi.xwpf.TestPackageCorePropertiesGetKeywords
    [junit] Tests run: 1, Failures: 0, Errors: 0, Skipped: 0, Time elapsed: 0.013 sec
    [junit] Running org.apache.poi.xwpf.TestXWPFBugs
    [junit] Tests run: 3, Failures: 0, Errors: 0, Skipped: 1, Time elapsed: 0.143 sec
    [junit] Running org.apache.poi.xwpf.extractor.TestExternalEntities
    [junit] Tests run: 1, Failures: 0, Errors: 0, Skipped: 0, Time elapsed: 0.007 sec
    [junit] Running org.apache.poi.xwpf.extractor.TestXWPFWordExtractor
    [junit] Tests run: 21, Failures: 0, Errors: 0, Skipped: 0, Time elapsed: 0.463 sec
    [junit] Running org.apache.poi.xwpf.model.TestXWPFDecorators
    [junit] Tests run: 2, Failures: 0, Errors: 0, Skipped: 0, Time elapsed: 0.063 sec
    [junit] Running org.apache.poi.xwpf.model.TestXWPFHeaderFooterPolicy
    [junit] Tests run: 3, Failures: 0, Errors: 0, Skipped: 0, Time elapsed: 0.194 sec
    [junit] Running org.apache.poi.xwpf.usermodel.TestChangeTracking
    [junit] Tests run: 3, Failures: 0, Errors: 0, Skipped: 0, Time elapsed: 0.021 sec
    [junit] Running org.apache.poi.xwpf.usermodel.TestXWPFBugs
    [junit] Tests run: 9, Failures: 0, Errors: 0, Skipped: 0, Time elapsed: 0.179 sec
    [junit] Running org.apache.poi.xwpf.usermodel.TestXWPFChart
    [junit] Tests run: 4, Failures: 0, Errors: 0, Skipped: 0, Time elapsed: 0.063 sec
    [junit] Running org.apache.poi.xwpf.usermodel.TestXWPFDocument
    [junit] Tests run: 20, Failures: 0, Errors: 0, Skipped: 1, Time elapsed: 0.16 sec
    [junit] Running org.apache.poi.xwpf.usermodel.TestXWPFFootnotes
    [junit] Tests run: 2, Failures: 0, Errors: 0, Skipped: 0, Time elapsed: 0.018 sec
    [junit] Running org.apache.poi.xwpf.usermodel.TestXWPFHeader
    [junit] Tests run: 9, Failures: 0, Errors: 0, Skipped: 0, Time elapsed: 0.073 sec
    [junit] Running org.apache.poi.xwpf.usermodel.TestXWPFHeadings
    [junit] Tests run: 1, Failures: 0, Errors: 0, Skipped: 0, Time elapsed: 0.043 sec
    [junit] Running org.apache.poi.xwpf.usermodel.TestXWPFNumbering
    [junit] Tests run: 6, Failures: 0, Errors: 0, Skipped: 0, Time elapsed: 0.101 sec
    [junit] Running org.apache.poi.xwpf.usermodel.TestXWPFParagraph
    [junit] Tests run: 23, Failures: 0, Errors: 0, Skipped: 0, Time elapsed: 0.161 sec
    [junit] Running org.apache.poi.xwpf.usermodel.TestXWPFPictureData
    [junit] Tests run: 5, Failures: 0, Errors: 0, Skipped: 0, Time elapsed: 0.072 sec
    [junit] Running org.apache.poi.xwpf.usermodel.TestXWPFRun
    [junit] Tests run: 23, Failures: 0, Errors: 0, Skipped: 0, Time elapsed: 0.119 sec
    [junit] Running org.apache.poi.xwpf.usermodel.TestXWPFSDT
    [junit] Tests run: 5, Failures: 0, Errors: 0, Skipped: 0, Time elapsed: 0.046 sec
    [junit] Running org.apache.poi.xwpf.usermodel.TestXWPFSmartTag
    [junit] Tests run: 1, Failures: 0, Errors: 0, Skipped: 0, Time elapsed: 0.005 sec
    [junit] Running org.apache.poi.xwpf.usermodel.TestXWPFStyles
    [junit] Tests run: 9, Failures: 0, Errors: 0, Skipped: 0, Time elapsed: 0.067 sec
    [junit] Running org.apache.poi.xwpf.usermodel.TestXWPFTable
    [junit] Tests run: 12, Failures: 0, Errors: 0, Skipped: 0, Time elapsed: 0.036 sec
    [junit] Running org.apache.poi.xwpf.usermodel.TestXWPFTableCell
    [junit] Tests run: 5, Failures: 0, Errors: 0, Skipped: 1, Time elapsed: 0.034 sec
    [junit] Running org.apache.poi.xwpf.usermodel.TestXWPFTableRow
    [junit] Tests run: 5, Failures: 0, Errors: 0, Skipped: 0, Time elapsed: 0.021 sec
[jacoco:coverage] Enhancing junit with coverage
    [junit] Running org.apache.poi.poifs.crypt.TestSignatureInfo
    [junit] Tests run: 13, Failures: 0, Errors: 0, Skipped: 1, Time elapsed: 9.161 sec

-test-ooxml-write-testfile:

-test-excelant-check:

test-excelant:
[jacoco:coverage] Enhancing junit with coverage
    [junit] Running org.apache.poi.ss.examples.formula.TestExcelAntUserDefinedFunction
    [junit] Tests run: 2, Failures: 0, Errors: 0, Skipped: 0, Time elapsed: 0.159 sec
    [junit] Running org.apache.poi.ss.excelant.TestBuildFile
    [junit] Tests run: 14, Failures: 0, Errors: 0, Skipped: 0, Time elapsed: 2.042 sec
    [junit] Running org.apache.poi.ss.excelant.TestExcelAntPrecision
    [junit] Tests run: 1, Failures: 0, Errors: 0, Skipped: 0, Time elapsed: 0.002 sec
    [junit] Running org.apache.poi.ss.excelant.TestExcelAntSet
    [junit] Tests run: 2, Failures: 0, Errors: 0, Skipped: 0, Time elapsed: 0.012 sec
    [junit] Running org.apache.poi.ss.excelant.TestExcelAntSetDoubleCell
    [junit] Tests run: 1, Failures: 0, Errors: 0, Skipped: 0, Time elapsed: 0.003 sec
    [junit] Running org.apache.poi.ss.excelant.util.TestExcelAntEvaluationResult
    [junit] Tests run: 4, Failures: 0, Errors: 0, Skipped: 0, Time elapsed: 0.023 sec
    [junit] Running org.apache.poi.ss.excelant.util.TestExcelAntWorkbookUtil
    [junit] Tests run: 23, Failures: 0, Errors: 0, Skipped: 0, Time elapsed: 1.005 sec
    [junit] Running org.apache.poi.ss.excelant.util.TestExcelAntWorkbookUtilFactory
    [junit] Tests run: 2, Failures: 0, Errors: 0, Skipped: 0, Time elapsed: 0.005 sec

-test-excelant-write-testfile:

test:

test-ooxml-lite:
   [delete] Deleting: <https://builds.apache.org/job/POI-DSL-Windows-1.8/ws/build\ooxml-testokfile.txt>
     [echo] Running ooxml tests against 'poi-ooxml-schemas'
[jacoco:coverage] Enhancing junit with coverage
    [junit] Running org.apache.poi.TestDetectAsOOXML
    [junit] Tests run: 3, Failures: 0, Errors: 0, Skipped: 0, Time elapsed: 0.492 sec
    [junit] Running org.apache.poi.TestEmbeded
    [junit] Tests run: 3, Failures: 0, Errors: 0, Skipped: 0, Time elapsed: 1.8 sec
    [junit] Running org.apache.poi.TestPOIXMLDocument
    [junit] Tests run: 10, Failures: 0, Errors: 0, Skipped: 0, Time elapsed: 3.952 sec
    [junit] Running org.apache.poi.TestPOIXMLProperties
    [junit] Tests run: 7, Failures: 0, Errors: 0, Skipped: 1, Time elapsed: 0.22 sec
    [junit] Running org.apache.poi.TestXMLPropertiesTextExtractor
    [junit] Tests run: 5, Failures: 0, Errors: 0, Skipped: 0, Time elapsed: 0.163 sec
    [junit] Running org.apache.poi.dev.TestOOXMLLister
    [junit] Tests run: 2, Failures: 0, Errors: 0, Skipped: 0, Time elapsed: 0.013 sec
    [junit] Running org.apache.poi.dev.TestOOXMLPrettyPrint
    [junit] Tests run: 1, Failures: 0, Errors: 0, Skipped: 0, Time elapsed: 0.036 sec
    [junit] Running org.apache.poi.dev.TestRecordGenerator
    [junit] Tests run: 3, Failures: 0, Errors: 0, Skipped: 3, Time elapsed: 0.003 sec
    [junit] Running org.apache.poi.extractor.TestExtractorFactory
    [junit] Tests run: 11, Failures: 0, Errors: 0, Skipped: 0, Time elapsed: 2.794 sec
    [junit] Running org.apache.poi.openxml4j.opc.TestContentType
    [junit] Tests run: 7, Failures: 0, Errors: 0, Skipped: 0, Time elapsed: 0.018 sec
    [junit] Running org.apache.poi.openxml4j.opc.TestFileHelper
    [junit] Tests run: 1, Failures: 0, Errors: 0, Skipped: 0, Time elapsed: 0.002 sec
    [junit] Running org.apache.poi.openxml4j.opc.TestListParts
    [junit] Tests run: 1, Failures: 0, Errors: 0, Skipped: 0, Time elapsed: 0.004 sec
    [junit] Running org.apache.poi.openxml4j.opc.TestPackage
    [junit] Tests run: 23, Failures: 0, Errors: 0, Skipped: 1, Time elapsed: 0.794 sec
    [junit] Running org.apache.poi.openxml4j.opc.TestPackageCoreProperties
    [junit] Tests run: 7, Failures: 0, Errors: 0, Skipped: 0, Time elapsed: 0.055 sec
    [junit] Running org.apache.poi.openxml4j.opc.TestPackagePartName
    [junit] Tests run: 1, Failures: 0, Errors: 0, Skipped: 0, Time elapsed: 0.002 sec
    [junit] Running org.apache.poi.openxml4j.opc.TestPackageThumbnail
    [junit] Tests run: 1, Failures: 0, Errors: 0, Skipped: 0, Time elapsed: 0.013 sec
    [junit] Running org.apache.poi.openxml4j.opc.TestPackagingURIHelper
    [junit] Tests run: 5, Failures: 0, Errors: 0, Skipped: 0, Time elapsed: 0.003 sec
    [junit] Running org.apache.poi.openxml4j.opc.TestRelationships
    [junit] Tests run: 9, Failures: 0, Errors: 0, Skipped: 0, Time elapsed: 0.05 sec
    [junit] Running org.apache.poi.openxml4j.opc.TestZipPackage
    [junit] Tests run: 8, Failures: 0, Errors: 0, Skipped: 0, Time elapsed: 0.522 sec
    [junit] Running org.apache.poi.openxml4j.opc.compliance.TestOPCComplianceCoreProperties
    [junit] Tests run: 11, Failures: 0, Errors: 0, Skipped: 0, Time elapsed: 0.064 sec
    [junit] Running org.apache.poi.openxml4j.opc.compliance.TestOPCCompliancePackageModel
    [junit] Tests run: 5, Failures: 0, Errors: 0, Skipped: 0, Time elapsed: 0.006 sec
    [junit] Running org.apache.poi.openxml4j.opc.compliance.TestOPCCompliancePartName
    [junit] Tests run: 10, Failures: 0, Errors: 0, Skipped: 0, Time elapsed: 0.005 sec
    [junit] Running org.apache.poi.openxml4j.opc.internal.TestContentTypeManager
    [junit] Tests run: 4, Failures: 0, Errors: 0, Skipped: 2, Time elapsed: 0.009 sec
    [junit] Running org.apache.poi.openxml4j.opc.internal.marshallers.TestZipPackagePropertiesMarshaller
    [junit] Tests run: 4, Failures: 0, Errors: 0, Skipped: 0, Time elapsed: 0.003 sec
    [junit] Running org.apache.poi.poifs.crypt.TestAgileEncryptionParameters
    [junit] Tests run: 60, Failures: 0, Errors: 0, Skipped: 20, Time elapsed: 6.892 sec
    [junit] Running org.apache.poi.poifs.crypt.TestCertificateEncryption
    [junit] Tests run: 1, Failures: 0, Errors: 0, Skipped: 0, Time elapsed: 0.161 sec
    [junit] Running org.apache.poi.poifs.crypt.TestDecryptor
    [junit] Tests run: 7, Failures: 0, Errors: 0, Skipped: 1, Time elapsed: 0.282 sec
    [junit] Running org.apache.poi.poifs.crypt.TestEncryptionInfo
    [junit] Tests run: 2, Failures: 0, Errors: 0, Skipped: 0, Time elapsed: 0.004 sec
    [junit] Running org.apache.poi.poifs.crypt.TestEncryptor
    [junit] Tests run: 6, Failures: 0, Errors: 0, Skipped: 3, Time elapsed: 0.209 sec
    [junit] Running org.apache.poi.poifs.crypt.TestHxxFEncryption
    [junit] Tests run: 20, Failures: 0, Errors: 0, Skipped: 0, Time elapsed: 0.763 sec
    [junit] Running org.apache.poi.poifs.crypt.TestSecureTempZip
    [junit] Tests run: 2, Failures: 0, Errors: 0, Skipped: 1, Time elapsed: 0.068 sec
    [junit] Running org.apache.poi.poifs.crypt.dsig.TestSignatureConfig
    [junit] Tests run: 1, Failures: 0, Errors: 1, Skipped: 0, Time elapsed: 0.023 sec

BUILD FAILED
<https://builds.apache.org/job/POI-DSL-Windows-1.8/ws/build.xml>:1549: The following error occurred while executing this line:
<https://builds.apache.org/job/POI-DSL-Windows-1.8/ws/build.xml>:1375: Tests failed

Total time: 9 minutes 43 seconds
Build step 'Invoke Ant' marked build as failure
Skipping publisher since build result is FAILURE
Archiving artifacts
[Fast Archiver] Compressed 63.95 MB of artifacts by 63.9% relative to #121
Skipping publisher since build result is FAILURE
Recording test results

---------------------------------------------------------------------
To unsubscribe, e-mail: [hidden email]
For additional commands, e-mail: [hidden email]

Reply | Threaded
Open this post in threaded view
|

Jenkins build is back to normal : POI-DSL-Windows-1.8 #123

Apache Jenkins Server
See <https://builds.apache.org/job/POI-DSL-Windows-1.8/123/display/redirect?page=changes>


---------------------------------------------------------------------
To unsubscribe, e-mail: [hidden email]
For additional commands, e-mail: [hidden email]