Build failed in Jenkins: POI-DSL-Windows-1.8 #107

classic Classic list List threaded Threaded
2 messages Options
Reply | Threaded
Open this post in threaded view
|

Build failed in Jenkins: POI-DSL-Windows-1.8 #107

Apache Jenkins Server
See <https://builds.apache.org/job/POI-DSL-Windows-1.8/107/display/redirect?page=changes>

Changes:

[centic] Bug 61665: Enhance SSPerformanceTest some more to add a warmup run and allow to run with unsynchronized XmlBeans

[centic] Bug 61665: Update FAQ for performance test slightly

[centic] Update changelog

[centic] Fix bug 61787, which was introduced by bug 58067: Change how deleted content is detected to not incorrectly see too much text as deleted.

[centic] Bug 61798: Fix usage of getLastCellNum(), unfortunately this is a bit misleading compared to getFirstCellNum()...

[centic] Bug 61911: Avoid IndexOutOfBounds access when reading pictures

[centic] Fix IntelliJ warnings and code formatting, generalize ExcelToHtmlUtils, use try-with-resources, update/enhance JavaDoc somewhat

[gwoolsey] Added a couple missing null checks.

[gwoolsey] Implement DMAX and DSUM functions, following the pattern from DMIN.  

Refactored the D* function enum to have instances return the function implementation instances rather than using a case construct, now that Java 8 is required.

------------------------------------------
[...truncated 940 B...]
A         test-data\document\61911.doc
U         src\scratchpad\src\org\apache\poi\hssf\converter\ExcelToHtmlConverter.java
U         src\scratchpad\src\org\apache\poi\hssf\converter\AbstractExcelUtils.java
U         src\scratchpad\src\org\apache\poi\hssf\converter\ExcelToHtmlUtils.java
U         src\scratchpad\src\org\apache\poi\hwpf\model\StyleSheet.java
U         src\scratchpad\testcases\org\apache\poi\hwpf\usermodel\TestBugs.java
U         src\examples\src\org\apache\poi\ss\examples\SSPerformanceTest.java
U         src\ooxml\java\org\apache\poi\xssf\usermodel\XSSFSheet.java
U         src\ooxml\java\org\apache\poi\xssf\usermodel\XSSFRow.java
U         src\ooxml\java\org\apache\poi\xwpf\usermodel\XWPFHeaderFooter.java
U         src\ooxml\java\org\apache\poi\xwpf\usermodel\XWPFParagraph.java
U         src\ooxml\java\org\apache\poi\xwpf\usermodel\XWPFDocument.java
U         src\ooxml\java\org\apache\poi\xwpf\usermodel\XWPFRun.java
U         src\ooxml\testcases\org\apache\poi\xssf\usermodel\TestXSSFBugs.java
U         src\ooxml\testcases\org\apache\poi\xwpf\usermodel\TestXWPFParagraph.java
U         src\testcases\org\apache\poi\ss\util\TestCellRangeUtil.java
U         src\java\org\apache\poi\util\IOUtils.java
U         src\java\org\apache\poi\ss\formula\eval\FunctionEval.java
U         src\java\org\apache\poi\ss\formula\OperationEvaluatorFactory.java
U         src\java\org\apache\poi\ss\formula\WorkbookEvaluator.java
U         src\java\org\apache\poi\ss\formula\functions\DStarRunner.java
AU        src\java\org\apache\poi\ss\formula\functions\DSum.java
AU        src\java\org\apache\poi\ss\formula\functions\DMax.java
U         src\integrationtest\org\apache\poi\hssf\usermodel\RecordsStresser.java
U         src\integrationtest\org\apache\poi\stress\HSLFFileHandler.java
U         src\integrationtest\org\apache\poi\stress\HSMFFileHandler.java
U         src\integrationtest\org\apache\poi\stress\HPSFFileHandler.java
U         src\integrationtest\org\apache\poi\stress\SlideShowHandler.java
U         src\integrationtest\org\apache\poi\stress\AbstractFileHandler.java
U         src\integrationtest\org\apache\poi\stress\HWPFFileHandler.java
U         src\integrationtest\org\apache\poi\stress\HDGFFileHandler.java
U         src\integrationtest\org\apache\poi\stress\XSLFFileHandler.java
U         src\integrationtest\org\apache\poi\stress\HMEFFileHandler.java
U         src\integrationtest\org\apache\poi\stress\HPBFFileHandler.java
U         src\integrationtest\org\apache\poi\stress\POIFSFileHandler.java
U         src\integrationtest\org\apache\poi\stress\OPCFileHandler.java
U         src\integrationtest\org\apache\poi\stress\XSSFFileHandler.java
U         src\integrationtest\org\apache\poi\stress\XWPFFileHandler.java
U         src\integrationtest\org\apache\poi\stress\XSSFBFileHandler.java
U         src\integrationtest\org\apache\poi\stress\XDGFFileHandler.java
U         src\integrationtest\org\apache\poi\TestAllFiles.java
Fetching 'https://svn.apache.org/repos/asf/poi/site/src/documentation' at -1 into 'F:\jenkins\jenkins-slave\workspace\POI-DSL-Windows-1.8\src\documentation'
U         src\documentation\content\xdocs\faq.xml
U         src\documentation\content\xdocs\status.xml
At revision 1819421

Fetching 'https://svn.apache.org/repos/asf/poi/site/forrest.properties' at -1 into 'F:\jenkins\jenkins-slave\workspace\POI-DSL-Windows-1.8\forrest.properties'
At revision 1819421

At revision 1819421

No changes for https://svn.apache.org/repos/asf/poi/site/forrest.properties since the previous build
[POI-DSL-Windows-1.8] $ cmd /c call C:\Users\jenkins\AppData\Local\Temp\1\jenkins437256660929744467.bat
    X   forrest.properties
X       src\documentation

Performing status on external item at 'src\documentation':
Java-Home: f:\\jenkins\\tools\\java\\latest1.8
 Volume in drive F is data
 Volume Serial Number is B868-5A84

 Directory of f:\jenkins\tools\java\latest1.8

10/30/2017  03:48 PM    <DIR>          .
10/30/2017  03:48 PM    <DIR>          ..
10/30/2017  03:48 PM    <DIR>          bin
09/14/2017  10:15 AM    <DIR>          db
09/14/2017  10:15 AM    <DIR>          include
10/30/2017  03:48 PM         5,202,881 javafx-src.zip
10/30/2017  03:48 PM    <DIR>          jre
10/30/2017  03:48 PM    <DIR>          lib
10/30/2017  03:48 PM                40 LICENSE
10/30/2017  03:48 PM               159 README.html
10/30/2017  03:48 PM               426 release
10/30/2017  03:48 PM            63,933 THIRDPARTYLICENSEREADME-JAVAFX.txt
10/30/2017  03:48 PM           145,180 THIRDPARTYLICENSEREADME.txt
               6 File(s)      5,412,619 bytes
               7 Dir(s)  142,472,355,840 bytes free
java version "1.8.0_152"
Java(TM) SE Runtime Environment (build 1.8.0_152-b16)
Java HotSpot(TM) 64-Bit Server VM (build 25.152-b16, mixed mode)
[POI-DSL-Windows-1.8] $ cmd.exe /C "F:\jenkins\tools\ant\apache-ant-1.9.9\bin\ant.bat -Dcoverage.enabled=true clean jenkins && exit %%ERRORLEVEL%%"
Buildfile: <https://builds.apache.org/job/POI-DSL-Windows-1.8/ws/build.xml>

clean:
   [delete] Deleting directory <https://builds.apache.org/job/POI-DSL-Windows-1.8/ws/build>

check-jars:

fetch-jars:

check-ooxml-jars:

fetch-ooxml-jars:

init:
    [mkdir] Created dir: <https://builds.apache.org/job/POI-DSL-Windows-1.8/ws/build>
    [mkdir] Created dir: <https://builds.apache.org/job/POI-DSL-Windows-1.8/ws/build\classes>
    [mkdir] Created dir: <https://builds.apache.org/job/POI-DSL-Windows-1.8/ws/build\test-classes>
    [mkdir] Created dir: <https://builds.apache.org/job/POI-DSL-Windows-1.8/ws/build\test-results>
    [mkdir] Created dir: <https://builds.apache.org/job/POI-DSL-Windows-1.8/ws/build\scratchpad-classes>
    [mkdir] Created dir: <https://builds.apache.org/job/POI-DSL-Windows-1.8/ws/build\scratchpad-test-classes>
    [mkdir] Created dir: <https://builds.apache.org/job/POI-DSL-Windows-1.8/ws/build\scratchpad-test-results>
    [mkdir] Created dir: <https://builds.apache.org/job/POI-DSL-Windows-1.8/ws/build\geometry-java>
    [mkdir] Created dir: <https://builds.apache.org/job/POI-DSL-Windows-1.8/ws/build\ooxml-classes>
    [mkdir] Created dir: <https://builds.apache.org/job/POI-DSL-Windows-1.8/ws/build\ooxml-test-classes>
    [mkdir] Created dir: <https://builds.apache.org/job/POI-DSL-Windows-1.8/ws/build\ooxml-test-results>
    [mkdir] Created dir: <https://builds.apache.org/job/POI-DSL-Windows-1.8/ws/build\excelant-classes>
    [mkdir] Created dir: <https://builds.apache.org/job/POI-DSL-Windows-1.8/ws/build\excelant-test-classes>
    [mkdir] Created dir: <https://builds.apache.org/job/POI-DSL-Windows-1.8/ws/build\excelant-test-results>
    [mkdir] Created dir: <https://builds.apache.org/job/POI-DSL-Windows-1.8/ws/build\examples-classes>
    [mkdir] Created dir: <https://builds.apache.org/job/POI-DSL-Windows-1.8/ws/build\integration-test-classes>
    [mkdir] Created dir: <https://builds.apache.org/job/POI-DSL-Windows-1.8/ws/build\integration-test-results>
    [mkdir] Created dir: <https://builds.apache.org/job/POI-DSL-Windows-1.8/ws/build\dist>
    [mkdir] Created dir: <https://builds.apache.org/job/POI-DSL-Windows-1.8/ws/build\tmp\site\build\site>
     [echo] Using Ant: Apache Ant(TM) version 1.9.9 compiled on February 2 2017 from F:\\jenkins\\tools\\ant\\apache-ant-1.9.9, Ant detected Java 1.8 (may be different than actual Java sometimes...)
     [echo] Using Java: 1.8.0_152/1.8.0_152-b16/25.152-b16/Java HotSpot(TM) 64-Bit Server VM from Oracle Corporation on Windows Server 2012 R2: 6.3

compile-main:
    [javac] Compiling 1207 source files to <https://builds.apache.org/job/POI-DSL-Windows-1.8/ws/build\classes>
    [javac] Note: Some input files use or override a deprecated API.
    [javac] Note: Recompile with -Xlint:deprecation for details.
    [javac] Note: Some input files use unchecked or unsafe operations.
    [javac] Note: Recompile with -Xlint:unchecked for details.
    [javac] Compiling 540 source files to <https://builds.apache.org/job/POI-DSL-Windows-1.8/ws/build\test-classes>
    [javac] Note: Some input files use or override a deprecated API.
    [javac] Note: Recompile with -Xlint:deprecation for details.
     [copy] Copying 4 files to <https://builds.apache.org/job/POI-DSL-Windows-1.8/ws/build\classes>

check-ooxml-xsds:

fetch-ooxml-xsds:

generate-geometry:

compile-scratchpad:
    [javac] Compiling 488 source files to <https://builds.apache.org/job/POI-DSL-Windows-1.8/ws/build\scratchpad-classes>
    [javac] Note: Some input files use or override a deprecated API.
    [javac] Note: Recompile with -Xlint:deprecation for details.
    [javac] Compiling 190 source files to <https://builds.apache.org/job/POI-DSL-Windows-1.8/ws/build\scratchpad-test-classes>
    [javac] Note: Some input files use or override a deprecated API.
    [javac] Note: Recompile with -Xlint:deprecation for details.
     [copy] Copying 2 files to <https://builds.apache.org/job/POI-DSL-Windows-1.8/ws/build\scratchpad-classes>

check-compiled-ooxml-xsds:

compile-ooxml-xsds:

compile-ooxml:
    [javac] Compiling 475 source files to <https://builds.apache.org/job/POI-DSL-Windows-1.8/ws/build\ooxml-classes>
    [javac] Note: Some input files use or override a deprecated API.
    [javac] Note: Recompile with -Xlint:deprecation for details.
    [javac] Compiling 245 source files to <https://builds.apache.org/job/POI-DSL-Windows-1.8/ws/build\ooxml-test-classes>
    [javac] Note: Some input files use or override a deprecated API.
    [javac] Note: Recompile with -Xlint:deprecation for details.
     [copy] Copying 3 files to <https://builds.apache.org/job/POI-DSL-Windows-1.8/ws/build\ooxml-classes>

compile-examples:
    [javac] Compiling 150 source files to <https://builds.apache.org/job/POI-DSL-Windows-1.8/ws/build\examples-classes>
    [javac] Note: <https://builds.apache.org/job/POI-DSL-Windows-1.8/ws/src\examples\src\org\apache\poi\xssf\eventusermodel\examples\FromHowTo.java> uses or overrides a deprecated API.
    [javac] Note: Recompile with -Xlint:deprecation for details.
     [copy] Copying 1 file to <https://builds.apache.org/job/POI-DSL-Windows-1.8/ws/build\examples-classes>

compile-excelant:
    [javac] Compiling 14 source files to <https://builds.apache.org/job/POI-DSL-Windows-1.8/ws/build\excelant-classes>
    [javac] Compiling 13 source files to <https://builds.apache.org/job/POI-DSL-Windows-1.8/ws/build\excelant-test-classes>
     [copy] Copying 1 file to <https://builds.apache.org/job/POI-DSL-Windows-1.8/ws/build\excelant-classes>

compile:

-compile-ooxml-lite-check:

compile-ooxml-lite:
     [echo] Running ooxml-lite generator
    [mkdir] Created dir: <https://builds.apache.org/job/POI-DSL-Windows-1.8/ws/build\ooxml-lite-merged>
      [jar] Building jar: <https://builds.apache.org/job/POI-DSL-Windows-1.8/ws/build\ooxml-lite-merged\ooxml-lite-merged.jar>
     [java] Collecting unit tests from <https://builds.apache.org/job/POI-DSL-Windows-1.8/ws/build\ooxml-test-classes>
     [java] Class org.apache.poi.benchmark.generated.AddImageBench_jmhType does not derive from TestCase and does not have a @Test annotation
     [java] Inner class org.apache.poi.dev.TestOOXMLLister$1.class not included
     [java] Inner class org.apache.poi.dev.TestOOXMLPrettyPrint$1.class not included
     [java] Inner class org.apache.poi.TestPOIXMLDocument$1.class not included
     [java] Inner class org.apache.poi.TestPOIXMLDocument$UncaughtHandler.class not included
     [java] Inner class org.apache.poi.xssf.usermodel.TestMatrixFormulasFromXMLSpreadsheet$1.class not included
     [java] Inner class org.apache.poi.xssf.usermodel.TestMatrixFormulasFromXMLSpreadsheet$Navigator.class not included
     [java] Found 222 classes
     [java] SLF4J: Failed to load class "org.slf4j.impl.StaticLoggerBinder".
     [java] SLF4J: Defaulting to no-operation (NOP) logger implementation
     [java] SLF4J: See http://www.slf4j.org/codes.html#StaticLoggerBinder for further details.
     [java] Exception in thread "main" java.lang.RuntimeException: Tests did not succeed, cannot build ooxml-lite jar...III.........................................I.........................I...............................................................................................................I............................E.............................................................................................................................................................I.................................................................................................................................................I..........................................................I.......................................................................................................................................................................................................................I..I..I.I.....................................................................................................................................................................................................................................................................................................................................................................................................................................................................................................................................................III.I.I.......I.......I.....I..............................................................................I......II.........I.I........................I.........I.....I...............................................................................................................................I...........................................................................................................................I.I...I...................................................................................................................................................................................................................................................................................................................................................I..........................................................................................................................................................I................................................................................................................I......
     [java]
     [java] Time: 118.878
     [java] There was 1 failure:
     [java] 1) bug61182(org.apache.poi.poifs.crypt.TestSignatureInfo)
     [java] org.junit.ComparisonFailure: expected:<[jVW6EPMywZ8jr4+I4alDosXzqrVuDG4wTdrr+la8QVbXfLm6HOh9AUFlo5yUZuWo/1gXrrkc34UTYNzuslyrOxKqadPOIRKUssJzdCh/hKeTxs/YtyWkpGHggrUjrF/vUUIeIXRHo+1DCAh6ptoicviH/I/Dtoa5NgkEHVuOHk8]=> but was:<[WwuQV1Z/wfFEoJQPI4GZ1tvA4XncWzMg+ookwjMPNxiV1vBS6cm/aBYofumCggbKBqER4zUv06VPSvaSldgrVPc/c2f945rjAiWx5AQuBrQoqW5xUrO5/B4Q7FUT2liOaFIYRYpbav2BxkMUn2hohqOvqKrLg+jL+Au+DwqQFFs]=>
     [java] at org.junit.Assert.assertEquals(Assert.java:115)
     [java] at org.junit.Assert.assertEquals(Assert.java:144)
     [java] at org.apache.poi.poifs.crypt.TestSignatureInfo.bug61182(TestSignatureInfo.java:215)
     [java] at sun.reflect.NativeMethodAccessorImpl.invoke0(Native Method)
     [java] at sun.reflect.NativeMethodAccessorImpl.invoke(NativeMethodAccessorImpl.java:62)
     [java] at sun.reflect.DelegatingMethodAccessorImpl.invoke(DelegatingMethodAccessorImpl.java:43)
     [java] at java.lang.reflect.Method.invoke(Method.java:498)
     [java] at org.junit.runners.model.FrameworkMethod$1.runReflectiveCall(FrameworkMethod.java:50)
     [java] at org.junit.internal.runners.model.ReflectiveCallable.run(ReflectiveCallable.java:12)
     [java] at org.junit.runners.model.FrameworkMethod.invokeExplosively(FrameworkMethod.java:47)
     [java] at org.junit.internal.runners.statements.InvokeMethod.evaluate(InvokeMethod.java:17)
     [java] at org.junit.runners.ParentRunner.runLeaf(ParentRunner.java:325)
     [java] at org.junit.runners.BlockJUnit4ClassRunner.runChild(BlockJUnit4ClassRunner.java:78)
     [java] at org.junit.runners.BlockJUnit4ClassRunner.runChild(BlockJUnit4ClassRunner.java:57)
     [java] at org.junit.runners.ParentRunner$3.run(ParentRunner.java:290)
     [java] at org.junit.runners.ParentRunner$1.schedule(ParentRunner.java:71)
     [java] at org.junit.runners.ParentRunner.runChildren(ParentRunner.java:288)
     [java] at org.junit.runners.ParentRunner.access$000(ParentRunner.java:58)
     [java] at org.junit.runners.ParentRunner$2.evaluate(ParentRunner.java:268)
     [java] at org.junit.internal.runners.statements.RunBefores.evaluate(RunBefores.java:26)
     [java] at org.junit.internal.runners.statements.RunAfters.evaluate(RunAfters.java:27)
     [java] at org.junit.runners.ParentRunner.run(ParentRunner.java:363)
     [java] at org.junit.runners.Suite.runChild(Suite.java:128)
     [java] at org.junit.runners.Suite.runChild(Suite.java:27)
     [java] at org.junit.runners.ParentRunner$3.run(ParentRunner.java:290)
     [java] at org.junit.runners.ParentRunner$1.schedule(ParentRunner.java:71)
     [java] at org.junit.runners.ParentRunner.runChildren(ParentRunner.java:288)
     [java] at org.junit.runners.ParentRunner.access$000(ParentRunner.java:58)
     [java] at org.junit.runners.ParentRunner$2.evaluate(ParentRunner.java:268)
     [java] at org.junit.runners.ParentRunner.run(ParentRunner.java:363)
     [java] at org.junit.runner.JUnitCore.run(JUnitCore.java:137)
     [java] at org.junit.runner.JUnitCore.run(JUnitCore.java:115)
     [java] at org.junit.runner.JUnitCore.run(JUnitCore.java:105)
     [java] at org.junit.runner.JUnitCore.run(JUnitCore.java:94)
     [java] at org.apache.poi.util.OOXMLLite.build(OOXMLLite.java:149)
     [java] at org.apache.poi.util.OOXMLLite.main(OOXMLLite.java:94)
     [java]
     [java] FAILURES!!!
     [java] Tests run: 2339,  Failures: 1
     [java]
     [java] at org.apache.poi.util.OOXMLLite.build(OOXMLLite.java:151)
     [java] at org.apache.poi.util.OOXMLLite.main(OOXMLLite.java:94)

BUILD FAILED
<https://builds.apache.org/job/POI-DSL-Windows-1.8/ws/build.xml>:1526: Java returned: 1

Total time: 3 minutes 14 seconds
Build step 'Invoke Ant' marked build as failure
Skipping publisher since build result is FAILURE
Archiving artifacts
[Fast Archiver] Compressed 66.36 MB of artifacts by 100.0% relative to #106
Skipping publisher since build result is FAILURE
Recording test results
ERROR: Step ‘Publish JUnit test result report’ failed: No test report files were found. Configuration error?


---------------------------------------------------------------------
To unsubscribe, e-mail: [hidden email]
For additional commands, e-mail: [hidden email]

Reply | Threaded
Open this post in threaded view
|

Jenkins build is back to normal : POI-DSL-Windows-1.8 #108

Apache Jenkins Server
See <https://builds.apache.org/job/POI-DSL-Windows-1.8/108/display/redirect?page=changes>


---------------------------------------------------------------------
To unsubscribe, e-mail: [hidden email]
For additional commands, e-mail: [hidden email]