Build failed in Jenkins: POI-DSL-Windows-1.14 #39

classic Classic list List threaded Threaded
5 messages Options
Reply | Threaded
Open this post in threaded view
|

Build failed in Jenkins: POI-DSL-Windows-1.14 #39

Apache Jenkins Server
See <https://builds.apache.org/job/POI-DSL-Windows-1.14/39/display/redirect?page=changes>

Changes:

[kiwiwings] examples had been moved due to jigsaw modules migration

[kiwiwings] remove obsolete bouncycastle jars

[kiwiwings] a few jigsaw related fixes

[fanningpj] try to make examples more robust - to fix integration tests

[kiwiwings] use Ant 1.10 for the builds

[fanningpj] add back TempFileUtils.java due to broken build

[kiwiwings] #64411 - Provide JigSaw modules
- use classpath-build for Java 8, otherwise use modulepath
- save module-info classes to source, when using Java 9+ environment
- rename example packages - otherwise package clashes occured in the tests
- move agile encryption from ooxml to main.
  remove EncryptionInfo XmlBeans and schema and use custom xml marshalling
- move ooxml test classes which reside in the same package as their tested main class
- rename base test classes to "BaseTest..." - temporarily I've used a light version of the main test classes to test scratchpad / ooxml
- build.xml - fixed the Rhino javascript errors of the dependency-macros
- DrawTextParagraph - fixed StringIndexOutOfBounds when logging set to debug level
- use JigSaw provider interface (= Java ServiceLoader), i.e. it wasn't possible (without openening everything), to access ooxml factory classes from main factory stub


------------------------------------------
[...truncated 29.76 KB...]
AU        src\testcases\org\apache\poi\hssf\usermodel\TestHSSFChart.java
U         src\testcases\org\apache\poi\hssf\usermodel\TestHSSFRangeCopier.java
D         src\testcases\org\apache\poi\sl\TestCommonSL.java
AU        src\testcases\org\apache\poi\sl\draw\geom\TestFormulaParser.java
U         src\testcases\org\apache\poi\sl\usermodel\BaseTestSlideShow.java
U         src\testcases\org\apache\poi\ss\format\TestCellFormat.java
D         src\testcases\org\apache\poi\ss\formula\TestMissingWorkbook.java
U         src\testcases\org\apache\poi\ss\formula\AllSSFormulaTests.java
AU        src\testcases\org\apache\poi\ss\formula\BaseTestMissingWorkbook.java
D         src\testcases\org\apache\poi\ss\formula\eval\forked\TestForkedEvaluator.java
AU        src\testcases\org\apache\poi\ss\formula\eval\forked\BaseTestForkedEvaluator.java
D         src\testcases\org\apache\poi\ss\formula\functions\AbstractNumericTestCase.java
AU        src\testcases\org\apache\poi\ss\formula\functions\BaseTestNumeric.java
U         src\testcases\org\apache\poi\ss\formula\functions\TestFinanceLib.java
U         src\testcases\org\apache\poi\ss\formula\functions\TestMathX.java
U         src\testcases\org\apache\poi\ss\formula\functions\TestStatsLib.java
U         src\testcases\org\apache\poi\ss\formula\functions\TestTrunc.java
D         src\testcases\org\apache\poi\ss\formula\ptg\AbstractPtgTestCase.java
AU        src\testcases\org\apache\poi\ss\formula\ptg\BaseTestPtg.java
U         src\testcases\org\apache\poi\ss\formula\ptg\TestArea3DPtg.java
U         src\testcases\org\apache\poi\ss\formula\ptg\TestAreaErrPtg.java
U         src\testcases\org\apache\poi\ss\formula\ptg\TestAttrPtg.java
U         src\testcases\org\apache\poi\ss\formula\ptg\TestErrPtg.java
U         src\testcases\org\apache\poi\ss\formula\ptg\TestIntersectionPtg.java
U         src\testcases\org\apache\poi\ss\formula\ptg\TestPercentPtg.java
U         src\testcases\org\apache\poi\ss\formula\ptg\TestRangePtg.java
U         src\testcases\org\apache\poi\ss\formula\ptg\TestRef3DPtg.java
U         src\testcases\org\apache\poi\ss\formula\ptg\TestUnionPtg.java
D         src\testcases\org\apache\poi\ss\usermodel\TestRangeCopier.java
AU        src\testcases\org\apache\poi\ss\usermodel\BaseTestRangeCopier.java
U         build.xml
U         jenkins\create_jobs.groovy

<-- Got one external: documentation, svn url: https://svn.apache.org/repos/asf/poi/site/src/documentation -->
Fetching 'https://svn.apache.org/repos/asf/poi/site/src/documentation' at -1 into 'F:\jenkins\jenkins-slave\workspace\POI-DSL-Windows-1.14\src\documentation'
At revision 1880305


<-- Got one external: forrest.properties, svn url: https://svn.apache.org/repos/asf/poi/site/forrest.properties -->
Fetching 'https://svn.apache.org/repos/asf/poi/site/forrest.properties' at -1 into 'F:\jenkins\jenkins-slave\workspace\POI-DSL-Windows-1.14\forrest.properties'
At revision 1880305

At revision 1880305

No changes for https://svn.apache.org/repos/asf/poi/site/src/documentation since the previous build
No changes for https://svn.apache.org/repos/asf/poi/site/forrest.properties since the previous build
[POI-DSL-Windows-1.14] $ cmd /c call F:\jenkins\jenkins-slave\temp\jenkins505847425165654277.bat
C       build.gradle
?       build.gradle.mine
?       build.gradle.r1873837
?       build.gradle.r1874089
    X   forrest.properties
C       osgi\build.xml
?       osgi\build.xml.mine
?       osgi\build.xml.r1873837
?       osgi\build.xml.r1874089
X       src\documentation
?       src\integrationtest\build

Performing status on external item at 'src\documentation':
Summary of conflicts:
  Text conflicts: 2
Java-Home: f:\\jenkins\\tools\\java\\latest14
 Volume in drive F is data
 Volume Serial Number is 86B6-2F62

 Directory of f:\jenkins\tools\java\latest14

07/24/2019  08:16 AM    <DIR>          .
07/24/2019  08:16 AM    <DIR>          ..
07/24/2019  08:16 AM    <DIR>          bin
07/24/2019  08:16 AM    <DIR>          conf
07/24/2019  08:16 AM    <DIR>          include
07/24/2019  08:16 AM    <DIR>          jmods
07/24/2019  08:16 AM    <DIR>          legal
07/24/2019  08:16 AM    <DIR>          lib
07/17/2019  03:16 AM             1,213 release
               1 File(s)          1,213 bytes
               8 Dir(s)  1,947,695,484,928 bytes free
openjdk version "14-ea" 2020-03-17
OpenJDK Runtime Environment (build 14-ea+6-171)
OpenJDK 64-Bit Server VM (build 14-ea+6-171, mixed mode, sharing)
[POI-DSL-Windows-1.14] $ cmd.exe /C "F:\jenkins\tools\ant\latest1.10\bin\ant.bat -Dcoverage.enabled=true clean jenkins && exit %%ERRORLEVEL%%"
Buildfile: <https://builds.apache.org/job/POI-DSL-Windows-1.14/ws/build.xml>
[propertyreset] Warning: Nashorn engine is planned to be removed from a future JDK release
[propertyreset] Warning: Nashorn engine is planned to be removed from a future JDK release

clean:
   [delete] Deleting directory <https://builds.apache.org/job/POI-DSL-Windows-1.14/ws/build>

replaceVersion:

check-jars:
   [delete] Deleting <https://builds.apache.org/job/POI-DSL-Windows-1.14/ws/lib\ooxml-provided\bcpkix-jdk15on-1.65.jar>
   [delete] Deleting <https://builds.apache.org/job/POI-DSL-Windows-1.14/ws/lib\ooxml-provided\bcprov-ext-jdk15on-1.65.jar>
   [delete] Deleting <https://builds.apache.org/job/POI-DSL-Windows-1.14/ws/lib\ooxml-tests\guava-20.0.jar>

fetch-jars:
      [get] Destination already exists (skipping): <https://builds.apache.org/job/POI-DSL-Windows-1.14/ws/lib\main\commons-logging-1.2.jar>
      [get] Destination already exists (skipping): <https://builds.apache.org/job/POI-DSL-Windows-1.14/ws/lib\main\commons-codec-1.14.jar>
      [get] Destination already exists (skipping): <https://builds.apache.org/job/POI-DSL-Windows-1.14/ws/lib\main\log4j-1.2.17.jar>
      [get] Destination already exists (skipping): <https://builds.apache.org/job/POI-DSL-Windows-1.14/ws/lib\main-tests\junit-4.13.jar>
      [get] Destination already exists (skipping): <https://builds.apache.org/job/POI-DSL-Windows-1.14/ws/lib\main-tests\jmh-core-1.19.jar>
      [get] Destination already exists (skipping): <https://builds.apache.org/job/POI-DSL-Windows-1.14/ws/lib\main-tests\jmh-generator-annprocess-1.19.jar>
      [get] Destination already exists (skipping): <https://builds.apache.org/job/POI-DSL-Windows-1.14/ws/lib\main-tests\hamcrest-core-1.3.jar>
      [get] Destination already exists (skipping): <https://builds.apache.org/job/POI-DSL-Windows-1.14/ws/lib\main-tests\xmlunit-core-2.5.1.jar>
      [get] Destination already exists (skipping): <https://builds.apache.org/job/POI-DSL-Windows-1.14/ws/lib\main-tests\mockito-core-3.3.3.jar>
      [get] Destination already exists (skipping): <https://builds.apache.org/job/POI-DSL-Windows-1.14/ws/lib\main-tests\byte-buddy-1.10.1.jar>
      [get] Destination already exists (skipping): <https://builds.apache.org/job/POI-DSL-Windows-1.14/ws/lib\main-tests\byte-buddy-agent-1.10.1.jar>
      [get] Destination already exists (skipping): <https://builds.apache.org/job/POI-DSL-Windows-1.14/ws/lib\main-tests\objenesis-2.6.jar>
      [get] Getting: https://repo1.maven.org/maven2/org/apache/ant/ant/1.10.8/ant-1.10.8.jar
      [get] To: <https://builds.apache.org/job/POI-DSL-Windows-1.14/ws/lib\excelant\ant-1.10.8.jar>
      [get] Getting: https://repo1.maven.org/maven2/org/apache/ant/ant-launcher/1.10.8/ant-launcher-1.10.8.jar
      [get] To: <https://builds.apache.org/job/POI-DSL-Windows-1.14/ws/lib\excelant\ant-launcher-1.10.8.jar>
      [get] Destination already exists (skipping): <https://builds.apache.org/job/POI-DSL-Windows-1.14/ws/lib\util\asm-8.0.1.jar>
      [get] Destination already exists (skipping): <https://builds.apache.org/job/POI-DSL-Windows-1.14/ws/lib\util\asm-commons-8.0.1.jar>
      [get] Destination already exists (skipping): <https://builds.apache.org/job/POI-DSL-Windows-1.14/ws/lib\util\asm-tree-8.0.1.jar>
      [get] Destination already exists (skipping): <https://builds.apache.org/job/POI-DSL-Windows-1.14/ws/lib\util\jacoco-0.8.5.zip>
      [get] Destination already exists (skipping): <https://builds.apache.org/job/POI-DSL-Windows-1.14/ws/lib\main\commons-collections4-4.4.jar>
      [get] Destination already exists (skipping): <https://builds.apache.org/job/POI-DSL-Windows-1.14/ws/lib\main\commons-math3-3.6.1.jar>
      [get] Destination already exists (skipping): <https://builds.apache.org/job/POI-DSL-Windows-1.14/ws/lib\main\SparseBitSet-1.2.jar>
    [unzip] Expanding: <https://builds.apache.org/job/POI-DSL-Windows-1.14/ws/lib\util\jacoco-0.8.5.zip> into <https://builds.apache.org/job/POI-DSL-Windows-1.14/ws/lib\util>
      [get] Destination already exists (skipping): <https://builds.apache.org/job/POI-DSL-Windows-1.14/ws/lib\util\apache-rat-0.12.jar>
      [get] Destination already exists (skipping): <https://builds.apache.org/job/POI-DSL-Windows-1.14/ws/lib\util\forbiddenapis-2.6.jar>
      [get] Getting: https://repo1.maven.org/maven2/org/bouncycastle/bcprov-ext-jdk15on/1.66/bcprov-ext-jdk15on-1.66.jar
      [get] To: <https://builds.apache.org/job/POI-DSL-Windows-1.14/ws/lib\ooxml-provided\bcprov-ext-jdk15on-1.66.jar>
      [get] Getting: https://repo1.maven.org/maven2/org/bouncycastle/bcpkix-jdk15on/1.66/bcpkix-jdk15on-1.66.jar
      [get] To: <https://builds.apache.org/job/POI-DSL-Windows-1.14/ws/lib\ooxml-provided\bcpkix-jdk15on-1.66.jar>
      [get] Destination already exists (skipping): <https://builds.apache.org/job/POI-DSL-Windows-1.14/ws/lib\ooxml-provided\xmlsec-2.1.5.jar>
      [get] Destination already exists (skipping): <https://builds.apache.org/job/POI-DSL-Windows-1.14/ws/lib\ooxml-provided\slf4j-api-1.7.30.jar>

check-ooxml-jars:

fetch-ooxml-jars:
      [get] Destination already exists (skipping): <https://builds.apache.org/job/POI-DSL-Windows-1.14/ws/lib\ooxml\curvesapi-1.06.jar>
      [get] Getting: https://builds.apache.org/view/P/view/POI/job/POI-XMLBeans-DSL-1.8/lastSuccessfulBuild/artifact/build/xmlbeans-4.0.0.jar
      [get] To: <https://builds.apache.org/job/POI-DSL-Windows-1.14/ws/lib\ooxml\xmlbeans-4.0.0.jar>
      [get] Destination already exists (skipping): <https://builds.apache.org/job/POI-DSL-Windows-1.14/ws/lib\ooxml\commons-compress-1.20.jar>
      [get] Destination already exists (skipping): <https://builds.apache.org/job/POI-DSL-Windows-1.14/ws/lib\ooxml-tests\reflections-0.9.11.jar>
      [get] Getting: https://repo1.maven.org/maven2/com/google/guava/guava/29.0-jre/guava-29.0-jre.jar
      [get] To: <https://builds.apache.org/job/POI-DSL-Windows-1.14/ws/lib\ooxml-tests\guava-29.0-jre.jar>
      [get] Destination already exists (skipping): <https://builds.apache.org/job/POI-DSL-Windows-1.14/ws/lib\ooxml-tests\javassist-3.21.0-GA.jar>
      [get] Destination already exists (skipping): <https://builds.apache.org/job/POI-DSL-Windows-1.14/ws/lib\ooxml-provided\batik-all-1.12.jar>
      [get] Destination already exists (skipping): <https://builds.apache.org/job/POI-DSL-Windows-1.14/ws/lib\ooxml-provided\xml-apis-ext-1.3.04.jar>
      [get] Destination already exists (skipping): <https://builds.apache.org/job/POI-DSL-Windows-1.14/ws/lib\ooxml-provided\xmlgraphics-commons-2.3.jar>

init:
    [mkdir] Created dir: <https://builds.apache.org/job/POI-DSL-Windows-1.14/ws/build>
    [mkdir] Created dir: <https://builds.apache.org/job/POI-DSL-Windows-1.14/ws/build\classes>
    [mkdir] Created dir: <https://builds.apache.org/job/POI-DSL-Windows-1.14/ws/build\test-classes>
    [mkdir] Created dir: <https://builds.apache.org/job/POI-DSL-Windows-1.14/ws/build\test-results>
    [mkdir] Created dir: <https://builds.apache.org/job/POI-DSL-Windows-1.14/ws/build\scratchpad-classes>
    [mkdir] Created dir: <https://builds.apache.org/job/POI-DSL-Windows-1.14/ws/build\scratchpad-test-classes>
    [mkdir] Created dir: <https://builds.apache.org/job/POI-DSL-Windows-1.14/ws/build\scratchpad-test-results>
    [mkdir] Created dir: <https://builds.apache.org/job/POI-DSL-Windows-1.14/ws/build\geometry-java>
    [mkdir] Created dir: <https://builds.apache.org/job/POI-DSL-Windows-1.14/ws/build\ooxml-classes>
    [mkdir] Created dir: <https://builds.apache.org/job/POI-DSL-Windows-1.14/ws/build\ooxml-test-classes>
    [mkdir] Created dir: <https://builds.apache.org/job/POI-DSL-Windows-1.14/ws/build\ooxml-test-results>
    [mkdir] Created dir: <https://builds.apache.org/job/POI-DSL-Windows-1.14/ws/build\excelant-classes>
    [mkdir] Created dir: <https://builds.apache.org/job/POI-DSL-Windows-1.14/ws/build\excelant-test-classes>
    [mkdir] Created dir: <https://builds.apache.org/job/POI-DSL-Windows-1.14/ws/build\excelant-test-results>
    [mkdir] Created dir: <https://builds.apache.org/job/POI-DSL-Windows-1.14/ws/build\examples-classes>
    [mkdir] Created dir: <https://builds.apache.org/job/POI-DSL-Windows-1.14/ws/build\integration-test-classes>
    [mkdir] Created dir: <https://builds.apache.org/job/POI-DSL-Windows-1.14/ws/build\integration-test-results>
    [mkdir] Created dir: <https://builds.apache.org/job/POI-DSL-Windows-1.14/ws/build\dist>
    [mkdir] Created dir: <https://builds.apache.org/job/POI-DSL-Windows-1.14/ws/build\site>
     [echo] Using Ant: Apache Ant(TM) version 1.10.5 compiled on July 10 2018 from F:\\jenkins\\tools\\ant\\latest1.10, Ant detected Java 14 (may be different than actual Java sometimes...)
     [echo] Using Java: 14-ea/14-ea+6-171/14-ea+6-171/OpenJDK 64-Bit Server VM from Oracle Corporation on Windows Server 2016: 10.0
     [echo] Building Apache POI version 5.0.0-SNAPSHOT and RC: RC1
[release_tag] Warning: Nashorn engine is planned to be removed from a future JDK release

-version-java-check:

compile-version:
     [copy] Copying 1 file to <https://builds.apache.org/job/POI-DSL-Windows-1.14/ws/build\classes\org\apache\poi>
    [javac] Compiling 1 source file to <https://builds.apache.org/job/POI-DSL-Windows-1.14/ws/build\classes>
    [javac] warning: [options] bootstrap class path not set in conjunction with -source 8
    [javac] 1 warning
   [delete] Deleting: <https://builds.apache.org/job/POI-DSL-Windows-1.14/ws/build\classes\org\apache\poi\Version.java>

compile-main:

BUILD FAILED
<https://builds.apache.org/job/POI-DSL-Windows-1.14/ws/build.xml>:998: The following error occurred while executing this line:
<https://builds.apache.org/job/POI-DSL-Windows-1.14/ws/build.xml>:850: java.util.regex.PatternSyntaxException: Illegal/unsupported escape sequence near index 4
^<https://builds.apache.org/job/POI-DSL-Windows-1.14/ws/[/\\](.*)$>
    ^
        at java.base/java.util.regex.Pattern.error(Pattern.java:2015)
        at java.base/java.util.regex.Pattern.escape(Pattern.java:2606)
        at java.base/java.util.regex.Pattern.atom(Pattern.java:2273)
        at java.base/java.util.regex.Pattern.sequence(Pattern.java:2197)
        at java.base/java.util.regex.Pattern.expr(Pattern.java:2056)
        at java.base/java.util.regex.Pattern.compile(Pattern.java:1778)
        at java.base/java.util.regex.Pattern.<init>(Pattern.java:1428)
        at java.base/java.util.regex.Pattern.compile(Pattern.java:1095)
        at org.apache.tools.ant.util.regexp.Jdk14RegexpMatcher.getCompiledPattern(Jdk14RegexpMatcher.java:65)
        at org.apache.tools.ant.util.regexp.Jdk14RegexpMatcher.matches(Jdk14RegexpMatcher.java:93)
        at org.apache.tools.ant.util.RegexpPatternMapper.mapFileName(RegexpPatternMapper.java:127)
        at org.apache.tools.ant.util.CompositeMapper.lambda$mapFileName$0(CompositeMapper.java:32)
        at java.base/java.util.stream.ReferencePipeline$3$1.accept(ReferencePipeline.java:195)
        at java.base/java.util.stream.ReferencePipeline$2$1.accept(ReferencePipeline.java:177)
        at java.base/java.util.ArrayList$ArrayListSpliterator.forEachRemaining(ArrayList.java:1621)
        at java.base/java.util.stream.AbstractPipeline.copyInto(AbstractPipeline.java:484)
        at java.base/java.util.stream.AbstractPipeline.wrapAndCopyInto(AbstractPipeline.java:474)
        at java.base/java.util.stream.AbstractPipeline.evaluate(AbstractPipeline.java:550)
        at java.base/java.util.stream.AbstractPipeline.evaluateToArrayNode(AbstractPipeline.java:260)
        at java.base/java.util.stream.ReferencePipeline.toArray(ReferencePipeline.java:517)
        at org.apache.tools.ant.util.CompositeMapper.mapFileName(CompositeMapper.java:33)
        at org.apache.tools.ant.taskdefs.PathConvert.execute(PathConvert.java:363)
        at org.apache.tools.ant.UnknownElement.execute(UnknownElement.java:292)
        at jdk.internal.reflect.GeneratedMethodAccessor4.invoke(Unknown Source)
        at java.base/jdk.internal.reflect.DelegatingMethodAccessorImpl.invoke(DelegatingMethodAccessorImpl.java:43)
        at java.base/java.lang.reflect.Method.invoke(Method.java:567)
        at org.apache.tools.ant.dispatch.DispatchUtils.execute(DispatchUtils.java:99)
        at org.apache.tools.ant.Task.perform(Task.java:350)
        at java.base/java.util.Vector.forEach(Vector.java:1354)
        at org.apache.tools.ant.taskdefs.Sequential.execute(Sequential.java:67)
        at org.apache.tools.ant.UnknownElement.execute(UnknownElement.java:292)
        at jdk.internal.reflect.GeneratedMethodAccessor4.invoke(Unknown Source)
        at java.base/jdk.internal.reflect.DelegatingMethodAccessorImpl.invoke(DelegatingMethodAccessorImpl.java:43)
        at java.base/java.lang.reflect.Method.invoke(Method.java:567)
        at org.apache.tools.ant.dispatch.DispatchUtils.execute(DispatchUtils.java:99)
        at org.apache.tools.ant.Task.perform(Task.java:350)
        at org.apache.tools.ant.taskdefs.MacroInstance.execute(MacroInstance.java:391)
        at org.apache.tools.ant.UnknownElement.execute(UnknownElement.java:292)
        at jdk.internal.reflect.GeneratedMethodAccessor4.invoke(Unknown Source)
        at java.base/jdk.internal.reflect.DelegatingMethodAccessorImpl.invoke(DelegatingMethodAccessorImpl.java:43)
        at java.base/java.lang.reflect.Method.invoke(Method.java:567)
        at org.apache.tools.ant.dispatch.DispatchUtils.execute(DispatchUtils.java:99)
        at org.apache.tools.ant.Task.perform(Task.java:350)
        at org.apache.tools.ant.Target.execute(Target.java:449)
        at org.apache.tools.ant.Target.performTasks(Target.java:470)
        at org.apache.tools.ant.Project.executeSortedTargets(Project.java:1388)
        at org.apache.tools.ant.Project.executeTarget(Project.java:1361)
        at org.apache.tools.ant.helper.DefaultExecutor.executeTargets(DefaultExecutor.java:41)
        at org.apache.tools.ant.Project.executeTargets(Project.java:1251)
        at org.apache.tools.ant.Main.runBuild(Main.java:834)
        at org.apache.tools.ant.Main.startAnt(Main.java:223)
        at org.apache.tools.ant.launch.Launcher.run(Launcher.java:284)
        at org.apache.tools.ant.launch.Launcher.main(Launcher.java:101)

Total time: 13 seconds
Build step 'Invoke Ant' marked build as failure
Skipping publisher since build result is FAILURE
Archiving artifacts
[Fast Archiver] Compressed 3.04 MB of artifacts by 22.6% relative to #38
Skipping publisher since build result is FAILURE
Recording test results
ERROR: Step ‘Publish JUnit test result report’ failed: No test report files were found. Configuration error?

---------------------------------------------------------------------
To unsubscribe, e-mail: [hidden email]
For additional commands, e-mail: [hidden email]

Reply | Threaded
Open this post in threaded view
|

Build failed in Jenkins: POI-DSL-Windows-1.14 #40

Apache Jenkins Server
See <https://builds.apache.org/job/POI-DSL-Windows-1.14/40/display/redirect?page=changes>

Changes:

[fanningpj] fix up some example links

[fanningpj] try to fix paths for examples

[fanningpj] try to fix changes.xml

[fanningpj] try to fix changes.xml

[fanningpj] try to fix paths for examples


------------------------------------------
[...truncated 382.96 KB...]
AU        src\documentation\resources\images\logoRussellBeattie3.png
A         src\documentation\sitemap.xmap
AU        src\documentation\skinconf.xml
AU        src\documentation\release-guide.txt
A         src\documentation\cli.xconf
AU        src\documentation\RELEASE-NOTES.txt
AU        src\documentation\README.txt
A         src\documentation\classes
A         src\documentation\classes\CatalogManager.properties
At revision 1880522


<-- Got one external: forrest.properties, svn url: https://svn.apache.org/repos/asf/poi/site/forrest.properties -->
Fetching 'https://svn.apache.org/repos/asf/poi/site/forrest.properties' at -1 into 'F:\jenkins\jenkins-slave\workspace\POI-DSL-Windows-1.14\forrest.properties'
A         forrest.properties
At revision 1880522

At revision 1880522

No changes for https://svn.apache.org/repos/asf/poi/trunk since the previous build
No changes for https://svn.apache.org/repos/asf/poi/site/forrest.properties since the previous build
[POI-DSL-Windows-1.14] $ cmd /c call F:\jenkins\jenkins-slave\temp\jenkins5420646519807964877.bat
    X   forrest.properties
X       src\documentation

Performing status on external item at 'src\documentation':
Java-Home: f:\\jenkins\\tools\\java\\latest14
 Volume in drive F is data
 Volume Serial Number is B2AC-24AD

 Directory of f:\jenkins\tools\java\latest14

04/03/2020  12:19 PM    <DIR>          .
04/03/2020  12:19 PM    <DIR>          ..
04/03/2020  12:19 PM    <DIR>          bin
04/03/2020  12:19 PM    <DIR>          conf
04/03/2020  12:19 PM    <DIR>          include
04/03/2020  12:19 PM    <DIR>          jmods
04/03/2020  12:19 PM    <DIR>          legal
04/03/2020  12:19 PM    <DIR>          lib
07/17/2019  03:16 AM             1,213 release
               1 File(s)          1,213 bytes
               8 Dir(s)  2,956,545,449,984 bytes free
openjdk version "14-ea" 2020-03-17
OpenJDK Runtime Environment (build 14-ea+6-171)
OpenJDK 64-Bit Server VM (build 14-ea+6-171, mixed mode, sharing)
[POI-DSL-Windows-1.14] $ cmd.exe /C "F:\jenkins\tools\ant\latest1.10\bin\ant.bat -Dcoverage.enabled=true clean jenkins && exit %%ERRORLEVEL%%"
Buildfile: <https://builds.apache.org/job/POI-DSL-Windows-1.14/ws/build.xml>
[propertyreset] Warning: Nashorn engine is planned to be removed from a future JDK release
[propertyreset] Warning: Nashorn engine is planned to be removed from a future JDK release

clean:

replaceVersion:

check-jars:
    [mkdir] Created dir: <https://builds.apache.org/job/POI-DSL-Windows-1.14/ws/lib\main>
    [mkdir] Created dir: <https://builds.apache.org/job/POI-DSL-Windows-1.14/ws/lib\ooxml>
    [mkdir] Created dir: <https://builds.apache.org/job/POI-DSL-Windows-1.14/ws/lib\ooxml-tests>
   [delete] Directory does not exist: <https://builds.apache.org/job/POI-DSL-Windows-1.14/ws/lib\main-tests>
   [delete] Directory does not exist: <https://builds.apache.org/job/POI-DSL-Windows-1.14/ws/lib\ooxml-provided>
   [delete] Directory does not exist: <https://builds.apache.org/job/POI-DSL-Windows-1.14/ws/lib\util>

fetch-jars:
      [get] Getting: https://repo1.maven.org/maven2/commons-logging/commons-logging/1.2/commons-logging-1.2.jar
      [get] To: <https://builds.apache.org/job/POI-DSL-Windows-1.14/ws/lib\main\commons-logging-1.2.jar>
      [get] Getting: https://repo1.maven.org/maven2/commons-codec/commons-codec/1.14/commons-codec-1.14.jar
      [get] To: <https://builds.apache.org/job/POI-DSL-Windows-1.14/ws/lib\main\commons-codec-1.14.jar>
      [get] Getting: https://repo1.maven.org/maven2/log4j/log4j/1.2.17/log4j-1.2.17.jar
      [get] To: <https://builds.apache.org/job/POI-DSL-Windows-1.14/ws/lib\main\log4j-1.2.17.jar>
    [mkdir] Created dir: <https://builds.apache.org/job/POI-DSL-Windows-1.14/ws/lib\main-tests>
      [get] Getting: https://repo1.maven.org/maven2/junit/junit/4.13/junit-4.13.jar
      [get] To: <https://builds.apache.org/job/POI-DSL-Windows-1.14/ws/lib\main-tests\junit-4.13.jar>
      [get] Getting: https://repo1.maven.org/maven2/org/openjdk/jmh/jmh-core/1.19/jmh-core-1.19.jar
      [get] To: <https://builds.apache.org/job/POI-DSL-Windows-1.14/ws/lib\main-tests\jmh-core-1.19.jar>
      [get] Getting: https://repo1.maven.org/maven2/org/openjdk/jmh/jmh-generator-annprocess/1.19/jmh-generator-annprocess-1.19.jar
      [get] To: <https://builds.apache.org/job/POI-DSL-Windows-1.14/ws/lib\main-tests\jmh-generator-annprocess-1.19.jar>
      [get] Getting: https://repo1.maven.org/maven2/org/hamcrest/hamcrest-core/1.3/hamcrest-core-1.3.jar
      [get] To: <https://builds.apache.org/job/POI-DSL-Windows-1.14/ws/lib\main-tests\hamcrest-core-1.3.jar>
      [get] Getting: https://repo1.maven.org/maven2/org/xmlunit/xmlunit-core/2.5.1/xmlunit-core-2.5.1.jar
      [get] To: <https://builds.apache.org/job/POI-DSL-Windows-1.14/ws/lib\main-tests\xmlunit-core-2.5.1.jar>
      [get] Getting: https://repo1.maven.org/maven2/org/mockito/mockito-core/3.3.3/mockito-core-3.3.3.jar
      [get] To: <https://builds.apache.org/job/POI-DSL-Windows-1.14/ws/lib\main-tests\mockito-core-3.3.3.jar>
      [get] Getting: https://repo1.maven.org/maven2/net/bytebuddy/byte-buddy/1.10.1/byte-buddy-1.10.1.jar
      [get] To: <https://builds.apache.org/job/POI-DSL-Windows-1.14/ws/lib\main-tests\byte-buddy-1.10.1.jar>
      [get] Getting: https://repo1.maven.org/maven2/net/bytebuddy/byte-buddy-agent/1.10.1/byte-buddy-agent-1.10.1.jar
      [get] To: <https://builds.apache.org/job/POI-DSL-Windows-1.14/ws/lib\main-tests\byte-buddy-agent-1.10.1.jar>
      [get] Getting: https://repo1.maven.org/maven2/org/objenesis/objenesis/2.6/objenesis-2.6.jar
      [get] To: <https://builds.apache.org/job/POI-DSL-Windows-1.14/ws/lib\main-tests\objenesis-2.6.jar>
    [mkdir] Created dir: <https://builds.apache.org/job/POI-DSL-Windows-1.14/ws/lib\excelant>
      [get] Getting: https://repo1.maven.org/maven2/org/apache/ant/ant/1.10.8/ant-1.10.8.jar
      [get] To: <https://builds.apache.org/job/POI-DSL-Windows-1.14/ws/lib\excelant\ant-1.10.8.jar>
      [get] Getting: https://repo1.maven.org/maven2/org/apache/ant/ant-launcher/1.10.8/ant-launcher-1.10.8.jar
      [get] To: <https://builds.apache.org/job/POI-DSL-Windows-1.14/ws/lib\excelant\ant-launcher-1.10.8.jar>
    [mkdir] Created dir: <https://builds.apache.org/job/POI-DSL-Windows-1.14/ws/lib\util>
      [get] Getting: https://repo1.maven.org/maven2/org/ow2/asm/asm/8.0.1/asm-8.0.1.jar
      [get] To: <https://builds.apache.org/job/POI-DSL-Windows-1.14/ws/lib\util\asm-8.0.1.jar>
      [get] Getting: https://repo1.maven.org/maven2/org/ow2/asm/asm-commons/8.0.1/asm-commons-8.0.1.jar
      [get] To: <https://builds.apache.org/job/POI-DSL-Windows-1.14/ws/lib\util\asm-commons-8.0.1.jar>
      [get] Getting: https://repo1.maven.org/maven2/org/ow2/asm/asm-tree/8.0.1/asm-tree-8.0.1.jar
      [get] To: <https://builds.apache.org/job/POI-DSL-Windows-1.14/ws/lib\util\asm-tree-8.0.1.jar>
      [get] Getting: https://repo1.maven.org/maven2/org/jacoco/jacoco/0.8.5/jacoco-0.8.5.zip
      [get] To: <https://builds.apache.org/job/POI-DSL-Windows-1.14/ws/lib\util\jacoco-0.8.5.zip>
      [get] Getting: https://repo1.maven.org/maven2/org/apache/commons/commons-collections4/4.4/commons-collections4-4.4.jar
      [get] To: <https://builds.apache.org/job/POI-DSL-Windows-1.14/ws/lib\main\commons-collections4-4.4.jar>
      [get] Getting: https://repo1.maven.org/maven2/org/apache/commons/commons-math3/3.6.1/commons-math3-3.6.1.jar
      [get] To: <https://builds.apache.org/job/POI-DSL-Windows-1.14/ws/lib\main\commons-math3-3.6.1.jar>
      [get] Getting: https://repo1.maven.org/maven2/com/zaxxer/SparseBitSet/1.2/SparseBitSet-1.2.jar
      [get] To: <https://builds.apache.org/job/POI-DSL-Windows-1.14/ws/lib\main\SparseBitSet-1.2.jar>
    [unzip] Expanding: <https://builds.apache.org/job/POI-DSL-Windows-1.14/ws/lib\util\jacoco-0.8.5.zip> into <https://builds.apache.org/job/POI-DSL-Windows-1.14/ws/lib\util>
      [get] Getting: https://repo1.maven.org/maven2/org/apache/rat/apache-rat/0.12/apache-rat-0.12.jar
      [get] To: <https://builds.apache.org/job/POI-DSL-Windows-1.14/ws/lib\util\apache-rat-0.12.jar>
      [get] Getting: https://repo1.maven.org/maven2/de/thetaphi/forbiddenapis/2.6/forbiddenapis-2.6.jar
      [get] To: <https://builds.apache.org/job/POI-DSL-Windows-1.14/ws/lib\util\forbiddenapis-2.6.jar>
    [mkdir] Created dir: <https://builds.apache.org/job/POI-DSL-Windows-1.14/ws/lib\ooxml-provided>
      [get] Getting: https://repo1.maven.org/maven2/org/bouncycastle/bcprov-ext-jdk15on/1.66/bcprov-ext-jdk15on-1.66.jar
      [get] To: <https://builds.apache.org/job/POI-DSL-Windows-1.14/ws/lib\ooxml-provided\bcprov-ext-jdk15on-1.66.jar>
      [get] Getting: https://repo1.maven.org/maven2/org/bouncycastle/bcpkix-jdk15on/1.66/bcpkix-jdk15on-1.66.jar
      [get] To: <https://builds.apache.org/job/POI-DSL-Windows-1.14/ws/lib\ooxml-provided\bcpkix-jdk15on-1.66.jar>
      [get] Getting: https://repo1.maven.org/maven2/org/apache/santuario/xmlsec/2.1.5/xmlsec-2.1.5.jar
      [get] To: <https://builds.apache.org/job/POI-DSL-Windows-1.14/ws/lib\ooxml-provided\xmlsec-2.1.5.jar>
      [get] Getting: https://repo1.maven.org/maven2/org/slf4j/slf4j-api/1.7.30/slf4j-api-1.7.30.jar
      [get] To: <https://builds.apache.org/job/POI-DSL-Windows-1.14/ws/lib\ooxml-provided\slf4j-api-1.7.30.jar>

check-ooxml-jars:

fetch-ooxml-jars:
      [get] Getting: https://repo1.maven.org/maven2/com/github/virtuald/curvesapi/1.06/curvesapi-1.06.jar
      [get] To: <https://builds.apache.org/job/POI-DSL-Windows-1.14/ws/lib\ooxml\curvesapi-1.06.jar>
      [get] Getting: https://builds.apache.org/view/P/view/POI/job/POI-XMLBeans-DSL-1.8/lastSuccessfulBuild/artifact/build/xmlbeans-4.0.0.jar
      [get] To: <https://builds.apache.org/job/POI-DSL-Windows-1.14/ws/lib\ooxml\xmlbeans-4.0.0.jar>
      [get] Getting: https://repo1.maven.org/maven2/org/apache/commons/commons-compress/1.20/commons-compress-1.20.jar
      [get] To: <https://builds.apache.org/job/POI-DSL-Windows-1.14/ws/lib\ooxml\commons-compress-1.20.jar>
      [get] Getting: https://repo1.maven.org/maven2/org/reflections/reflections/0.9.11/reflections-0.9.11.jar
      [get] To: <https://builds.apache.org/job/POI-DSL-Windows-1.14/ws/lib\ooxml-tests\reflections-0.9.11.jar>
      [get] Getting: https://repo1.maven.org/maven2/com/google/guava/guava/29.0-jre/guava-29.0-jre.jar
      [get] To: <https://builds.apache.org/job/POI-DSL-Windows-1.14/ws/lib\ooxml-tests\guava-29.0-jre.jar>
      [get] Getting: https://repo1.maven.org/maven2/org/javassist/javassist/3.21.0-GA/javassist-3.21.0-GA.jar
      [get] To: <https://builds.apache.org/job/POI-DSL-Windows-1.14/ws/lib\ooxml-tests\javassist-3.21.0-GA.jar>
      [get] Getting: https://repo1.maven.org/maven2/org/apache/xmlgraphics/batik-all/1.12/batik-all-1.12.jar
      [get] To: <https://builds.apache.org/job/POI-DSL-Windows-1.14/ws/lib\ooxml-provided\batik-all-1.12.jar>
      [get] Getting: https://repo1.maven.org/maven2/xml-apis/xml-apis-ext/1.3.04/xml-apis-ext-1.3.04.jar
      [get] To: <https://builds.apache.org/job/POI-DSL-Windows-1.14/ws/lib\ooxml-provided\xml-apis-ext-1.3.04.jar>
      [get] Getting: https://repo1.maven.org/maven2/org/apache/xmlgraphics/xmlgraphics-commons/2.3/xmlgraphics-commons-2.3.jar
      [get] To: <https://builds.apache.org/job/POI-DSL-Windows-1.14/ws/lib\ooxml-provided\xmlgraphics-commons-2.3.jar>

init:
    [mkdir] Created dir: <https://builds.apache.org/job/POI-DSL-Windows-1.14/ws/build>
    [mkdir] Created dir: <https://builds.apache.org/job/POI-DSL-Windows-1.14/ws/build\classes>
    [mkdir] Created dir: <https://builds.apache.org/job/POI-DSL-Windows-1.14/ws/build\test-classes>
    [mkdir] Created dir: <https://builds.apache.org/job/POI-DSL-Windows-1.14/ws/build\test-results>
    [mkdir] Created dir: <https://builds.apache.org/job/POI-DSL-Windows-1.14/ws/build\scratchpad-classes>
    [mkdir] Created dir: <https://builds.apache.org/job/POI-DSL-Windows-1.14/ws/build\scratchpad-test-classes>
    [mkdir] Created dir: <https://builds.apache.org/job/POI-DSL-Windows-1.14/ws/build\scratchpad-test-results>
    [mkdir] Created dir: <https://builds.apache.org/job/POI-DSL-Windows-1.14/ws/build\geometry-java>
    [mkdir] Created dir: <https://builds.apache.org/job/POI-DSL-Windows-1.14/ws/build\ooxml-classes>
    [mkdir] Created dir: <https://builds.apache.org/job/POI-DSL-Windows-1.14/ws/build\ooxml-test-classes>
    [mkdir] Created dir: <https://builds.apache.org/job/POI-DSL-Windows-1.14/ws/build\ooxml-test-results>
    [mkdir] Created dir: <https://builds.apache.org/job/POI-DSL-Windows-1.14/ws/build\excelant-classes>
    [mkdir] Created dir: <https://builds.apache.org/job/POI-DSL-Windows-1.14/ws/build\excelant-test-classes>
    [mkdir] Created dir: <https://builds.apache.org/job/POI-DSL-Windows-1.14/ws/build\excelant-test-results>
    [mkdir] Created dir: <https://builds.apache.org/job/POI-DSL-Windows-1.14/ws/build\examples-classes>
    [mkdir] Created dir: <https://builds.apache.org/job/POI-DSL-Windows-1.14/ws/build\integration-test-classes>
    [mkdir] Created dir: <https://builds.apache.org/job/POI-DSL-Windows-1.14/ws/build\integration-test-results>
    [mkdir] Created dir: <https://builds.apache.org/job/POI-DSL-Windows-1.14/ws/build\dist>
    [mkdir] Created dir: <https://builds.apache.org/job/POI-DSL-Windows-1.14/ws/build\site>
     [echo] Using Ant: Apache Ant(TM) version 1.10.5 compiled on July 10 2018 from F:\\jenkins\\tools\\ant\\latest1.10, Ant detected Java 14 (may be different than actual Java sometimes...)
     [echo] Using Java: 14-ea/14-ea+6-171/14-ea+6-171/OpenJDK 64-Bit Server VM from Oracle Corporation on Windows Server 2016: 10.0
     [echo] Building Apache POI version 5.0.0-SNAPSHOT and RC: RC1
[release_tag] Warning: Nashorn engine is planned to be removed from a future JDK release

-version-java-check:

compile-version:
     [copy] Copying 1 file to <https://builds.apache.org/job/POI-DSL-Windows-1.14/ws/build\classes\org\apache\poi>
    [javac] Compiling 1 source file to <https://builds.apache.org/job/POI-DSL-Windows-1.14/ws/build\classes>
    [javac] warning: [options] bootstrap class path not set in conjunction with -source 8
    [javac] 1 warning
   [delete] Deleting: <https://builds.apache.org/job/POI-DSL-Windows-1.14/ws/build\classes\org\apache\poi\Version.java>

compile-main:

BUILD FAILED
<https://builds.apache.org/job/POI-DSL-Windows-1.14/ws/build.xml>:998: The following error occurred while executing this line:
<https://builds.apache.org/job/POI-DSL-Windows-1.14/ws/build.xml>:850: java.util.regex.PatternSyntaxException: Illegal/unsupported escape sequence near index 4
^<https://builds.apache.org/job/POI-DSL-Windows-1.14/ws/[/\\](.*)$>
    ^
        at java.base/java.util.regex.Pattern.error(Pattern.java:2015)
        at java.base/java.util.regex.Pattern.escape(Pattern.java:2606)
        at java.base/java.util.regex.Pattern.atom(Pattern.java:2273)
        at java.base/java.util.regex.Pattern.sequence(Pattern.java:2197)
        at java.base/java.util.regex.Pattern.expr(Pattern.java:2056)
        at java.base/java.util.regex.Pattern.compile(Pattern.java:1778)
        at java.base/java.util.regex.Pattern.<init>(Pattern.java:1428)
        at java.base/java.util.regex.Pattern.compile(Pattern.java:1095)
        at org.apache.tools.ant.util.regexp.Jdk14RegexpMatcher.getCompiledPattern(Jdk14RegexpMatcher.java:65)
        at org.apache.tools.ant.util.regexp.Jdk14RegexpMatcher.matches(Jdk14RegexpMatcher.java:93)
        at org.apache.tools.ant.util.RegexpPatternMapper.mapFileName(RegexpPatternMapper.java:127)
        at org.apache.tools.ant.util.CompositeMapper.lambda$mapFileName$0(CompositeMapper.java:32)
        at java.base/java.util.stream.ReferencePipeline$3$1.accept(ReferencePipeline.java:195)
        at java.base/java.util.stream.ReferencePipeline$2$1.accept(ReferencePipeline.java:177)
        at java.base/java.util.ArrayList$ArrayListSpliterator.forEachRemaining(ArrayList.java:1621)
        at java.base/java.util.stream.AbstractPipeline.copyInto(AbstractPipeline.java:484)
        at java.base/java.util.stream.AbstractPipeline.wrapAndCopyInto(AbstractPipeline.java:474)
        at java.base/java.util.stream.AbstractPipeline.evaluate(AbstractPipeline.java:550)
        at java.base/java.util.stream.AbstractPipeline.evaluateToArrayNode(AbstractPipeline.java:260)
        at java.base/java.util.stream.ReferencePipeline.toArray(ReferencePipeline.java:517)
        at org.apache.tools.ant.util.CompositeMapper.mapFileName(CompositeMapper.java:33)
        at org.apache.tools.ant.taskdefs.PathConvert.execute(PathConvert.java:363)
        at org.apache.tools.ant.UnknownElement.execute(UnknownElement.java:292)
        at jdk.internal.reflect.GeneratedMethodAccessor4.invoke(Unknown Source)
        at java.base/jdk.internal.reflect.DelegatingMethodAccessorImpl.invoke(DelegatingMethodAccessorImpl.java:43)
        at java.base/java.lang.reflect.Method.invoke(Method.java:567)
        at org.apache.tools.ant.dispatch.DispatchUtils.execute(DispatchUtils.java:99)
        at org.apache.tools.ant.Task.perform(Task.java:350)
        at java.base/java.util.Vector.forEach(Vector.java:1354)
        at org.apache.tools.ant.taskdefs.Sequential.execute(Sequential.java:67)
        at org.apache.tools.ant.UnknownElement.execute(UnknownElement.java:292)
        at jdk.internal.reflect.GeneratedMethodAccessor4.invoke(Unknown Source)
        at java.base/jdk.internal.reflect.DelegatingMethodAccessorImpl.invoke(DelegatingMethodAccessorImpl.java:43)
        at java.base/java.lang.reflect.Method.invoke(Method.java:567)
        at org.apache.tools.ant.dispatch.DispatchUtils.execute(DispatchUtils.java:99)
        at org.apache.tools.ant.Task.perform(Task.java:350)
        at org.apache.tools.ant.taskdefs.MacroInstance.execute(MacroInstance.java:391)
        at org.apache.tools.ant.UnknownElement.execute(UnknownElement.java:292)
        at jdk.internal.reflect.GeneratedMethodAccessor4.invoke(Unknown Source)
        at java.base/jdk.internal.reflect.DelegatingMethodAccessorImpl.invoke(DelegatingMethodAccessorImpl.java:43)
        at java.base/java.lang.reflect.Method.invoke(Method.java:567)
        at org.apache.tools.ant.dispatch.DispatchUtils.execute(DispatchUtils.java:99)
        at org.apache.tools.ant.Task.perform(Task.java:350)
        at org.apache.tools.ant.Target.execute(Target.java:449)
        at org.apache.tools.ant.Target.performTasks(Target.java:470)
        at org.apache.tools.ant.Project.executeSortedTargets(Project.java:1388)
        at org.apache.tools.ant.Project.executeTarget(Project.java:1361)
        at org.apache.tools.ant.helper.DefaultExecutor.executeTargets(DefaultExecutor.java:41)
        at org.apache.tools.ant.Project.executeTargets(Project.java:1251)
        at org.apache.tools.ant.Main.runBuild(Main.java:834)
        at org.apache.tools.ant.Main.startAnt(Main.java:223)
        at org.apache.tools.ant.launch.Launcher.run(Launcher.java:284)
        at org.apache.tools.ant.launch.Launcher.main(Launcher.java:101)

Total time: 6 seconds
Build step 'Invoke Ant' marked build as failure
Skipping publisher since build result is FAILURE
Archiving artifacts
[Fast Archiver] Compressed 3.04 MB of artifacts by 22.6% relative to #38
Skipping publisher since build result is FAILURE
Recording test results
ERROR: Step ‘Publish JUnit test result report’ failed: No test report files were found. Configuration error?

---------------------------------------------------------------------
To unsubscribe, e-mail: [hidden email]
For additional commands, e-mail: [hidden email]

Reply | Threaded
Open this post in threaded view
|

Build failed in Jenkins: POI-DSL-Windows-1.14 #41

Apache Jenkins Server
See <https://builds.apache.org/job/POI-DSL-Windows-1.14/41/display/redirect?page=changes>

Changes:

[kiwiwings] try to fix windows builds - path issues with regex patterns


------------------------------------------
[...truncated 3.83 KB...]
07/24/2019  08:16 AM    <DIR>          bin
07/24/2019  08:16 AM    <DIR>          conf
07/24/2019  08:16 AM    <DIR>          include
07/24/2019  08:16 AM    <DIR>          jmods
07/24/2019  08:16 AM    <DIR>          legal
07/24/2019  08:16 AM    <DIR>          lib
07/17/2019  03:16 AM             1,213 release
               1 File(s)          1,213 bytes
               8 Dir(s)  1,946,442,706,944 bytes free
openjdk version "14-ea" 2020-03-17
OpenJDK Runtime Environment (build 14-ea+6-171)
OpenJDK 64-Bit Server VM (build 14-ea+6-171, mixed mode, sharing)
[POI-DSL-Windows-1.14] $ cmd.exe /C "F:\jenkins\tools\ant\latest1.10\bin\ant.bat -Dcoverage.enabled=true clean jenkins && exit %%ERRORLEVEL%%"
Buildfile: <https://builds.apache.org/job/POI-DSL-Windows-1.14/ws/build.xml>
[propertyreset] Warning: Nashorn engine is planned to be removed from a future JDK release
[propertyreset] Warning: Nashorn engine is planned to be removed from a future JDK release

clean:
   [delete] Deleting directory <https://builds.apache.org/job/POI-DSL-Windows-1.14/ws/build>

replaceVersion:

check-jars:

fetch-jars:

check-ooxml-jars:

fetch-ooxml-jars:
      [get] Destination already exists (skipping): <https://builds.apache.org/job/POI-DSL-Windows-1.14/ws/lib\ooxml\curvesapi-1.06.jar>
      [get] Getting: https://builds.apache.org/view/P/view/POI/job/POI-XMLBeans-DSL-1.8/lastSuccessfulBuild/artifact/build/xmlbeans-4.0.0.jar
      [get] To: <https://builds.apache.org/job/POI-DSL-Windows-1.14/ws/lib\ooxml\xmlbeans-4.0.0.jar>
      [get] Destination already exists (skipping): <https://builds.apache.org/job/POI-DSL-Windows-1.14/ws/lib\ooxml\commons-compress-1.20.jar>
      [get] Destination already exists (skipping): <https://builds.apache.org/job/POI-DSL-Windows-1.14/ws/lib\ooxml-tests\reflections-0.9.11.jar>
      [get] Destination already exists (skipping): <https://builds.apache.org/job/POI-DSL-Windows-1.14/ws/lib\ooxml-tests\guava-29.0-jre.jar>
      [get] Destination already exists (skipping): <https://builds.apache.org/job/POI-DSL-Windows-1.14/ws/lib\ooxml-tests\javassist-3.21.0-GA.jar>
      [get] Destination already exists (skipping): <https://builds.apache.org/job/POI-DSL-Windows-1.14/ws/lib\ooxml-provided\batik-all-1.12.jar>
      [get] Destination already exists (skipping): <https://builds.apache.org/job/POI-DSL-Windows-1.14/ws/lib\ooxml-provided\xml-apis-ext-1.3.04.jar>
      [get] Destination already exists (skipping): <https://builds.apache.org/job/POI-DSL-Windows-1.14/ws/lib\ooxml-provided\xmlgraphics-commons-2.3.jar>

init:
    [mkdir] Created dir: <https://builds.apache.org/job/POI-DSL-Windows-1.14/ws/build>
    [mkdir] Created dir: <https://builds.apache.org/job/POI-DSL-Windows-1.14/ws/build\classes>
    [mkdir] Created dir: <https://builds.apache.org/job/POI-DSL-Windows-1.14/ws/build\test-classes>
    [mkdir] Created dir: <https://builds.apache.org/job/POI-DSL-Windows-1.14/ws/build\test-results>
    [mkdir] Created dir: <https://builds.apache.org/job/POI-DSL-Windows-1.14/ws/build\scratchpad-classes>
    [mkdir] Created dir: <https://builds.apache.org/job/POI-DSL-Windows-1.14/ws/build\scratchpad-test-classes>
    [mkdir] Created dir: <https://builds.apache.org/job/POI-DSL-Windows-1.14/ws/build\scratchpad-test-results>
    [mkdir] Created dir: <https://builds.apache.org/job/POI-DSL-Windows-1.14/ws/build\geometry-java>
    [mkdir] Created dir: <https://builds.apache.org/job/POI-DSL-Windows-1.14/ws/build\ooxml-classes>
    [mkdir] Created dir: <https://builds.apache.org/job/POI-DSL-Windows-1.14/ws/build\ooxml-test-classes>
    [mkdir] Created dir: <https://builds.apache.org/job/POI-DSL-Windows-1.14/ws/build\ooxml-test-results>
    [mkdir] Created dir: <https://builds.apache.org/job/POI-DSL-Windows-1.14/ws/build\excelant-classes>
    [mkdir] Created dir: <https://builds.apache.org/job/POI-DSL-Windows-1.14/ws/build\excelant-test-classes>
    [mkdir] Created dir: <https://builds.apache.org/job/POI-DSL-Windows-1.14/ws/build\excelant-test-results>
    [mkdir] Created dir: <https://builds.apache.org/job/POI-DSL-Windows-1.14/ws/build\examples-classes>
    [mkdir] Created dir: <https://builds.apache.org/job/POI-DSL-Windows-1.14/ws/build\integration-test-classes>
    [mkdir] Created dir: <https://builds.apache.org/job/POI-DSL-Windows-1.14/ws/build\integration-test-results>
    [mkdir] Created dir: <https://builds.apache.org/job/POI-DSL-Windows-1.14/ws/build\dist>
    [mkdir] Created dir: <https://builds.apache.org/job/POI-DSL-Windows-1.14/ws/build\site>
     [echo] Using Ant: Apache Ant(TM) version 1.10.5 compiled on July 10 2018 from F:\\jenkins\\tools\\ant\\latest1.10, Ant detected Java 14 (may be different than actual Java sometimes...)
     [echo] Using Java: 14-ea/14-ea+6-171/14-ea+6-171/OpenJDK 64-Bit Server VM from Oracle Corporation on Windows Server 2016: 10.0
     [echo] Building Apache POI version 5.0.0-SNAPSHOT and RC: RC1
[release_tag] Warning: Nashorn engine is planned to be removed from a future JDK release

-version-java-check:

compile-version:
     [copy] Copying 1 file to <https://builds.apache.org/job/POI-DSL-Windows-1.14/ws/build\classes\org\apache\poi>
    [javac] Compiling 1 source file to <https://builds.apache.org/job/POI-DSL-Windows-1.14/ws/build\classes>
    [javac] warning: [options] bootstrap class path not set in conjunction with -source 8
    [javac] 1 warning
   [delete] Deleting: <https://builds.apache.org/job/POI-DSL-Windows-1.14/ws/build\classes\org\apache\poi\Version.java>

compile-main:
    [javac] Compiling 1174 source files to <https://builds.apache.org/job/POI-DSL-Windows-1.14/ws/build\classes>
    [javac] Ignoring source, target and bootclasspath as release has been set
    [javac] Note: Some input files use or override a deprecated API.
    [javac] Note: Recompile with -Xlint:deprecation for details.
    [javac] Note: Some input files use unchecked or unsafe operations.
    [javac] Note: Recompile with -Xlint:unchecked for details.
    [javac] Creating empty <https://builds.apache.org/job/POI-DSL-Windows-1.14/ws/build\classes\org\apache\poi\ddf\package-info.class>
    [javac] Creating empty <https://builds.apache.org/job/POI-DSL-Windows-1.14/ws/build\classes\org\apache\poi\hssf\package-info.class>
    [javac] Creating empty <https://builds.apache.org/job/POI-DSL-Windows-1.14/ws/build\classes\org\apache\poi\poifs\dev\package-info.class>
    [javac] Creating empty <https://builds.apache.org/job/POI-DSL-Windows-1.14/ws/build\classes\org\apache\poi\util\package-info.class>
    [javac] Creating empty <https://builds.apache.org/job/POI-DSL-Windows-1.14/ws/build\classes\org\apache\poi\poifs\common\package-info.class>
    [javac] Creating empty <https://builds.apache.org/job/POI-DSL-Windows-1.14/ws/build\classes\org\apache\poi\hssf\record\package-info.class>
    [javac] Creating empty <https://builds.apache.org/job/POI-DSL-Windows-1.14/ws/build\classes\org\apache\poi\poifs\package-info.class>
    [javac] Creating empty <https://builds.apache.org/job/POI-DSL-Windows-1.14/ws/build\classes\org\apache\poi\poifs\crypt\package-info.class>
    [javac] Creating empty <https://builds.apache.org/job/POI-DSL-Windows-1.14/ws/build\classes\org\apache\poi\hpsf\wellknown\package-info.class>
    [javac] Creating empty <https://builds.apache.org/job/POI-DSL-Windows-1.14/ws/build\classes\org\apache\poi\hssf\dev\package-info.class>
    [javac] Creating empty <https://builds.apache.org/job/POI-DSL-Windows-1.14/ws/build\classes\org\apache\poi\ss\formula\package-info.class>
    [javac] Creating empty <https://builds.apache.org/job/POI-DSL-Windows-1.14/ws/build\classes\org\apache\poi\hpsf\package-info.class>
    [javac] Creating empty <https://builds.apache.org/job/POI-DSL-Windows-1.14/ws/build\classes\org\apache\poi\poifs\property\package-info.class>
    [javac] Creating empty <https://builds.apache.org/job/POI-DSL-Windows-1.14/ws/build\classes\org\apache\poi\poifs\filesystem\package-info.class>
    [javac] Creating empty <https://builds.apache.org/job/POI-DSL-Windows-1.14/ws/build\classes\org\apache\poi\ss\formula\ptg\package-info.class>
    [javac] Creating empty <https://builds.apache.org/job/POI-DSL-Windows-1.14/ws/build\classes\org\apache\poi\poifs\storage\package-info.class>
    [javac] Creating empty <https://builds.apache.org/job/POI-DSL-Windows-1.14/ws/build\classes\org\apache\poi\hssf\eventusermodel\package-info.class>
    [javac] Creating empty <https://builds.apache.org/job/POI-DSL-Windows-1.14/ws/build\classes\org\apache\poi\hssf\record\aggregates\package-info.class>
    [javac] Creating empty <https://builds.apache.org/job/POI-DSL-Windows-1.14/ws/build\classes\org\apache\poi\ss\format\package-info.class>
    [javac] Creating empty <https://builds.apache.org/job/POI-DSL-Windows-1.14/ws/build\classes\org\apache\poi\hssf\model\package-info.class>
    [javac] Creating empty <https://builds.apache.org/job/POI-DSL-Windows-1.14/ws/build\classes\org\apache\poi\hssf\usermodel\package-info.class>
    [javac] Creating empty <https://builds.apache.org/job/POI-DSL-Windows-1.14/ws/build\classes\org\apache\poi\hssf\util\package-info.class>
    [javac] Creating empty <https://builds.apache.org/job/POI-DSL-Windows-1.14/ws/build\classes\org\apache\poi\poifs\eventfilesystem\package-info.class>
    [javac] Compiling 1 source file to <https://builds.apache.org/job/POI-DSL-Windows-1.14/ws/src\multimodule\poi\java9>
    [mkdir] Created dir: <https://builds.apache.org/job/POI-DSL-Windows-1.14/ws/build\dist\maven\poi>
      [jar] Building jar: <https://builds.apache.org/job/POI-DSL-Windows-1.14/ws/build\dist\maven\poi\poi-5.0.0-SNAPSHOT.jar>
    [javac] Compiling 549 source files to <https://builds.apache.org/job/POI-DSL-Windows-1.14/ws/build\test-classes>
    [javac] Ignoring source, target and bootclasspath as release has been set
    [javac] Note: Some input files use or override a deprecated API.
    [javac] Note: Recompile with -Xlint:deprecation for details.
    [javac] Compiling 1 source file to <https://builds.apache.org/job/POI-DSL-Windows-1.14/ws/src\multimodule\poi\test9>
      [jar] Building jar: <https://builds.apache.org/job/POI-DSL-Windows-1.14/ws/build\dist\maven\poi-tests\poi-5.0.0-SNAPSHOT-tests.jar>
      [jar] Building jar: <https://builds.apache.org/job/POI-DSL-Windows-1.14/ws/build\dist\maven\poi\poi-5.0.0-SNAPSHOT-sources.jar>

compile-scratchpad:
    [javac] Compiling 513 source files to <https://builds.apache.org/job/POI-DSL-Windows-1.14/ws/build\scratchpad-classes>
    [javac] Ignoring source, target and bootclasspath as release has been set
    [javac] Note: Some input files use or override a deprecated API.
    [javac] Note: Recompile with -Xlint:deprecation for details.
    [javac] Note: Some input files use unchecked or unsafe operations.
    [javac] Note: Recompile with -Xlint:unchecked for details.
    [javac] Compiling 1 source file to <https://builds.apache.org/job/POI-DSL-Windows-1.14/ws/src\multimodule\scratchpad\java9>
    [javac] <https://builds.apache.org/job/POI-DSL-Windows-1.14/ws/src\multimodule\scratchpad\java9\module-info.java>:19: warning: requires transitive directive for an automatic module
    [javac]     requires transitive org.apache.poi.poi;
    [javac]                                       ^
    [javac] 1 warning
    [mkdir] Created dir: <https://builds.apache.org/job/POI-DSL-Windows-1.14/ws/build\dist\maven\poi-scratchpad>
      [jar] Building jar: <https://builds.apache.org/job/POI-DSL-Windows-1.14/ws/build\dist\maven\poi-scratchpad\poi-scratchpad-5.0.0-SNAPSHOT.jar>
    [javac] Compiling 202 source files to <https://builds.apache.org/job/POI-DSL-Windows-1.14/ws/build\scratchpad-test-classes>
    [javac] Ignoring source, target and bootclasspath as release has been set
    [javac] Note: Some input files use or override a deprecated API.
    [javac] Note: Recompile with -Xlint:deprecation for details.
    [javac] Note: <https://builds.apache.org/job/POI-DSL-Windows-1.14/ws/src\scratchpad\testcases\org\apache\poi\hslf\usermodel\TestBugs.java> uses unchecked or unsafe operations.
    [javac] Note: Recompile with -Xlint:unchecked for details.
    [javac] Compiling 1 source file to <https://builds.apache.org/job/POI-DSL-Windows-1.14/ws/src\multimodule\scratchpad\test9>
    [javac] <https://builds.apache.org/job/POI-DSL-Windows-1.14/ws/src\multimodule\scratchpad\test9\module-info.java>:19: warning: requires transitive directive for an automatic module
    [javac]     requires transitive org.apache.poi.poi;
    [javac]                                       ^
    [javac] 1 warning
      [jar] Building jar: <https://builds.apache.org/job/POI-DSL-Windows-1.14/ws/build\dist\maven\poi-scratchpad-tests\poi-scratchpad-5.0.0-SNAPSHOT-tests.jar>
      [jar] Building jar: <https://builds.apache.org/job/POI-DSL-Windows-1.14/ws/build\dist\maven\poi-scratchpad\poi-scratchpad-5.0.0-SNAPSHOT-sources.jar>

check-compiled-ooxml-xsds:

compile-ooxml-xsds:
    [mkdir] Created dir: <https://builds.apache.org/job/POI-DSL-Windows-1.14/ws/build\xmlbean-xsds>
     [copy] Copying 7 files to <https://builds.apache.org/job/POI-DSL-Windows-1.14/ws/build\xmlbean-xsds>
     [copy] Copying 89 resources to <https://builds.apache.org/job/POI-DSL-Windows-1.14/ws/build\xmlbean-xsds>
    [mkdir] Created dir: <https://builds.apache.org/job/POI-DSL-Windows-1.14/ws/build\xmlbean-sources>
    [mkdir] Created dir: <https://builds.apache.org/job/POI-DSL-Windows-1.14/ws/build\xmlbean-classes>
  [xmlbean] SchemaCompiler  Metadata LOAD:org/apache/xmlbeans/metadata GEN:org/apache/poi/schemas/ooxml
  [xmlbean] Time to build schema type system: 4.243 seconds
  [xmlbean] Time to generate code: 14.271 seconds
    [javac] Compiling 4908 source files to <https://builds.apache.org/job/POI-DSL-Windows-1.14/ws/build\xmlbean-classes>
    [javac] Ignoring source, target and bootclasspath as release has been set
    [javac] Compiling 1 source file to <https://builds.apache.org/job/POI-DSL-Windows-1.14/ws/src\multimodule\ooxml-schemas\java9>
    [javac] <https://builds.apache.org/job/POI-DSL-Windows-1.14/ws/src\multimodule\ooxml-schemas\java9\module-info.java>:22: warning: requires transitive directive for an automatic module
    [javac]     requires transitive org.apache.xmlbeans;
    [javac]                                   ^
    [javac] 1 warning
    [mkdir] Created dir: <https://builds.apache.org/job/POI-DSL-Windows-1.14/ws/build\dist\maven\ooxml-schemas>
      [jar] Building jar: <https://builds.apache.org/job/POI-DSL-Windows-1.14/ws/build\dist\maven\ooxml-schemas\ooxml-schemas-1.5.jar>
      [jar] Building jar: <https://builds.apache.org/job/POI-DSL-Windows-1.14/ws/build\dist\maven\ooxml-schemas\ooxml-schemas-1.5-sources.jar>

compile-ooxml:
    [javac] Compiling 612 source files to <https://builds.apache.org/job/POI-DSL-Windows-1.14/ws/build\ooxml-classes>
    [javac] Ignoring source, target and bootclasspath as release has been set
    [javac] Note: Some input files use or override a deprecated API.
    [javac] Note: Recompile with -Xlint:deprecation for details.
    [javac] Note: <https://builds.apache.org/job/POI-DSL-Windows-1.14/ws/src\ooxml\java\org\apache\poi\xslf\draw\SVGImageRenderer.java> uses unchecked or unsafe operations.
    [javac] Note: Recompile with -Xlint:unchecked for details.
    [javac] Creating empty <https://builds.apache.org/job/POI-DSL-Windows-1.14/ws/build\ooxml-classes\org\apache\poi\xwpf\package-info.class>
    [javac] Creating empty <https://builds.apache.org/job/POI-DSL-Windows-1.14/ws/build\ooxml-classes\org\apache\poi\xssf\binary\package-info.class>
    [javac] Compiling 1 source file to <https://builds.apache.org/job/POI-DSL-Windows-1.14/ws/src\multimodule\ooxml\java9>
    [javac] <https://builds.apache.org/job/POI-DSL-Windows-1.14/ws/src\multimodule\ooxml\java9\module-info.java>:19: warning: requires transitive directive for an automatic module
    [javac]     requires transitive org.apache.poi.poi;
    [javac]                                       ^
    [javac] <https://builds.apache.org/job/POI-DSL-Windows-1.14/ws/src\multimodule\ooxml\java9\module-info.java>:20: warning: requires transitive directive for an automatic module
    [javac]     requires transitive org.apache.xmlbeans;
    [javac]                                   ^
    [javac] <https://builds.apache.org/job/POI-DSL-Windows-1.14/ws/src\multimodule\ooxml\java9\module-info.java>:21: warning: requires transitive directive for an automatic module
    [javac]     requires transitive org.apache.poi.ooxml.schemas;
    [javac]                                             ^
    [javac] 3 warnings
    [mkdir] Created dir: <https://builds.apache.org/job/POI-DSL-Windows-1.14/ws/build\dist\maven\poi-ooxml>
      [jar] Building jar: <https://builds.apache.org/job/POI-DSL-Windows-1.14/ws/build\dist\maven\poi-ooxml\poi-ooxml-5.0.0-SNAPSHOT.jar>
    [javac] Compiling 270 source files to <https://builds.apache.org/job/POI-DSL-Windows-1.14/ws/build\ooxml-test-classes>
    [javac] Ignoring source, target and bootclasspath as release has been set
    [javac] Note: Some input files use or override a deprecated API.
    [javac] Note: Recompile with -Xlint:deprecation for details.
    [javac] Note: Some input files use unchecked or unsafe operations.
    [javac] Note: Recompile with -Xlint:unchecked for details.
    [javac] Compiling 1 source file to <https://builds.apache.org/job/POI-DSL-Windows-1.14/ws/src\multimodule\ooxml\test9>
    [javac] <https://builds.apache.org/job/POI-DSL-Windows-1.14/ws/src\multimodule\ooxml\test9\module-info.java>:19: warning: requires transitive directive for an automatic module
    [javac]     requires transitive org.apache.poi.poi;
    [javac]                                       ^
    [javac] <https://builds.apache.org/job/POI-DSL-Windows-1.14/ws/src\multimodule\ooxml\test9\module-info.java>:20: warning: requires transitive directive for an automatic module
    [javac]     requires transitive org.apache.xmlbeans;
    [javac]                                   ^
    [javac] <https://builds.apache.org/job/POI-DSL-Windows-1.14/ws/src\multimodule\ooxml\test9\module-info.java>:21: warning: requires transitive directive for an automatic module
    [javac]     requires transitive org.apache.poi.ooxml.schemas;
    [javac]                                             ^
    [javac] 3 warnings
      [jar] Building jar: <https://builds.apache.org/job/POI-DSL-Windows-1.14/ws/build\dist\maven\poi-ooxml-tests\poi-ooxml-5.0.0-SNAPSHOT-tests.jar>
      [jar] Building jar: <https://builds.apache.org/job/POI-DSL-Windows-1.14/ws/build\dist\maven\poi-ooxml\poi-ooxml-5.0.0-SNAPSHOT-sources.jar>
    [javac] Compiling 1 source file to <https://builds.apache.org/job/POI-DSL-Windows-1.14/ws/src\multimodule\ooxml-lite-agent\java9>
      [jar] Building jar: <https://builds.apache.org/job/POI-DSL-Windows-1.14/ws/lib\ooxml-tests\ooxml-lite-agent.jar>

compile-examples:
    [javac] Compiling 133 source files to <https://builds.apache.org/job/POI-DSL-Windows-1.14/ws/build\examples-classes>
    [javac] Ignoring source, target and bootclasspath as release has been set
    [javac] Note: Some input files use or override a deprecated API.
    [javac] Note: Recompile with -Xlint:deprecation for details.
    [javac] Creating empty <https://builds.apache.org/job/POI-DSL-Windows-1.14/ws/build\examples-classes\org\apache\poi\examples\ss\html\package-info.class>
    [javac] Compiling 1 source file to <https://builds.apache.org/job/POI-DSL-Windows-1.14/ws/src\multimodule\examples\java9>
    [javac] <https://builds.apache.org/job/POI-DSL-Windows-1.14/ws/src\multimodule\examples\java9\module-info.java>:20: warning: requires transitive directive for an automatic module
    [javac]     requires transitive org.apache.poi.ooxml;
    [javac]                                       ^
    [javac] <https://builds.apache.org/job/POI-DSL-Windows-1.14/ws/src\multimodule\examples\java9\module-info.java>:21: warning: requires transitive directive for an automatic module
    [javac]     requires transitive org.apache.poi.scratchpad;
    [javac]                                       ^
    [javac] 2 warnings
    [mkdir] Created dir: <https://builds.apache.org/job/POI-DSL-Windows-1.14/ws/build\dist\maven\poi-examples>
      [jar] Building jar: <https://builds.apache.org/job/POI-DSL-Windows-1.14/ws/build\dist\maven\poi-examples\poi-examples-5.0.0-SNAPSHOT.jar>
      [jar] Building jar: <https://builds.apache.org/job/POI-DSL-Windows-1.14/ws/build\dist\maven\poi-examples\poi-examples-5.0.0-SNAPSHOT-sources.jar>

compile-excelant:
    [javac] Compiling 14 source files to <https://builds.apache.org/job/POI-DSL-Windows-1.14/ws/build\excelant-classes>
    [javac] Ignoring source, target and bootclasspath as release has been set
    [javac] Compiling 1 source file to <https://builds.apache.org/job/POI-DSL-Windows-1.14/ws/src\multimodule\excelant\java9>
    [javac] error: duplicate module on application module path
    [javac]   module in ant
    [javac] error: duplicate module on application module path
    [javac]   module in ant.launcher
    [javac] 2 errors

BUILD FAILED
<https://builds.apache.org/job/POI-DSL-Windows-1.14/ws/build.xml>:1183: The following error occurred while executing this line:
<https://builds.apache.org/job/POI-DSL-Windows-1.14/ws/build.xml>:889: Compile failed; see the compiler error output for details.

Total time: 8 minutes 12 seconds
Build step 'Invoke Ant' marked build as failure
Skipping publisher since build result is FAILURE
Archiving artifacts
[Fast Archiver] Compressed 3.04 MB of artifacts by 22.6% relative to #38
Skipping publisher since build result is FAILURE
Recording test results
ERROR: Step ‘Publish JUnit test result report’ failed: No test report files were found. Configuration error?

---------------------------------------------------------------------
To unsubscribe, e-mail: [hidden email]
For additional commands, e-mail: [hidden email]

Reply | Threaded
Open this post in threaded view
|

Build failed in Jenkins: POI-DSL-Windows-1.14 #42

Apache Jenkins Server
See <https://builds.apache.org/job/POI-DSL-Windows-1.14/42/display/redirect?page=changes>

Changes:

[kiwiwings] fix build - remove old ant libs


------------------------------------------
[...truncated 8.69 KB...]
    [mkdir] Created dir: <https://builds.apache.org/job/POI-DSL-Windows-1.14/ws/build\site>
     [echo] Using Ant: Apache Ant(TM) version 1.10.5 compiled on July 10 2018 from F:\\jenkins\\tools\\ant\\latest1.10, Ant detected Java 14 (may be different than actual Java sometimes...)
     [echo] Using Java: 14-ea/14-ea+6-171/14-ea+6-171/OpenJDK 64-Bit Server VM from Oracle Corporation on Windows Server 2016: 10.0
     [echo] Building Apache POI version 5.0.0-SNAPSHOT and RC: RC1
[release_tag] Warning: Nashorn engine is planned to be removed from a future JDK release

-version-java-check:

compile-version:
     [copy] Copying 1 file to <https://builds.apache.org/job/POI-DSL-Windows-1.14/ws/build\classes\org\apache\poi>
    [javac] Compiling 1 source file to <https://builds.apache.org/job/POI-DSL-Windows-1.14/ws/build\classes>
    [javac] warning: [options] bootstrap class path not set in conjunction with -source 8
    [javac] 1 warning
   [delete] Deleting: <https://builds.apache.org/job/POI-DSL-Windows-1.14/ws/build\classes\org\apache\poi\Version.java>

compile-main:
    [javac] Compiling 1174 source files to <https://builds.apache.org/job/POI-DSL-Windows-1.14/ws/build\classes>
    [javac] Ignoring source, target and bootclasspath as release has been set
    [javac] Note: Some input files use or override a deprecated API.
    [javac] Note: Recompile with -Xlint:deprecation for details.
    [javac] Note: Some input files use unchecked or unsafe operations.
    [javac] Note: Recompile with -Xlint:unchecked for details.
    [javac] Creating empty <https://builds.apache.org/job/POI-DSL-Windows-1.14/ws/build\classes\org\apache\poi\ddf\package-info.class>
    [javac] Creating empty <https://builds.apache.org/job/POI-DSL-Windows-1.14/ws/build\classes\org\apache\poi\hssf\package-info.class>
    [javac] Creating empty <https://builds.apache.org/job/POI-DSL-Windows-1.14/ws/build\classes\org\apache\poi\poifs\dev\package-info.class>
    [javac] Creating empty <https://builds.apache.org/job/POI-DSL-Windows-1.14/ws/build\classes\org\apache\poi\util\package-info.class>
    [javac] Creating empty <https://builds.apache.org/job/POI-DSL-Windows-1.14/ws/build\classes\org\apache\poi\poifs\common\package-info.class>
    [javac] Creating empty <https://builds.apache.org/job/POI-DSL-Windows-1.14/ws/build\classes\org\apache\poi\hssf\record\package-info.class>
    [javac] Creating empty <https://builds.apache.org/job/POI-DSL-Windows-1.14/ws/build\classes\org\apache\poi\poifs\package-info.class>
    [javac] Creating empty <https://builds.apache.org/job/POI-DSL-Windows-1.14/ws/build\classes\org\apache\poi\poifs\crypt\package-info.class>
    [javac] Creating empty <https://builds.apache.org/job/POI-DSL-Windows-1.14/ws/build\classes\org\apache\poi\hpsf\wellknown\package-info.class>
    [javac] Creating empty <https://builds.apache.org/job/POI-DSL-Windows-1.14/ws/build\classes\org\apache\poi\hssf\dev\package-info.class>
    [javac] Creating empty <https://builds.apache.org/job/POI-DSL-Windows-1.14/ws/build\classes\org\apache\poi\ss\formula\package-info.class>
    [javac] Creating empty <https://builds.apache.org/job/POI-DSL-Windows-1.14/ws/build\classes\org\apache\poi\hpsf\package-info.class>
    [javac] Creating empty <https://builds.apache.org/job/POI-DSL-Windows-1.14/ws/build\classes\org\apache\poi\poifs\property\package-info.class>
    [javac] Creating empty <https://builds.apache.org/job/POI-DSL-Windows-1.14/ws/build\classes\org\apache\poi\poifs\filesystem\package-info.class>
    [javac] Creating empty <https://builds.apache.org/job/POI-DSL-Windows-1.14/ws/build\classes\org\apache\poi\ss\formula\ptg\package-info.class>
    [javac] Creating empty <https://builds.apache.org/job/POI-DSL-Windows-1.14/ws/build\classes\org\apache\poi\poifs\storage\package-info.class>
    [javac] Creating empty <https://builds.apache.org/job/POI-DSL-Windows-1.14/ws/build\classes\org\apache\poi\hssf\eventusermodel\package-info.class>
    [javac] Creating empty <https://builds.apache.org/job/POI-DSL-Windows-1.14/ws/build\classes\org\apache\poi\hssf\record\aggregates\package-info.class>
    [javac] Creating empty <https://builds.apache.org/job/POI-DSL-Windows-1.14/ws/build\classes\org\apache\poi\ss\format\package-info.class>
    [javac] Creating empty <https://builds.apache.org/job/POI-DSL-Windows-1.14/ws/build\classes\org\apache\poi\hssf\model\package-info.class>
    [javac] Creating empty <https://builds.apache.org/job/POI-DSL-Windows-1.14/ws/build\classes\org\apache\poi\hssf\usermodel\package-info.class>
    [javac] Creating empty <https://builds.apache.org/job/POI-DSL-Windows-1.14/ws/build\classes\org\apache\poi\hssf\util\package-info.class>
    [javac] Creating empty <https://builds.apache.org/job/POI-DSL-Windows-1.14/ws/build\classes\org\apache\poi\poifs\eventfilesystem\package-info.class>
    [mkdir] Created dir: <https://builds.apache.org/job/POI-DSL-Windows-1.14/ws/build\dist\maven\poi>
      [jar] Building jar: <https://builds.apache.org/job/POI-DSL-Windows-1.14/ws/build\dist\maven\poi\poi-5.0.0-SNAPSHOT.jar>
    [javac] Compiling 549 source files to <https://builds.apache.org/job/POI-DSL-Windows-1.14/ws/build\test-classes>
    [javac] Ignoring source, target and bootclasspath as release has been set
    [javac] Note: Some input files use or override a deprecated API.
    [javac] Note: Recompile with -Xlint:deprecation for details.
      [jar] Building jar: <https://builds.apache.org/job/POI-DSL-Windows-1.14/ws/build\dist\maven\poi-tests\poi-5.0.0-SNAPSHOT-tests.jar>
      [jar] Building jar: <https://builds.apache.org/job/POI-DSL-Windows-1.14/ws/build\dist\maven\poi\poi-5.0.0-SNAPSHOT-sources.jar>

compile-scratchpad:
    [javac] Compiling 513 source files to <https://builds.apache.org/job/POI-DSL-Windows-1.14/ws/build\scratchpad-classes>
    [javac] Ignoring source, target and bootclasspath as release has been set
    [javac] Note: Some input files use or override a deprecated API.
    [javac] Note: Recompile with -Xlint:deprecation for details.
    [javac] Note: Some input files use unchecked or unsafe operations.
    [javac] Note: Recompile with -Xlint:unchecked for details.
    [mkdir] Created dir: <https://builds.apache.org/job/POI-DSL-Windows-1.14/ws/build\dist\maven\poi-scratchpad>
      [jar] Building jar: <https://builds.apache.org/job/POI-DSL-Windows-1.14/ws/build\dist\maven\poi-scratchpad\poi-scratchpad-5.0.0-SNAPSHOT.jar>
    [javac] Compiling 202 source files to <https://builds.apache.org/job/POI-DSL-Windows-1.14/ws/build\scratchpad-test-classes>
    [javac] Ignoring source, target and bootclasspath as release has been set
    [javac] Note: Some input files use or override a deprecated API.
    [javac] Note: Recompile with -Xlint:deprecation for details.
    [javac] Note: <https://builds.apache.org/job/POI-DSL-Windows-1.14/ws/src\scratchpad\testcases\org\apache\poi\hslf\usermodel\TestBugs.java> uses unchecked or unsafe operations.
    [javac] Note: Recompile with -Xlint:unchecked for details.
      [jar] Building jar: <https://builds.apache.org/job/POI-DSL-Windows-1.14/ws/build\dist\maven\poi-scratchpad-tests\poi-scratchpad-5.0.0-SNAPSHOT-tests.jar>
      [jar] Building jar: <https://builds.apache.org/job/POI-DSL-Windows-1.14/ws/build\dist\maven\poi-scratchpad\poi-scratchpad-5.0.0-SNAPSHOT-sources.jar>

check-compiled-ooxml-xsds:

compile-ooxml-xsds:
    [mkdir] Created dir: <https://builds.apache.org/job/POI-DSL-Windows-1.14/ws/build\xmlbean-xsds>
     [copy] Copying 7 files to <https://builds.apache.org/job/POI-DSL-Windows-1.14/ws/build\xmlbean-xsds>
     [copy] Copying 89 resources to <https://builds.apache.org/job/POI-DSL-Windows-1.14/ws/build\xmlbean-xsds>
    [mkdir] Created dir: <https://builds.apache.org/job/POI-DSL-Windows-1.14/ws/build\xmlbean-sources>
    [mkdir] Created dir: <https://builds.apache.org/job/POI-DSL-Windows-1.14/ws/build\xmlbean-classes>
  [xmlbean] SchemaCompiler  Metadata LOAD:org/apache/xmlbeans/metadata GEN:org/apache/poi/schemas/ooxml
  [xmlbean] Time to build schema type system: 4.496 seconds
  [xmlbean] Time to generate code: 13.448 seconds
    [javac] Compiling 4908 source files to <https://builds.apache.org/job/POI-DSL-Windows-1.14/ws/build\xmlbean-classes>
    [javac] Ignoring source, target and bootclasspath as release has been set
    [mkdir] Created dir: <https://builds.apache.org/job/POI-DSL-Windows-1.14/ws/build\dist\maven\ooxml-schemas>
      [jar] Building jar: <https://builds.apache.org/job/POI-DSL-Windows-1.14/ws/build\dist\maven\ooxml-schemas\ooxml-schemas-1.5.jar>
      [jar] Building jar: <https://builds.apache.org/job/POI-DSL-Windows-1.14/ws/build\dist\maven\ooxml-schemas\ooxml-schemas-1.5-sources.jar>

compile-ooxml:
    [javac] Compiling 612 source files to <https://builds.apache.org/job/POI-DSL-Windows-1.14/ws/build\ooxml-classes>
    [javac] Ignoring source, target and bootclasspath as release has been set
    [javac] Note: Some input files use or override a deprecated API.
    [javac] Note: Recompile with -Xlint:deprecation for details.
    [javac] Note: <https://builds.apache.org/job/POI-DSL-Windows-1.14/ws/src\ooxml\java\org\apache\poi\xslf\draw\SVGImageRenderer.java> uses unchecked or unsafe operations.
    [javac] Note: Recompile with -Xlint:unchecked for details.
    [javac] Creating empty <https://builds.apache.org/job/POI-DSL-Windows-1.14/ws/build\ooxml-classes\org\apache\poi\xwpf\package-info.class>
    [javac] Creating empty <https://builds.apache.org/job/POI-DSL-Windows-1.14/ws/build\ooxml-classes\org\apache\poi\xssf\binary\package-info.class>
    [mkdir] Created dir: <https://builds.apache.org/job/POI-DSL-Windows-1.14/ws/build\dist\maven\poi-ooxml>
      [jar] Building jar: <https://builds.apache.org/job/POI-DSL-Windows-1.14/ws/build\dist\maven\poi-ooxml\poi-ooxml-5.0.0-SNAPSHOT.jar>
    [javac] Compiling 270 source files to <https://builds.apache.org/job/POI-DSL-Windows-1.14/ws/build\ooxml-test-classes>
    [javac] Ignoring source, target and bootclasspath as release has been set
    [javac] Note: Some input files use or override a deprecated API.
    [javac] Note: Recompile with -Xlint:deprecation for details.
    [javac] Note: Some input files use unchecked or unsafe operations.
    [javac] Note: Recompile with -Xlint:unchecked for details.
      [jar] Building jar: <https://builds.apache.org/job/POI-DSL-Windows-1.14/ws/build\dist\maven\poi-ooxml-tests\poi-ooxml-5.0.0-SNAPSHOT-tests.jar>
      [jar] Building jar: <https://builds.apache.org/job/POI-DSL-Windows-1.14/ws/build\dist\maven\poi-ooxml\poi-ooxml-5.0.0-SNAPSHOT-sources.jar>
      [jar] Building jar: <https://builds.apache.org/job/POI-DSL-Windows-1.14/ws/lib\ooxml-tests\ooxml-lite-agent.jar>

compile-examples:
    [javac] Compiling 133 source files to <https://builds.apache.org/job/POI-DSL-Windows-1.14/ws/build\examples-classes>
    [javac] Ignoring source, target and bootclasspath as release has been set
    [javac] Note: Some input files use or override a deprecated API.
    [javac] Note: Recompile with -Xlint:deprecation for details.
    [javac] Creating empty <https://builds.apache.org/job/POI-DSL-Windows-1.14/ws/build\examples-classes\org\apache\poi\examples\ss\html\package-info.class>
    [mkdir] Created dir: <https://builds.apache.org/job/POI-DSL-Windows-1.14/ws/build\dist\maven\poi-examples>
      [jar] Building jar: <https://builds.apache.org/job/POI-DSL-Windows-1.14/ws/build\dist\maven\poi-examples\poi-examples-5.0.0-SNAPSHOT.jar>
      [jar] Building jar: <https://builds.apache.org/job/POI-DSL-Windows-1.14/ws/build\dist\maven\poi-examples\poi-examples-5.0.0-SNAPSHOT-sources.jar>

compile-excelant:
    [javac] Compiling 14 source files to <https://builds.apache.org/job/POI-DSL-Windows-1.14/ws/build\excelant-classes>
    [javac] Ignoring source, target and bootclasspath as release has been set
    [javac] Compiling 1 source file to <https://builds.apache.org/job/POI-DSL-Windows-1.14/ws/src\multimodule\excelant\java9>
    [mkdir] Created dir: <https://builds.apache.org/job/POI-DSL-Windows-1.14/ws/build\dist\maven\poi-excelant>
      [jar] Building jar: <https://builds.apache.org/job/POI-DSL-Windows-1.14/ws/build\dist\maven\poi-excelant\poi-excelant-5.0.0-SNAPSHOT.jar>
    [javac] Compiling 12 source files to <https://builds.apache.org/job/POI-DSL-Windows-1.14/ws/build\excelant-test-classes>
    [javac] Ignoring source, target and bootclasspath as release has been set
    [javac] Compiling 1 source file to <https://builds.apache.org/job/POI-DSL-Windows-1.14/ws/src\multimodule\excelant\test9>
      [jar] Building jar: <https://builds.apache.org/job/POI-DSL-Windows-1.14/ws/build\dist\maven\poi-excelant-tests\poi-excelant-5.0.0-SNAPSHOT-tests.jar>
      [jar] Building jar: <https://builds.apache.org/job/POI-DSL-Windows-1.14/ws/build\dist\maven\poi-excelant\poi-excelant-5.0.0-SNAPSHOT-sources.jar>

compile:

jacocotask:
     [echo] Coverage reporting: true

-test-main-check:

test-main:
[jacoco:coverage] Enhancing junit with coverage
    [junit] Running org.apache.poi.TestJDK12
    [junit] Tests run: 1, Failures: 0, Errors: 0, Skipped: 0, Time elapsed: 0.768 sec
    [junit] Running org.apache.poi.TestPOIDocumentMain
    [junit] Tests run: 6, Failures: 0, Errors: 0, Skipped: 0, Time elapsed: 1.118 sec
    [junit] Running org.apache.poi.TestPOITestCase
    [junit] Tests run: 8, Failures: 0, Errors: 0, Skipped: 0, Time elapsed: 0.018 sec
    [junit] Running org.apache.poi.ddf.TestEscherBSERecord
    [junit] Tests run: 3, Failures: 0, Errors: 0, Skipped: 0, Time elapsed: 0.101 sec
    [junit] Running org.apache.poi.ddf.TestEscherBlipRecord
    [junit] Tests run: 4, Failures: 0, Errors: 0, Skipped: 0, Time elapsed: 0.126 sec
    [junit] Running org.apache.poi.ddf.TestEscherBoolProperty
    [junit] Tests run: 1, Failures: 0, Errors: 0, Skipped: 0, Time elapsed: 0.011 sec
    [junit] Running org.apache.poi.ddf.TestEscherChildAnchorRecord
    [junit] Tests run: 3, Failures: 0, Errors: 0, Skipped: 0, Time elapsed: 0.01 sec
    [junit] Running org.apache.poi.ddf.TestEscherClientAnchorRecord
    [junit] Tests run: 3, Failures: 0, Errors: 0, Skipped: 0, Time elapsed: 0.016 sec
    [junit] Running org.apache.poi.ddf.TestEscherClientDataRecord
    [junit] Tests run: 3, Failures: 0, Errors: 0, Skipped: 0, Time elapsed: 0.006 sec
    [junit] Running org.apache.poi.ddf.TestEscherContainerRecord
    [junit] Tests run: 6, Failures: 0, Errors: 0, Skipped: 0, Time elapsed: 0.02 sec
    [junit] Running org.apache.poi.ddf.TestEscherDgRecord
    [junit] Tests run: 3, Failures: 0, Errors: 0, Skipped: 0, Time elapsed: 0.009 sec
    [junit] Running org.apache.poi.ddf.TestEscherDggRecord
    [junit] Tests run: 4, Failures: 0, Errors: 0, Skipped: 0, Time elapsed: 0.015 sec
    [junit] Running org.apache.poi.ddf.TestEscherDump
    [junit] Tests run: 4, Failures: 0, Errors: 0, Skipped: 0, Time elapsed: 0.268 sec
    [junit] Running org.apache.poi.ddf.TestEscherOptRecord
    [junit] Tests run: 6, Failures: 0, Errors: 0, Skipped: 0, Time elapsed: 0.014 sec
    [junit] Running org.apache.poi.ddf.TestEscherProperty
    [junit] Tests run: 1, Failures: 0, Errors: 0, Skipped: 0, Time elapsed: 0.006 sec
    [junit] Running org.apache.poi.ddf.TestEscherPropertyFactory
    [junit] Tests run: 1, Failures: 0, Errors: 0, Skipped: 0, Time elapsed: 0.004 sec
    [junit] Running org.apache.poi.ddf.TestEscherSpRecord
    [junit] Tests run: 3, Failures: 0, Errors: 0, Skipped: 0, Time elapsed: 0.007 sec
    [junit] Running org.apache.poi.ddf.TestEscherSpgrRecord
    [junit] Tests run: 3, Failures: 0, Errors: 0, Skipped: 0, Time elapsed: 0.007 sec
    [junit] Running org.apache.poi.ddf.TestEscherSplitMenuColorsRecord
    [junit] Tests run: 3, Failures: 0, Errors: 0, Skipped: 0, Time elapsed: 0.005 sec
    [junit] Running org.apache.poi.ddf.TestUnknownEscherRecord
    [junit] Tests run: 3, Failures: 0, Errors: 0, Skipped: 0, Time elapsed: 0.005 sec
    [junit] Running org.apache.poi.hpsf.TestVariantSupport
    [junit] Tests run: 2, Failures: 0, Errors: 0, Skipped: 0, Time elapsed: 0.042 sec
    [junit] Running org.apache.poi.hpsf.basic.TestBasic
    [junit] Tests run: 6, Failures: 0, Errors: 0, Skipped: 0, Time elapsed: 0.111 sec
    [junit] Running org.apache.poi.hpsf.basic.TestClassID
    [junit] Tests run: 6, Failures: 0, Errors: 0, Skipped: 0, Time elapsed: 0.005 sec
    [junit] Running org.apache.poi.hpsf.basic.TestEmptyProperties
    [junit] Tests run: 3, Failures: 0, Errors: 0, Skipped: 0, Time elapsed: 0.044 sec
    [junit] Running org.apache.poi.hpsf.basic.TestHPSFBugs
    [junit] Tests run: 4, Failures: 0, Errors: 0, Skipped: 0, Time elapsed: 0.082 sec
    [junit] Running org.apache.poi.hpsf.basic.TestMetaDataIPI
    [junit] Tests run: 7, Failures: 0, Errors: 0, Skipped: 0, Time elapsed: 0.514 sec
    [junit] Running org.apache.poi.hpsf.basic.TestReadAllFiles
    [junit] Tests run: 88, Failures: 0, Errors: 0, Skipped: 0, Time elapsed: 1.011 sec
    [junit] Running org.apache.poi.hpsf.basic.TestUnicode
    [junit] Tests run: 1, Failures: 0, Errors: 0, Skipped: 0, Time elapsed: 0.005 sec
    [junit] Running org.apache.poi.hpsf.basic.TestWrite
    [junit] java.lang.reflect.InaccessibleObjectException: Unable to make public jdk.internal.ref.Cleaner java.nio.DirectByteBuffer.cleaner() accessible: module java.base does not "opens java.nio" to module org.apache.poi.poi
    [junit] at java.base/java.lang.reflect.AccessibleObject.checkCanSetAccessible(AccessibleObject.java:344)
    [junit] at java.base/java.lang.reflect.AccessibleObject.checkCanSetAccessible(AccessibleObject.java:284)
    [junit] at java.base/java.lang.reflect.Method.checkCanSetAccessible(Method.java:198)
    [junit] at java.base/java.lang.reflect.Method.setAccessible(Method.java:192)
    [junit] at org.apache.poi.poi/org.apache.poi.poifs.nio.CleanerUtil.unmapHackImpl(CleanerUtil.java:116)
    [junit] at java.base/java.security.AccessController.doPrivileged(AccessController.java:312)
    [junit] at org.apache.poi.poi/org.apache.poi.poifs.nio.CleanerUtil.<clinit>(CleanerUtil.java:77)
    [junit] at org.apache.poi.poi/org.apache.poi.poifs.nio.FileBackedDataSource.unmap(FileBackedDataSource.java:189)
    [junit] at org.apache.poi.poi/org.apache.poi.poifs.nio.FileBackedDataSource.lambda$close$0(FileBackedDataSource.java:162)
    [junit] at java.base/java.util.IdentityHashMap.forEach(IdentityHashMap.java:1354)
    [junit] at org.apache.poi.poi/org.apache.poi.poifs.nio.FileBackedDataSource.close(FileBackedDataSource.java:162)
    [junit] at org.apache.poi.poi/org.apache.poi.poifs.filesystem.POIFSFileSystem.close(POIFSFileSystem.java:764)
    [junit] Tests run: 10, Failures: 0, Errors: 1, Skipped: 0, Time elapsed: 0.207 sec
    [junit] at org.apache.poi.poi/org.apache.poi.hpsf.basic.TestWrite.inPlacePOIFSWrite(TestWrite.java:539)
    [junit] at java.base/jdk.internal.reflect.NativeMethodAccessorImpl.invoke0(Native Method)
    [junit] at java.base/jdk.internal.reflect.NativeMethodAccessorImpl.invoke(NativeMethodAccessorImpl.java:62)
    [junit] at java.base/jdk.internal.reflect.DelegatingMethodAccessorImpl.invoke(DelegatingMethodAccessorImpl.java:43)
    [junit] at java.base/java.lang.reflect.Method.invoke(Method.java:567)
    [junit] at junit@4.13/org.junit.runners.model.FrameworkMethod$1.runReflectiveCall(FrameworkMethod.java:59)
    [junit] at junit@4.13/org.junit.internal.runners.model.ReflectiveCallable.run(ReflectiveCallable.java:12)
    [junit] at junit@4.13/org.junit.runners.model.FrameworkMethod.invokeExplosively(FrameworkMethod.java:56)
    [junit] at junit@4.13/org.junit.internal.runners.statements.InvokeMethod.evaluate(InvokeMethod.java:17)
    [junit] at junit@4.13/org.junit.runners.ParentRunner$3.evaluate(ParentRunner.java:306)
    [junit] at junit@4.13/org.junit.runners.BlockJUnit4ClassRunner$1.evaluate(BlockJUnit4ClassRunner.java:100)
    [junit] at junit@4.13/org.junit.runners.ParentRunner.runLeaf(ParentRunner.java:366)
    [junit] at junit@4.13/org.junit.runners.BlockJUnit4ClassRunner.runChild(BlockJUnit4ClassRunner.java:103)
    [junit] at junit@4.13/org.junit.runners.BlockJUnit4ClassRunner.runChild(BlockJUnit4ClassRunner.java:63)
    [junit] at junit@4.13/org.junit.runners.ParentRunner$4.run(ParentRunner.java:331)
    [junit] at junit@4.13/org.junit.runners.ParentRunner$1.schedule(ParentRunner.java:79)
    [junit] at junit@4.13/org.junit.runners.ParentRunner.runChildren(ParentRunner.java:329)
    [junit] at junit@4.13/org.junit.runners.ParentRunner.access$100(ParentRunner.java:66)
    [junit] at junit@4.13/org.junit.runners.ParentRunner$2.evaluate(ParentRunner.java:293)
    [junit] at junit@4.13/org.junit.runners.ParentRunner$3.evaluate(ParentRunner.java:306)
    [junit] at junit@4.13/org.junit.runners.ParentRunner.run(ParentRunner.java:413)
    [junit] at junit@4.13/junit.framework.JUnit4TestAdapter.run(JUnit4TestAdapter.java:50)
    [junit] at org.apache.tools.ant.taskdefs.optional.junit.JUnitTestRunner.run(JUnitTestRunner.java:534)
    [junit] at org.apache.tools.ant.taskdefs.optional.junit.JUnitTestRunner.launch(JUnitTestRunner.java:1196)
    [junit] at org.apache.tools.ant.taskdefs.optional.junit.JUnitTestRunner.main(JUnitTestRunner.java:1014)

BUILD FAILED
<https://builds.apache.org/job/POI-DSL-Windows-1.14/ws/build.xml>:1404: The following error occurred while executing this line:
<https://builds.apache.org/job/POI-DSL-Windows-1.14/ws/build.xml>:1125: Tests failed

Total time: 8 minutes 42 seconds
Build step 'Invoke Ant' marked build as failure
Skipping publisher since build result is FAILURE
Archiving artifacts
[Fast Archiver] Compressed 3.04 MB of artifacts by 22.6% relative to #38
Skipping publisher since build result is FAILURE
Recording test results

---------------------------------------------------------------------
To unsubscribe, e-mail: [hidden email]
For additional commands, e-mail: [hidden email]

Reply | Threaded
Open this post in threaded view
|

Jenkins build is back to normal : POI-DSL-Windows-1.14 #43

Apache Jenkins Server
See <https://builds.apache.org/job/POI-DSL-Windows-1.14/43/display/redirect?page=changes>


---------------------------------------------------------------------
To unsubscribe, e-mail: [hidden email]
For additional commands, e-mail: [hidden email]