Build failed in Jenkins: POI-DSL-Windows-1.12 #1

classic Classic list List threaded Threaded
5 messages Options
Reply | Threaded
Open this post in threaded view
|

Build failed in Jenkins: POI-DSL-Windows-1.12 #1

Apache Jenkins Server
See <https://builds.apache.org/job/POI-DSL-Windows-1.12/1/display/redirect>

------------------------------------------
[...truncated 392.68 KB...]
      [get] Getting: https://repo1.maven.org/maven2/org/apache/xmlgraphics/batik-all/1.10/batik-all-1.10.jar
      [get] To: <https://builds.apache.org/job/POI-DSL-Windows-1.12/ws/compile-lib\batik-all-1.10.jar>
      [get] Getting: https://repo1.maven.org/maven2/xml-apis/xml-apis-ext/1.3.04/xml-apis-ext-1.3.04.jar
      [get] To: <https://builds.apache.org/job/POI-DSL-Windows-1.12/ws/compile-lib\xml-apis-ext-1.3.04.jar>
      [get] Getting: https://repo1.maven.org/maven2/org/apache/xmlgraphics/xmlgraphics-commons/2.3/xmlgraphics-commons-2.3.jar
      [get] To: <https://builds.apache.org/job/POI-DSL-Windows-1.12/ws/compile-lib\xmlgraphics-commons-2.3.jar>

init:
    [mkdir] Created dir: <https://builds.apache.org/job/POI-DSL-Windows-1.12/ws/build>
    [mkdir] Created dir: <https://builds.apache.org/job/POI-DSL-Windows-1.12/ws/build\classes>
    [mkdir] Created dir: <https://builds.apache.org/job/POI-DSL-Windows-1.12/ws/build\test-classes>
    [mkdir] Created dir: <https://builds.apache.org/job/POI-DSL-Windows-1.12/ws/build\test-results>
    [mkdir] Created dir: <https://builds.apache.org/job/POI-DSL-Windows-1.12/ws/build\scratchpad-classes>
    [mkdir] Created dir: <https://builds.apache.org/job/POI-DSL-Windows-1.12/ws/build\scratchpad-test-classes>
    [mkdir] Created dir: <https://builds.apache.org/job/POI-DSL-Windows-1.12/ws/build\scratchpad-test-results>
    [mkdir] Created dir: <https://builds.apache.org/job/POI-DSL-Windows-1.12/ws/build\geometry-java>
    [mkdir] Created dir: <https://builds.apache.org/job/POI-DSL-Windows-1.12/ws/build\ooxml-classes>
    [mkdir] Created dir: <https://builds.apache.org/job/POI-DSL-Windows-1.12/ws/build\ooxml-test-classes>
    [mkdir] Created dir: <https://builds.apache.org/job/POI-DSL-Windows-1.12/ws/build\ooxml-test-results>
    [mkdir] Created dir: <https://builds.apache.org/job/POI-DSL-Windows-1.12/ws/build\excelant-classes>
    [mkdir] Created dir: <https://builds.apache.org/job/POI-DSL-Windows-1.12/ws/build\excelant-test-classes>
    [mkdir] Created dir: <https://builds.apache.org/job/POI-DSL-Windows-1.12/ws/build\excelant-test-results>
    [mkdir] Created dir: <https://builds.apache.org/job/POI-DSL-Windows-1.12/ws/build\examples-classes>
    [mkdir] Created dir: <https://builds.apache.org/job/POI-DSL-Windows-1.12/ws/build\integration-test-classes>
    [mkdir] Created dir: <https://builds.apache.org/job/POI-DSL-Windows-1.12/ws/build\integration-test-results>
    [mkdir] Created dir: <https://builds.apache.org/job/POI-DSL-Windows-1.12/ws/build\dist>
    [mkdir] Created dir: <https://builds.apache.org/job/POI-DSL-Windows-1.12/ws/build\site>
     [echo] Using Ant: Apache Ant(TM) version 1.9.9 compiled on February 2 2017 from F:\\jenkins\\tools\\ant\\apache-ant-1.9.9, Ant detected Java 9 (may be different than actual Java sometimes...)
     [echo] Using Java: 12-ea/12-ea+28/12-ea+28/OpenJDK 64-Bit Server VM from Oracle Corporation on Windows Server 2016: 10.0
[release_tag] Warning: Nashorn engine is planned to be removed from a future JDK release

compile-main:
    [javac] Compiling 1213 source files to <https://builds.apache.org/job/POI-DSL-Windows-1.12/ws/build\classes>
    [javac] warning: [options] bootstrap class path not set in conjunction with -source 8
    [javac] Note: Some input files use or override a deprecated API.
    [javac] Note: Recompile with -Xlint:deprecation for details.
    [javac] Note: Some input files use unchecked or unsafe operations.
    [javac] Note: Recompile with -Xlint:unchecked for details.
    [javac] 1 warning
    [javac] Creating empty <https://builds.apache.org/job/POI-DSL-Windows-1.12/ws/build\classes\org\apache\poi\poifs\dev\package-info.class>
    [javac] Creating empty <https://builds.apache.org/job/POI-DSL-Windows-1.12/ws/build\classes\org\apache\poi\poifs\common\package-info.class>
    [javac] Creating empty <https://builds.apache.org/job/POI-DSL-Windows-1.12/ws/build\classes\org\apache\poi\poifs\filesystem\package-info.class>
    [javac] Creating empty <https://builds.apache.org/job/POI-DSL-Windows-1.12/ws/build\classes\org\apache\poi\poifs\storage\package-info.class>
    [javac] Creating empty <https://builds.apache.org/job/POI-DSL-Windows-1.12/ws/build\classes\org\apache\poi\poifs\package-info.class>
    [javac] Creating empty <https://builds.apache.org/job/POI-DSL-Windows-1.12/ws/build\classes\org\apache\poi\poifs\crypt\package-info.class>
    [javac] Creating empty <https://builds.apache.org/job/POI-DSL-Windows-1.12/ws/build\classes\org\apache\poi\poifs\eventfilesystem\package-info.class>
    [javac] Creating empty <https://builds.apache.org/job/POI-DSL-Windows-1.12/ws/build\classes\org\apache\poi\poifs\property\package-info.class>
    [javac] Compiling 546 source files to <https://builds.apache.org/job/POI-DSL-Windows-1.12/ws/build\test-classes>
    [javac] warning: [options] bootstrap class path not set in conjunction with -source 8
    [javac] Note: Some input files use or override a deprecated API.
    [javac] Note: Recompile with -Xlint:deprecation for details.
    [javac] 1 warning
     [copy] Copying 4 files to <https://builds.apache.org/job/POI-DSL-Windows-1.12/ws/build\classes>

check-ooxml-xsds:

fetch-ooxml-xsds:
      [get] Getting: http://www.ecma-international.org/publications/files/ECMA-ST/Office%20Open%20XML%201st%20edition%20Part%204%20(PDF).zip
      [get] To: <https://builds.apache.org/job/POI-DSL-Windows-1.12/ws/ooxml-lib\OfficeOpenXML-Part4.zip>
      [get] Getting: http://www.ecma-international.org/publications/files/ECMA-ST/Office%20Open%20XML%201st%20edition%20Part%202%20(PDF).zip
      [get] To: <https://builds.apache.org/job/POI-DSL-Windows-1.12/ws/ooxml-lib\OfficeOpenXML-Part2.zip>
      [get] Getting: https://www.w3.org/TR/2002/REC-xmldsig-core-20020212/xmldsig-core-schema.xsd
      [get] To: <https://builds.apache.org/job/POI-DSL-Windows-1.12/ws/ooxml-lib\xmldsig-core-schema.xsd>
      [get] Getting: http://uri.etsi.org/01903/v1.3.2/XAdES.xsd
      [get] To: <https://builds.apache.org/job/POI-DSL-Windows-1.12/ws/ooxml-lib\XAdES.xsd>
      [get] Getting: http://uri.etsi.org/01903/v1.4.1/XAdESv141.xsd
      [get] To: <https://builds.apache.org/job/POI-DSL-Windows-1.12/ws/ooxml-lib\XAdESv141.xsd>
    [unzip] Expanding: <https://builds.apache.org/job/POI-DSL-Windows-1.12/ws/ooxml-lib\OfficeOpenXML-Part4.zip> into <https://builds.apache.org/job/POI-DSL-Windows-1.12/1/artifact/ooxml-lib>
    [unzip] Expanding: <https://builds.apache.org/job/POI-DSL-Windows-1.12/ws/ooxml-lib\OfficeOpenXML-Part2.zip> into <https://builds.apache.org/job/POI-DSL-Windows-1.12/1/artifact/ooxml-lib>
    [unzip] Expanding: <https://builds.apache.org/job/POI-DSL-Windows-1.12/ws/ooxml-lib\OfficeOpenXML-Part4.zip> into <https://builds.apache.org/job/POI-DSL-Windows-1.12/1/artifact/ooxml-lib>

generate-geometry:

compile-scratchpad:
    [javac] Compiling 497 source files to <https://builds.apache.org/job/POI-DSL-Windows-1.12/ws/build\scratchpad-classes>
    [javac] warning: [options] bootstrap class path not set in conjunction with -source 8
    [javac] Note: Some input files use or override a deprecated API.
    [javac] Note: Recompile with -Xlint:deprecation for details.
    [javac] Note: <https://builds.apache.org/job/POI-DSL-Windows-1.12/ws/src\scratchpad\src\org\apache\poi\extractor\ole2\OLE2ScratchpadExtractorFactory.java> uses unchecked or unsafe operations.
    [javac] Note: Recompile with -Xlint:unchecked for details.
    [javac] 1 warning
    [javac] Compiling 202 source files to <https://builds.apache.org/job/POI-DSL-Windows-1.12/ws/build\scratchpad-test-classes>
    [javac] warning: [options] bootstrap class path not set in conjunction with -source 8
    [javac] Note: Some input files use or override a deprecated API.
    [javac] Note: Recompile with -Xlint:deprecation for details.
    [javac] Note: <https://builds.apache.org/job/POI-DSL-Windows-1.12/ws/src\scratchpad\testcases\org\apache\poi\hslf\usermodel\TestBugs.java> uses unchecked or unsafe operations.
    [javac] Note: Recompile with -Xlint:unchecked for details.
    [javac] 1 warning
     [copy] Copying 2 files to <https://builds.apache.org/job/POI-DSL-Windows-1.12/ws/build\scratchpad-classes>

check-compiled-ooxml-xsds:

compile-ooxml-xsds:
    [mkdir] Created dir: <https://builds.apache.org/job/POI-DSL-Windows-1.12/ws/build\xmlbean-xsds>
    [mkdir] Created dir: <https://builds.apache.org/job/POI-DSL-Windows-1.12/ws/build\xmlbean-sources>
    [mkdir] Created dir: <https://builds.apache.org/job/POI-DSL-Windows-1.12/ws/build\xmlbean-classes>
     [copy] Copying 3 files to <https://builds.apache.org/job/POI-DSL-Windows-1.12/ws/build\xmlbean-xsds>
     [copy] Copying 87 resources to <https://builds.apache.org/job/POI-DSL-Windows-1.12/ws/build\xmlbean-xsds>
  [xmlbean] Time to build schema type system: 3.221 seconds
  [xmlbean] Time to generate code: 80.879 seconds
     [echo] Forking javac with max heap size 1536m
    [javac] Compiling 4576 source files to <https://builds.apache.org/job/POI-DSL-Windows-1.12/ws/build\xmlbean-classes>
    [javac] warning: [options] bootstrap class path not set in conjunction with -source 8
    [javac] Note: Some input files use unchecked or unsafe operations.
    [javac] Note: Recompile with -Xlint:unchecked for details.
    [javac] 1 warning
      [jar] Building jar: <https://builds.apache.org/job/POI-DSL-Windows-1.12/ws/ooxml-lib\ooxml-schemas-1.4.jar>
      [jar] Building jar: <https://builds.apache.org/job/POI-DSL-Windows-1.12/ws/ooxml-lib\ooxml-schemas-1.4-sources.jar>
   [delete] Deleting directory <https://builds.apache.org/job/POI-DSL-Windows-1.12/ws/build\xmlbean-xsds>
   [delete] Deleting directory <https://builds.apache.org/job/POI-DSL-Windows-1.12/ws/build\xmlbean-sources>
   [delete] Deleting directory <https://builds.apache.org/job/POI-DSL-Windows-1.12/ws/build\xmlbean-classes>
    [mkdir] Created dir: <https://builds.apache.org/job/POI-DSL-Windows-1.12/ws/build\xmlbean-xsds>
    [mkdir] Created dir: <https://builds.apache.org/job/POI-DSL-Windows-1.12/ws/build\xmlbean-sources>
    [mkdir] Created dir: <https://builds.apache.org/job/POI-DSL-Windows-1.12/ws/build\xmlbean-classes>
     [copy] Copying 10 files to <https://builds.apache.org/job/POI-DSL-Windows-1.12/ws/build\xmlbean-xsds>
     [copy] Copying 2 resources to <https://builds.apache.org/job/POI-DSL-Windows-1.12/ws/build\xmlbean-xsds>
  [xmlbean] Time to build schema type system: 0.77 seconds
  [xmlbean] Time to generate code: 6.079 seconds
     [echo] Forking javac with max heap size 1536m
    [javac] Compiling 372 source files to <https://builds.apache.org/job/POI-DSL-Windows-1.12/ws/build\xmlbean-classes>
    [javac] warning: [options] bootstrap class path not set in conjunction with -source 8
    [javac] Note: Some input files use unchecked or unsafe operations.
    [javac] Note: Recompile with -Xlint:unchecked for details.
    [javac] 1 warning
      [jar] Building jar: <https://builds.apache.org/job/POI-DSL-Windows-1.12/ws/ooxml-lib\ooxml-security-1.1.jar>
      [jar] Building jar: <https://builds.apache.org/job/POI-DSL-Windows-1.12/ws/ooxml-lib\ooxml-security-1.1-sources.jar>
   [delete] Deleting directory <https://builds.apache.org/job/POI-DSL-Windows-1.12/ws/build\xmlbean-xsds>
   [delete] Deleting directory <https://builds.apache.org/job/POI-DSL-Windows-1.12/ws/build\xmlbean-sources>
   [delete] Deleting directory <https://builds.apache.org/job/POI-DSL-Windows-1.12/ws/build\xmlbean-classes>

compile-ooxml:
    [javac] Compiling 595 source files to <https://builds.apache.org/job/POI-DSL-Windows-1.12/ws/build\ooxml-classes>
    [javac] warning: [options] bootstrap class path not set in conjunction with -source 8
    [javac] Note: Some input files use or override a deprecated API.
    [javac] Note: Recompile with -Xlint:deprecation for details.
    [javac] Note: Some input files use unchecked or unsafe operations.
    [javac] Note: Recompile with -Xlint:unchecked for details.
    [javac] 1 warning
    [javac] Compiling 268 source files to <https://builds.apache.org/job/POI-DSL-Windows-1.12/ws/build\ooxml-test-classes>
    [javac] warning: [options] bootstrap class path not set in conjunction with -source 8
    [javac] Note: Some input files use or override a deprecated API.
    [javac] Note: Recompile with -Xlint:deprecation for details.
    [javac] Note: <https://builds.apache.org/job/POI-DSL-Windows-1.12/ws/src\ooxml\testcases\org\apache\poi\sl\TestOleShape.java> uses unchecked or unsafe operations.
    [javac] Note: Recompile with -Xlint:unchecked for details.
    [javac] 1 warning
     [copy] Copying 3 files to <https://builds.apache.org/job/POI-DSL-Windows-1.12/ws/build\ooxml-classes>

compile-examples:
    [javac] Compiling 155 source files to <https://builds.apache.org/job/POI-DSL-Windows-1.12/ws/build\examples-classes>
    [javac] warning: [options] bootstrap class path not set in conjunction with -source 8
    [javac] Note: Some input files use or override a deprecated API.
    [javac] Note: Recompile with -Xlint:deprecation for details.
    [javac] 1 warning
     [copy] Copying 1 file to <https://builds.apache.org/job/POI-DSL-Windows-1.12/ws/build\examples-classes>

compile-excelant:
    [javac] Compiling 14 source files to <https://builds.apache.org/job/POI-DSL-Windows-1.12/ws/build\excelant-classes>
    [javac] warning: [options] bootstrap class path not set in conjunction with -source 8
    [javac] Note: Some input files use or override a deprecated API.
    [javac] Note: Recompile with -Xlint:deprecation for details.
    [javac] 1 warning
    [javac] Compiling 13 source files to <https://builds.apache.org/job/POI-DSL-Windows-1.12/ws/build\excelant-test-classes>
    [javac] warning: [options] bootstrap class path not set in conjunction with -source 8
    [javac] 1 warning
     [copy] Copying 1 file to <https://builds.apache.org/job/POI-DSL-Windows-1.12/ws/build\excelant-classes>

compile:

jacocotask:
     [echo] Coverage reporting: true

-test-main-check:

test-main:
   [script] Warning: Nashorn engine is planned to be removed from a future JDK release
[jacoco:coverage] Enhancing junit with coverage
    [junit] Running org.apache.poi.TestPOIDocumentMain
    [junit] Tests run: 6, Failures: 0, Errors: 0, Skipped: 0, Time elapsed: 1.13 sec
    [junit] Running org.apache.poi.TestPOITestCase
    [junit] Tests run: 10, Failures: 0, Errors: 0, Skipped: 3, Time elapsed: 0.051 sec
    [junit] Running org.apache.poi.ddf.TestEscherBSERecord
    [junit] Tests run: 3, Failures: 0, Errors: 0, Skipped: 0, Time elapsed: 0.063 sec
    [junit] Running org.apache.poi.ddf.TestEscherBlipRecord
    [junit] Tests run: 4, Failures: 0, Errors: 0, Skipped: 0, Time elapsed: 0.158 sec
    [junit] Running org.apache.poi.ddf.TestEscherBoolProperty
    [junit] Tests run: 1, Failures: 0, Errors: 0, Skipped: 0, Time elapsed: 0.007 sec
    [junit] Running org.apache.poi.ddf.TestEscherChildAnchorRecord
    [junit] Tests run: 3, Failures: 0, Errors: 0, Skipped: 0, Time elapsed: 0.007 sec
    [junit] Running org.apache.poi.ddf.TestEscherClientAnchorRecord
    [junit] Tests run: 3, Failures: 0, Errors: 0, Skipped: 0, Time elapsed: 0.013 sec
    [junit] Running org.apache.poi.ddf.TestEscherClientDataRecord
    [junit] Tests run: 3, Failures: 0, Errors: 0, Skipped: 0, Time elapsed: 0.007 sec
    [junit] Running org.apache.poi.ddf.TestEscherContainerRecord
    [junit] Tests run: 6, Failures: 0, Errors: 0, Skipped: 0, Time elapsed: 0.029 sec
    [junit] Running org.apache.poi.ddf.TestEscherDgRecord
    [junit] Tests run: 3, Failures: 0, Errors: 0, Skipped: 0, Time elapsed: 0.009 sec
    [junit] Running org.apache.poi.ddf.TestEscherDggRecord
    [junit] Tests run: 4, Failures: 0, Errors: 0, Skipped: 0, Time elapsed: 0.009 sec
    [junit] Running org.apache.poi.ddf.TestEscherDump
    [junit] Tests run: 3, Failures: 0, Errors: 0, Skipped: 0, Time elapsed: 0.071 sec
    [junit] Running org.apache.poi.ddf.TestEscherOptRecord
    [junit] Tests run: 6, Failures: 0, Errors: 0, Skipped: 0, Time elapsed: 0.027 sec
    [junit] Running org.apache.poi.ddf.TestEscherProperty
    [junit] Tests run: 1, Failures: 0, Errors: 0, Skipped: 0, Time elapsed: 0.008 sec
    [junit] Running org.apache.poi.ddf.TestEscherPropertyFactory
    [junit] Tests run: 1, Failures: 0, Errors: 0, Skipped: 0, Time elapsed: 0.01 sec
    [junit] Running org.apache.poi.ddf.TestEscherSpRecord
    [junit] Tests run: 3, Failures: 0, Errors: 0, Skipped: 0, Time elapsed: 0.008 sec
    [junit] Running org.apache.poi.ddf.TestEscherSpgrRecord
    [junit] Tests run: 3, Failures: 0, Errors: 0, Skipped: 0, Time elapsed: 0.006 sec
    [junit] Running org.apache.poi.ddf.TestEscherSplitMenuColorsRecord
    [junit] Tests run: 3, Failures: 0, Errors: 0, Skipped: 0, Time elapsed: 0.007 sec
    [junit] Running org.apache.poi.ddf.TestUnknownEscherRecord
    [junit] Tests run: 3, Failures: 0, Errors: 0, Skipped: 0, Time elapsed: 0.006 sec
    [junit] Running org.apache.poi.hpsf.TestVariantSupport
    [junit] Tests run: 2, Failures: 0, Errors: 0, Skipped: 0, Time elapsed: 0.031 sec
    [junit] Running org.apache.poi.hpsf.basic.TestBasic
    [junit] Tests run: 6, Failures: 0, Errors: 0, Skipped: 0, Time elapsed: 0.071 sec
    [junit] Running org.apache.poi.hpsf.basic.TestClassID
    [junit] Tests run: 3, Failures: 0, Errors: 0, Skipped: 0, Time elapsed: 0.02 sec
    [junit] Running org.apache.poi.hpsf.basic.TestEmptyProperties
    [junit] Tests run: 3, Failures: 0, Errors: 0, Skipped: 0, Time elapsed: 0.018 sec
    [junit] Running org.apache.poi.hpsf.basic.TestHPSFBugs
    [junit] Tests run: 4, Failures: 0, Errors: 0, Skipped: 0, Time elapsed: 0.063 sec
    [junit] Running org.apache.poi.hpsf.basic.TestMetaDataIPI
    [junit] Tests run: 7, Failures: 0, Errors: 0, Skipped: 0, Time elapsed: 0.505 sec
    [junit] Running org.apache.poi.hpsf.basic.TestReadAllFiles
    [junit] Tests run: 88, Failures: 0, Errors: 0, Skipped: 0, Time elapsed: 0.911 sec
    [junit] Running org.apache.poi.hpsf.basic.TestUnicode
    [junit] Tests run: 1, Failures: 0, Errors: 0, Skipped: 0, Time elapsed: 0.009 sec
    [junit] Running org.apache.poi.hpsf.basic.TestWrite
    [junit] WARNING: An illegal reflective access operation has occurred
    [junit] WARNING: Illegal reflective access by org.apache.poi.poifs.nio.FileBackedDataSource$1 (file:/F:/jenkins/jenkins-slave/workspace/POI-DSL-Windows-1.12/build/classes/) to method java.nio.DirectByteBuffer.cleaner()
    [junit] WARNING: Please consider reporting this to the maintainers of org.apache.poi.poifs.nio.FileBackedDataSource$1
    [junit] WARNING: Use --illegal-access=warn to enable warnings of further illegal reflective access operations
    [junit] WARNING: All illegal access operations will be denied in a future release
    [junit] Tests run: 10, Failures: 0, Errors: 1, Skipped: 0, Time elapsed: 0.259 sec

BUILD FAILED
<https://builds.apache.org/job/POI-DSL-Windows-1.12/ws/build.xml>:1496: The following error occurred while executing this line:
<https://builds.apache.org/job/POI-DSL-Windows-1.12/ws/build.xml>:1226: Tests failed

Total time: 8 minutes 41 seconds
Build step 'Invoke Ant' marked build as failure
Skipping publisher since build result is FAILURE
Archiving artifacts
[Fast Archiver] No prior successful build to compare, so performing full copy of artifacts
Skipping publisher since build result is FAILURE
Recording test results

---------------------------------------------------------------------
To unsubscribe, e-mail: [hidden email]
For additional commands, e-mail: [hidden email]

Reply | Threaded
Open this post in threaded view
|

Build failed in Jenkins: POI-DSL-Windows-1.12 #2

Apache Jenkins Server
See <https://builds.apache.org/job/POI-DSL-Windows-1.12/2/display/redirect?page=changes>

Changes:

[centic] Jenkins: Try to disable coverage for JDK 13 for now as it seems to cause issues

------------------------------------------
[...truncated 2.84 KB...]
               8 Dir(s)  174,815,649,792 bytes free
openjdk version "12-ea" 2019-03-19
OpenJDK Runtime Environment (build 12-ea+28)
OpenJDK 64-Bit Server VM (build 12-ea+28, mixed mode, sharing)
[POI-DSL-Windows-1.12] $ cmd.exe /C "F:\jenkins\tools\ant\apache-ant-1.9.9\bin\ant.bat -Dcoverage.enabled=true clean jenkins && exit %%ERRORLEVEL%%"
Buildfile: <https://builds.apache.org/job/POI-DSL-Windows-1.12/ws/build.xml>
[propertyreset] Warning: Nashorn engine is planned to be removed from a future JDK release
[propertyreset] Warning: Nashorn engine is planned to be removed from a future JDK release

clean:
   [delete] Deleting directory <https://builds.apache.org/job/POI-DSL-Windows-1.12/ws/build>

check-jars:

fetch-jars:

check-ooxml-jars:

fetch-ooxml-jars:

init:
    [mkdir] Created dir: <https://builds.apache.org/job/POI-DSL-Windows-1.12/ws/build>
    [mkdir] Created dir: <https://builds.apache.org/job/POI-DSL-Windows-1.12/ws/build\classes>
    [mkdir] Created dir: <https://builds.apache.org/job/POI-DSL-Windows-1.12/ws/build\test-classes>
    [mkdir] Created dir: <https://builds.apache.org/job/POI-DSL-Windows-1.12/ws/build\test-results>
    [mkdir] Created dir: <https://builds.apache.org/job/POI-DSL-Windows-1.12/ws/build\scratchpad-classes>
    [mkdir] Created dir: <https://builds.apache.org/job/POI-DSL-Windows-1.12/ws/build\scratchpad-test-classes>
    [mkdir] Created dir: <https://builds.apache.org/job/POI-DSL-Windows-1.12/ws/build\scratchpad-test-results>
    [mkdir] Created dir: <https://builds.apache.org/job/POI-DSL-Windows-1.12/ws/build\geometry-java>
    [mkdir] Created dir: <https://builds.apache.org/job/POI-DSL-Windows-1.12/ws/build\ooxml-classes>
    [mkdir] Created dir: <https://builds.apache.org/job/POI-DSL-Windows-1.12/ws/build\ooxml-test-classes>
    [mkdir] Created dir: <https://builds.apache.org/job/POI-DSL-Windows-1.12/ws/build\ooxml-test-results>
    [mkdir] Created dir: <https://builds.apache.org/job/POI-DSL-Windows-1.12/ws/build\excelant-classes>
    [mkdir] Created dir: <https://builds.apache.org/job/POI-DSL-Windows-1.12/ws/build\excelant-test-classes>
    [mkdir] Created dir: <https://builds.apache.org/job/POI-DSL-Windows-1.12/ws/build\excelant-test-results>
    [mkdir] Created dir: <https://builds.apache.org/job/POI-DSL-Windows-1.12/ws/build\examples-classes>
    [mkdir] Created dir: <https://builds.apache.org/job/POI-DSL-Windows-1.12/ws/build\integration-test-classes>
    [mkdir] Created dir: <https://builds.apache.org/job/POI-DSL-Windows-1.12/ws/build\integration-test-results>
    [mkdir] Created dir: <https://builds.apache.org/job/POI-DSL-Windows-1.12/ws/build\dist>
    [mkdir] Created dir: <https://builds.apache.org/job/POI-DSL-Windows-1.12/ws/build\site>
     [echo] Using Ant: Apache Ant(TM) version 1.9.9 compiled on February 2 2017 from F:\\jenkins\\tools\\ant\\apache-ant-1.9.9, Ant detected Java 9 (may be different than actual Java sometimes...)
     [echo] Using Java: 12-ea/12-ea+28/12-ea+28/OpenJDK 64-Bit Server VM from Oracle Corporation on Windows Server 2016: 10.0
[release_tag] Warning: Nashorn engine is planned to be removed from a future JDK release

compile-main:
    [javac] Compiling 1213 source files to <https://builds.apache.org/job/POI-DSL-Windows-1.12/ws/build\classes>
    [javac] warning: [options] bootstrap class path not set in conjunction with -source 8
    [javac] Note: Some input files use or override a deprecated API.
    [javac] Note: Recompile with -Xlint:deprecation for details.
    [javac] Note: Some input files use unchecked or unsafe operations.
    [javac] Note: Recompile with -Xlint:unchecked for details.
    [javac] 1 warning
    [javac] Creating empty <https://builds.apache.org/job/POI-DSL-Windows-1.12/ws/build\classes\org\apache\poi\poifs\dev\package-info.class>
    [javac] Creating empty <https://builds.apache.org/job/POI-DSL-Windows-1.12/ws/build\classes\org\apache\poi\poifs\common\package-info.class>
    [javac] Creating empty <https://builds.apache.org/job/POI-DSL-Windows-1.12/ws/build\classes\org\apache\poi\poifs\filesystem\package-info.class>
    [javac] Creating empty <https://builds.apache.org/job/POI-DSL-Windows-1.12/ws/build\classes\org\apache\poi\poifs\storage\package-info.class>
    [javac] Creating empty <https://builds.apache.org/job/POI-DSL-Windows-1.12/ws/build\classes\org\apache\poi\poifs\package-info.class>
    [javac] Creating empty <https://builds.apache.org/job/POI-DSL-Windows-1.12/ws/build\classes\org\apache\poi\poifs\crypt\package-info.class>
    [javac] Creating empty <https://builds.apache.org/job/POI-DSL-Windows-1.12/ws/build\classes\org\apache\poi\poifs\eventfilesystem\package-info.class>
    [javac] Creating empty <https://builds.apache.org/job/POI-DSL-Windows-1.12/ws/build\classes\org\apache\poi\poifs\property\package-info.class>
    [javac] Compiling 546 source files to <https://builds.apache.org/job/POI-DSL-Windows-1.12/ws/build\test-classes>
    [javac] warning: [options] bootstrap class path not set in conjunction with -source 8
    [javac] Note: Some input files use or override a deprecated API.
    [javac] Note: Recompile with -Xlint:deprecation for details.
    [javac] 1 warning
     [copy] Copying 4 files to <https://builds.apache.org/job/POI-DSL-Windows-1.12/ws/build\classes>

check-ooxml-xsds:

fetch-ooxml-xsds:

generate-geometry:

compile-scratchpad:
    [javac] Compiling 497 source files to <https://builds.apache.org/job/POI-DSL-Windows-1.12/ws/build\scratchpad-classes>
    [javac] warning: [options] bootstrap class path not set in conjunction with -source 8
    [javac] Note: Some input files use or override a deprecated API.
    [javac] Note: Recompile with -Xlint:deprecation for details.
    [javac] Note: <https://builds.apache.org/job/POI-DSL-Windows-1.12/ws/src\scratchpad\src\org\apache\poi\extractor\ole2\OLE2ScratchpadExtractorFactory.java> uses unchecked or unsafe operations.
    [javac] Note: Recompile with -Xlint:unchecked for details.
    [javac] 1 warning
    [javac] Compiling 202 source files to <https://builds.apache.org/job/POI-DSL-Windows-1.12/ws/build\scratchpad-test-classes>
    [javac] warning: [options] bootstrap class path not set in conjunction with -source 8
    [javac] Note: Some input files use or override a deprecated API.
    [javac] Note: Recompile with -Xlint:deprecation for details.
    [javac] Note: <https://builds.apache.org/job/POI-DSL-Windows-1.12/ws/src\scratchpad\testcases\org\apache\poi\hslf\usermodel\TestBugs.java> uses unchecked or unsafe operations.
    [javac] Note: Recompile with -Xlint:unchecked for details.
    [javac] 1 warning
     [copy] Copying 2 files to <https://builds.apache.org/job/POI-DSL-Windows-1.12/ws/build\scratchpad-classes>

check-compiled-ooxml-xsds:

compile-ooxml-xsds:
    [mkdir] Created dir: <https://builds.apache.org/job/POI-DSL-Windows-1.12/ws/build\xmlbean-xsds>
    [mkdir] Created dir: <https://builds.apache.org/job/POI-DSL-Windows-1.12/ws/build\xmlbean-sources>
    [mkdir] Created dir: <https://builds.apache.org/job/POI-DSL-Windows-1.12/ws/build\xmlbean-classes>
     [copy] Copying 3 files to <https://builds.apache.org/job/POI-DSL-Windows-1.12/ws/build\xmlbean-xsds>
     [copy] Copying 87 resources to <https://builds.apache.org/job/POI-DSL-Windows-1.12/ws/build\xmlbean-xsds>
  [xmlbean] Time to build schema type system: 2.853 seconds
  [xmlbean] Time to generate code: 75.661 seconds
     [echo] Forking javac with max heap size 1536m
    [javac] Compiling 4576 source files to <https://builds.apache.org/job/POI-DSL-Windows-1.12/ws/build\xmlbean-classes>
    [javac] warning: [options] bootstrap class path not set in conjunction with -source 8
    [javac] Note: Some input files use unchecked or unsafe operations.
    [javac] Note: Recompile with -Xlint:unchecked for details.
    [javac] 1 warning
      [jar] Building jar: <https://builds.apache.org/job/POI-DSL-Windows-1.12/ws/ooxml-lib\ooxml-schemas-1.4.jar>
      [jar] Building jar: <https://builds.apache.org/job/POI-DSL-Windows-1.12/ws/ooxml-lib\ooxml-schemas-1.4-sources.jar>
   [delete] Deleting directory <https://builds.apache.org/job/POI-DSL-Windows-1.12/ws/build\xmlbean-xsds>
   [delete] Deleting directory <https://builds.apache.org/job/POI-DSL-Windows-1.12/ws/build\xmlbean-sources>
   [delete] Deleting directory <https://builds.apache.org/job/POI-DSL-Windows-1.12/ws/build\xmlbean-classes>
    [mkdir] Created dir: <https://builds.apache.org/job/POI-DSL-Windows-1.12/ws/build\xmlbean-xsds>
    [mkdir] Created dir: <https://builds.apache.org/job/POI-DSL-Windows-1.12/ws/build\xmlbean-sources>
    [mkdir] Created dir: <https://builds.apache.org/job/POI-DSL-Windows-1.12/ws/build\xmlbean-classes>
     [copy] Copying 10 files to <https://builds.apache.org/job/POI-DSL-Windows-1.12/ws/build\xmlbean-xsds>
     [copy] Copying 2 resources to <https://builds.apache.org/job/POI-DSL-Windows-1.12/ws/build\xmlbean-xsds>
  [xmlbean] Time to build schema type system: 0.85 seconds
  [xmlbean] Time to generate code: 5.914 seconds
     [echo] Forking javac with max heap size 1536m
    [javac] Compiling 372 source files to <https://builds.apache.org/job/POI-DSL-Windows-1.12/ws/build\xmlbean-classes>
    [javac] warning: [options] bootstrap class path not set in conjunction with -source 8
    [javac] Note: Some input files use unchecked or unsafe operations.
    [javac] Note: Recompile with -Xlint:unchecked for details.
    [javac] 1 warning
      [jar] Building jar: <https://builds.apache.org/job/POI-DSL-Windows-1.12/ws/ooxml-lib\ooxml-security-1.1.jar>
      [jar] Building jar: <https://builds.apache.org/job/POI-DSL-Windows-1.12/ws/ooxml-lib\ooxml-security-1.1-sources.jar>
   [delete] Deleting directory <https://builds.apache.org/job/POI-DSL-Windows-1.12/ws/build\xmlbean-xsds>
   [delete] Deleting directory <https://builds.apache.org/job/POI-DSL-Windows-1.12/ws/build\xmlbean-sources>
   [delete] Deleting directory <https://builds.apache.org/job/POI-DSL-Windows-1.12/ws/build\xmlbean-classes>

compile-ooxml:
    [javac] Compiling 595 source files to <https://builds.apache.org/job/POI-DSL-Windows-1.12/ws/build\ooxml-classes>
    [javac] warning: [options] bootstrap class path not set in conjunction with -source 8
    [javac] Note: Some input files use or override a deprecated API.
    [javac] Note: Recompile with -Xlint:deprecation for details.
    [javac] Note: Some input files use unchecked or unsafe operations.
    [javac] Note: Recompile with -Xlint:unchecked for details.
    [javac] 1 warning
    [javac] Compiling 268 source files to <https://builds.apache.org/job/POI-DSL-Windows-1.12/ws/build\ooxml-test-classes>
    [javac] warning: [options] bootstrap class path not set in conjunction with -source 8
    [javac] Note: Some input files use or override a deprecated API.
    [javac] Note: Recompile with -Xlint:deprecation for details.
    [javac] Note: <https://builds.apache.org/job/POI-DSL-Windows-1.12/ws/src\ooxml\testcases\org\apache\poi\sl\TestOleShape.java> uses unchecked or unsafe operations.
    [javac] Note: Recompile with -Xlint:unchecked for details.
    [javac] 1 warning
     [copy] Copying 3 files to <https://builds.apache.org/job/POI-DSL-Windows-1.12/ws/build\ooxml-classes>

compile-examples:
    [javac] Compiling 155 source files to <https://builds.apache.org/job/POI-DSL-Windows-1.12/ws/build\examples-classes>
    [javac] warning: [options] bootstrap class path not set in conjunction with -source 8
    [javac] Note: Some input files use or override a deprecated API.
    [javac] Note: Recompile with -Xlint:deprecation for details.
    [javac] 1 warning
     [copy] Copying 1 file to <https://builds.apache.org/job/POI-DSL-Windows-1.12/ws/build\examples-classes>

compile-excelant:
    [javac] Compiling 14 source files to <https://builds.apache.org/job/POI-DSL-Windows-1.12/ws/build\excelant-classes>
    [javac] warning: [options] bootstrap class path not set in conjunction with -source 8
    [javac] Note: Some input files use or override a deprecated API.
    [javac] Note: Recompile with -Xlint:deprecation for details.
    [javac] 1 warning
    [javac] Compiling 13 source files to <https://builds.apache.org/job/POI-DSL-Windows-1.12/ws/build\excelant-test-classes>
    [javac] warning: [options] bootstrap class path not set in conjunction with -source 8
    [javac] 1 warning
     [copy] Copying 1 file to <https://builds.apache.org/job/POI-DSL-Windows-1.12/ws/build\excelant-classes>

compile:

jacocotask:
     [echo] Coverage reporting: true

-test-main-check:

test-main:
   [script] Warning: Nashorn engine is planned to be removed from a future JDK release
[jacoco:coverage] Enhancing junit with coverage
    [junit] Running org.apache.poi.TestPOIDocumentMain
    [junit] Tests run: 6, Failures: 0, Errors: 0, Skipped: 0, Time elapsed: 0.999 sec
    [junit] Running org.apache.poi.TestPOITestCase
    [junit] Tests run: 10, Failures: 0, Errors: 0, Skipped: 3, Time elapsed: 0.056 sec
    [junit] Running org.apache.poi.ddf.TestEscherBSERecord
    [junit] Tests run: 3, Failures: 0, Errors: 0, Skipped: 0, Time elapsed: 0.066 sec
    [junit] Running org.apache.poi.ddf.TestEscherBlipRecord
    [junit] Tests run: 4, Failures: 0, Errors: 0, Skipped: 0, Time elapsed: 0.192 sec
    [junit] Running org.apache.poi.ddf.TestEscherBoolProperty
    [junit] Tests run: 1, Failures: 0, Errors: 0, Skipped: 0, Time elapsed: 0.005 sec
    [junit] Running org.apache.poi.ddf.TestEscherChildAnchorRecord
    [junit] Tests run: 3, Failures: 0, Errors: 0, Skipped: 0, Time elapsed: 0.011 sec
    [junit] Running org.apache.poi.ddf.TestEscherClientAnchorRecord
    [junit] Tests run: 3, Failures: 0, Errors: 0, Skipped: 0, Time elapsed: 0.01 sec
    [junit] Running org.apache.poi.ddf.TestEscherClientDataRecord
    [junit] Tests run: 3, Failures: 0, Errors: 0, Skipped: 0, Time elapsed: 0.007 sec
    [junit] Running org.apache.poi.ddf.TestEscherContainerRecord
    [junit] Tests run: 6, Failures: 0, Errors: 0, Skipped: 0, Time elapsed: 0.031 sec
    [junit] Running org.apache.poi.ddf.TestEscherDgRecord
    [junit] Tests run: 3, Failures: 0, Errors: 0, Skipped: 0, Time elapsed: 0.006 sec
    [junit] Running org.apache.poi.ddf.TestEscherDggRecord
    [junit] Tests run: 4, Failures: 0, Errors: 0, Skipped: 0, Time elapsed: 0.007 sec
    [junit] Running org.apache.poi.ddf.TestEscherDump
    [junit] Tests run: 3, Failures: 0, Errors: 0, Skipped: 0, Time elapsed: 0.086 sec
    [junit] Running org.apache.poi.ddf.TestEscherOptRecord
    [junit] Tests run: 6, Failures: 0, Errors: 0, Skipped: 0, Time elapsed: 0.023 sec
    [junit] Running org.apache.poi.ddf.TestEscherProperty
    [junit] Tests run: 1, Failures: 0, Errors: 0, Skipped: 0, Time elapsed: 0.007 sec
    [junit] Running org.apache.poi.ddf.TestEscherPropertyFactory
    [junit] Tests run: 1, Failures: 0, Errors: 0, Skipped: 0, Time elapsed: 0.009 sec
    [junit] Running org.apache.poi.ddf.TestEscherSpRecord
    [junit] Tests run: 3, Failures: 0, Errors: 0, Skipped: 0, Time elapsed: 0.008 sec
    [junit] Running org.apache.poi.ddf.TestEscherSpgrRecord
    [junit] Tests run: 3, Failures: 0, Errors: 0, Skipped: 0, Time elapsed: 0.008 sec
    [junit] Running org.apache.poi.ddf.TestEscherSplitMenuColorsRecord
    [junit] Tests run: 3, Failures: 0, Errors: 0, Skipped: 0, Time elapsed: 0.008 sec
    [junit] Running org.apache.poi.ddf.TestUnknownEscherRecord
    [junit] Tests run: 3, Failures: 0, Errors: 0, Skipped: 0, Time elapsed: 0.009 sec
    [junit] Running org.apache.poi.hpsf.TestVariantSupport
    [junit] Tests run: 2, Failures: 0, Errors: 0, Skipped: 0, Time elapsed: 0.034 sec
    [junit] Running org.apache.poi.hpsf.basic.TestBasic
    [junit] Tests run: 6, Failures: 0, Errors: 0, Skipped: 0, Time elapsed: 0.08 sec
    [junit] Running org.apache.poi.hpsf.basic.TestClassID
    [junit] Tests run: 3, Failures: 0, Errors: 0, Skipped: 0, Time elapsed: 0.024 sec
    [junit] Running org.apache.poi.hpsf.basic.TestEmptyProperties
    [junit] Tests run: 3, Failures: 0, Errors: 0, Skipped: 0, Time elapsed: 0.016 sec
    [junit] Running org.apache.poi.hpsf.basic.TestHPSFBugs
    [junit] Tests run: 4, Failures: 0, Errors: 0, Skipped: 0, Time elapsed: 0.062 sec
    [junit] Running org.apache.poi.hpsf.basic.TestMetaDataIPI
    [junit] Tests run: 7, Failures: 0, Errors: 0, Skipped: 0, Time elapsed: 0.486 sec
    [junit] Running org.apache.poi.hpsf.basic.TestReadAllFiles
    [junit] Tests run: 88, Failures: 0, Errors: 0, Skipped: 0, Time elapsed: 0.793 sec
    [junit] Running org.apache.poi.hpsf.basic.TestUnicode
    [junit] Tests run: 1, Failures: 0, Errors: 0, Skipped: 0, Time elapsed: 0.005 sec
    [junit] Running org.apache.poi.hpsf.basic.TestWrite
    [junit] WARNING: An illegal reflective access operation has occurred
    [junit] WARNING: Illegal reflective access by org.apache.poi.poifs.nio.FileBackedDataSource$1 (file:/F:/jenkins/jenkins-slave/workspace/POI-DSL-Windows-1.12/build/classes/) to method java.nio.DirectByteBuffer.cleaner()
    [junit] WARNING: Please consider reporting this to the maintainers of org.apache.poi.poifs.nio.FileBackedDataSource$1
    [junit] WARNING: Use --illegal-access=warn to enable warnings of further illegal reflective access operations
    [junit] WARNING: All illegal access operations will be denied in a future release
    [junit] Tests run: 10, Failures: 0, Errors: 1, Skipped: 0, Time elapsed: 0.201 sec

BUILD FAILED
<https://builds.apache.org/job/POI-DSL-Windows-1.12/ws/build.xml>:1496: The following error occurred while executing this line:
<https://builds.apache.org/job/POI-DSL-Windows-1.12/ws/build.xml>:1226: Tests failed

Total time: 7 minutes 56 seconds
Build step 'Invoke Ant' marked build as failure
Skipping publisher since build result is FAILURE
Archiving artifacts
[Fast Archiver] No prior successful build to compare, so performing full copy of artifacts
Skipping publisher since build result is FAILURE
Recording test results

---------------------------------------------------------------------
To unsubscribe, e-mail: [hidden email]
For additional commands, e-mail: [hidden email]

Reply | Threaded
Open this post in threaded view
|

Build failed in Jenkins: POI-DSL-Windows-1.12 #3

Apache Jenkins Server
See <https://builds.apache.org/job/POI-DSL-Windows-1.12/3/display/redirect>

------------------------------------------
Started by user centic
[EnvInject] - Loading node environment variables.
[EnvInject] - Preparing an environment for the build.
[EnvInject] - Keeping Jenkins system variables.
[EnvInject] - Keeping Jenkins build variables.
[EnvInject] - Injecting as environment variables the properties content
LANG=en_US.UTF-8
FORREST_HOME=f:jenkins ools orrestlatest

[EnvInject] - Variables injected successfully.
[EnvInject] - Injecting contributions.
Building remotely on windows-2016-2 (Windows) in workspace <https://builds.apache.org/job/POI-DSL-Windows-1.12/ws/>
[WS-CLEANUP] Deleting project workspace...
[WS-CLEANUP] Done
Updating https://svn.apache.org/repos/asf/poi/trunk at revision '2019-01-22T02:44:08.735 -0800'

<-- Got one external: documentation, svn url: https://svn.apache.org/repos/asf/poi/site/src/documentation -->
Fetching 'https://svn.apache.org/repos/asf/poi/site/src/documentation' at -1 into 'F:\jenkins\jenkins-slave\workspace\POI-DSL-Windows-1.12\src\documentation'
At revision 1851803


<-- Got one external: forrest.properties, svn url: https://svn.apache.org/repos/asf/poi/site/forrest.properties -->
Fetching 'https://svn.apache.org/repos/asf/poi/site/forrest.properties' at -1 into 'F:\jenkins\jenkins-slave\workspace\POI-DSL-Windows-1.12\forrest.properties'
At revision 1851803

At revision 1851803

No changes for https://svn.apache.org/repos/asf/poi/trunk since the previous build
No changes for https://svn.apache.org/repos/asf/poi/site/src/documentation since the previous build
No changes for https://svn.apache.org/repos/asf/poi/site/forrest.properties since the previous build
[POI-DSL-Windows-1.12] $ cmd /c call F:\jenkins\jenkins-slave\temp\jenkins1819873287074939172.bat
    X   forrest.properties
X       src\documentation

Performing status on external item at 'src\documentation':
Java-Home: f:\\jenkins\\tools\\java\\latest12
 Volume in drive F is Data
 Volume Serial Number is 741C-2BD4

 Directory of f:\jenkins\tools\java\latest12

01/21/2019  10:31 AM    <DIR>          .
01/21/2019  10:31 AM    <DIR>          ..
01/21/2019  10:31 AM    <DIR>          bin
01/21/2019  10:31 AM    <DIR>          conf
01/21/2019  10:31 AM    <DIR>          include
01/21/2019  10:31 AM    <DIR>          jmods
01/21/2019  10:31 AM    <DIR>          legal
01/21/2019  10:31 AM    <DIR>          lib
01/16/2019  11:41 PM             1,213 release
               1 File(s)          1,213 bytes
               8 Dir(s)  174,815,649,792 bytes free
openjdk version "12-ea" 2019-03-19
OpenJDK Runtime Environment (build 12-ea+28)
OpenJDK 64-Bit Server VM (build 12-ea+28, mixed mode, sharing)
[POI-DSL-Windows-1.12] $ cmd.exe /C "F:\jenkins\tools\ant\apache-ant-1.9.9\bin\ant.bat -Dcoverage.enabled=true clean jenkins -Djava9addmodsvalue=-Dsun.reflect.debugModuleAccessChecks=true -Djava9addopens1=--add-opens=java.xml/com.sun.org.apache.xerces.internal.util=ALL-UNNAMED -Djava9addopens2=--add-opens=java.base/java.io=ALL-UNNAMED -Djava9addopens3=--add-opens=java.base/java.nio=ALL-UNNAMED -Djava9addopens4=--add-opens=java.base/java.lang=ALL-UNNAMED -Djava9addopens5=--add-opens=java.base/jdk.internal.ref=ALL-UNNAMED "-Djava.locale.providers=JRE,CLDR" && exit %%ERRORLEVEL%%"
Buildfile: <https://builds.apache.org/job/POI-DSL-Windows-1.12/ws/build.xml>
[propertyreset] Warning: Nashorn engine is planned to be removed from a future JDK release
[propertyreset] Warning: Nashorn engine is planned to be removed from a future JDK release

clean:
   [delete] Deleting directory <https://builds.apache.org/job/POI-DSL-Windows-1.12/ws/build>

check-jars:

fetch-jars:

check-ooxml-jars:

fetch-ooxml-jars:

init:
    [mkdir] Created dir: <https://builds.apache.org/job/POI-DSL-Windows-1.12/ws/build>
    [mkdir] Created dir: <https://builds.apache.org/job/POI-DSL-Windows-1.12/ws/build\classes>
    [mkdir] Created dir: <https://builds.apache.org/job/POI-DSL-Windows-1.12/ws/build\test-classes>
    [mkdir] Created dir: <https://builds.apache.org/job/POI-DSL-Windows-1.12/ws/build\test-results>
    [mkdir] Created dir: <https://builds.apache.org/job/POI-DSL-Windows-1.12/ws/build\scratchpad-classes>
    [mkdir] Created dir: <https://builds.apache.org/job/POI-DSL-Windows-1.12/ws/build\scratchpad-test-classes>
    [mkdir] Created dir: <https://builds.apache.org/job/POI-DSL-Windows-1.12/ws/build\scratchpad-test-results>
    [mkdir] Created dir: <https://builds.apache.org/job/POI-DSL-Windows-1.12/ws/build\geometry-java>
    [mkdir] Created dir: <https://builds.apache.org/job/POI-DSL-Windows-1.12/ws/build\ooxml-classes>
    [mkdir] Created dir: <https://builds.apache.org/job/POI-DSL-Windows-1.12/ws/build\ooxml-test-classes>
    [mkdir] Created dir: <https://builds.apache.org/job/POI-DSL-Windows-1.12/ws/build\ooxml-test-results>
    [mkdir] Created dir: <https://builds.apache.org/job/POI-DSL-Windows-1.12/ws/build\excelant-classes>
    [mkdir] Created dir: <https://builds.apache.org/job/POI-DSL-Windows-1.12/ws/build\excelant-test-classes>
    [mkdir] Created dir: <https://builds.apache.org/job/POI-DSL-Windows-1.12/ws/build\excelant-test-results>
    [mkdir] Created dir: <https://builds.apache.org/job/POI-DSL-Windows-1.12/ws/build\examples-classes>
    [mkdir] Created dir: <https://builds.apache.org/job/POI-DSL-Windows-1.12/ws/build\integration-test-classes>
    [mkdir] Created dir: <https://builds.apache.org/job/POI-DSL-Windows-1.12/ws/build\integration-test-results>
    [mkdir] Created dir: <https://builds.apache.org/job/POI-DSL-Windows-1.12/ws/build\dist>
    [mkdir] Created dir: <https://builds.apache.org/job/POI-DSL-Windows-1.12/ws/build\site>
     [echo] Using Ant: Apache Ant(TM) version 1.9.9 compiled on February 2 2017 from F:\\jenkins\\tools\\ant\\apache-ant-1.9.9, Ant detected Java 9 (may be different than actual Java sometimes...)
     [echo] Using Java: 12-ea/12-ea+28/12-ea+28/OpenJDK 64-Bit Server VM from Oracle Corporation on Windows Server 2016: 10.0
[release_tag] Warning: Nashorn engine is planned to be removed from a future JDK release

compile-main:
    [javac] Compiling 1213 source files to <https://builds.apache.org/job/POI-DSL-Windows-1.12/ws/build\classes>
    [javac] warning: [options] bootstrap class path not set in conjunction with -source 8
    [javac] Note: Some input files use or override a deprecated API.
    [javac] Note: Recompile with -Xlint:deprecation for details.
    [javac] Note: Some input files use unchecked or unsafe operations.
    [javac] Note: Recompile with -Xlint:unchecked for details.
    [javac] 1 warning
    [javac] Creating empty <https://builds.apache.org/job/POI-DSL-Windows-1.12/ws/build\classes\org\apache\poi\poifs\dev\package-info.class>
    [javac] Creating empty <https://builds.apache.org/job/POI-DSL-Windows-1.12/ws/build\classes\org\apache\poi\poifs\common\package-info.class>
    [javac] Creating empty <https://builds.apache.org/job/POI-DSL-Windows-1.12/ws/build\classes\org\apache\poi\poifs\filesystem\package-info.class>
    [javac] Creating empty <https://builds.apache.org/job/POI-DSL-Windows-1.12/ws/build\classes\org\apache\poi\poifs\storage\package-info.class>
    [javac] Creating empty <https://builds.apache.org/job/POI-DSL-Windows-1.12/ws/build\classes\org\apache\poi\poifs\package-info.class>
    [javac] Creating empty <https://builds.apache.org/job/POI-DSL-Windows-1.12/ws/build\classes\org\apache\poi\poifs\crypt\package-info.class>
    [javac] Creating empty <https://builds.apache.org/job/POI-DSL-Windows-1.12/ws/build\classes\org\apache\poi\poifs\eventfilesystem\package-info.class>
    [javac] Creating empty <https://builds.apache.org/job/POI-DSL-Windows-1.12/ws/build\classes\org\apache\poi\poifs\property\package-info.class>
    [javac] Compiling 546 source files to <https://builds.apache.org/job/POI-DSL-Windows-1.12/ws/build\test-classes>
    [javac] warning: [options] bootstrap class path not set in conjunction with -source 8
    [javac] Note: Some input files use or override a deprecated API.
    [javac] Note: Recompile with -Xlint:deprecation for details.
    [javac] 1 warning
     [copy] Copying 4 files to <https://builds.apache.org/job/POI-DSL-Windows-1.12/ws/build\classes>

check-ooxml-xsds:

fetch-ooxml-xsds:

generate-geometry:

compile-scratchpad:
    [javac] Compiling 497 source files to <https://builds.apache.org/job/POI-DSL-Windows-1.12/ws/build\scratchpad-classes>
    [javac] warning: [options] bootstrap class path not set in conjunction with -source 8
    [javac] Note: Some input files use or override a deprecated API.
    [javac] Note: Recompile with -Xlint:deprecation for details.
    [javac] Note: <https://builds.apache.org/job/POI-DSL-Windows-1.12/ws/src\scratchpad\src\org\apache\poi\extractor\ole2\OLE2ScratchpadExtractorFactory.java> uses unchecked or unsafe operations.
    [javac] Note: Recompile with -Xlint:unchecked for details.
    [javac] 1 warning
    [javac] Compiling 202 source files to <https://builds.apache.org/job/POI-DSL-Windows-1.12/ws/build\scratchpad-test-classes>
    [javac] warning: [options] bootstrap class path not set in conjunction with -source 8
    [javac] Note: Some input files use or override a deprecated API.
    [javac] Note: Recompile with -Xlint:deprecation for details.
    [javac] Note: <https://builds.apache.org/job/POI-DSL-Windows-1.12/ws/src\scratchpad\testcases\org\apache\poi\hslf\usermodel\TestBugs.java> uses unchecked or unsafe operations.
    [javac] Note: Recompile with -Xlint:unchecked for details.
    [javac] 1 warning
     [copy] Copying 2 files to <https://builds.apache.org/job/POI-DSL-Windows-1.12/ws/build\scratchpad-classes>

check-compiled-ooxml-xsds:

compile-ooxml-xsds:
    [mkdir] Created dir: <https://builds.apache.org/job/POI-DSL-Windows-1.12/ws/build\xmlbean-xsds>
    [mkdir] Created dir: <https://builds.apache.org/job/POI-DSL-Windows-1.12/ws/build\xmlbean-sources>
    [mkdir] Created dir: <https://builds.apache.org/job/POI-DSL-Windows-1.12/ws/build\xmlbean-classes>
     [copy] Copying 3 files to <https://builds.apache.org/job/POI-DSL-Windows-1.12/ws/build\xmlbean-xsds>
     [copy] Copying 87 resources to <https://builds.apache.org/job/POI-DSL-Windows-1.12/ws/build\xmlbean-xsds>
  [xmlbean] Time to build schema type system: 3.303 seconds
  [xmlbean] Time to generate code: 76.837 seconds
     [echo] Forking javac with max heap size 1536m
    [javac] Compiling 4576 source files to <https://builds.apache.org/job/POI-DSL-Windows-1.12/ws/build\xmlbean-classes>
    [javac] warning: [options] bootstrap class path not set in conjunction with -source 8
    [javac] Note: Some input files use unchecked or unsafe operations.
    [javac] Note: Recompile with -Xlint:unchecked for details.
    [javac] 1 warning
      [jar] Building jar: <https://builds.apache.org/job/POI-DSL-Windows-1.12/ws/ooxml-lib\ooxml-schemas-1.4.jar>
      [jar] Building jar: <https://builds.apache.org/job/POI-DSL-Windows-1.12/ws/ooxml-lib\ooxml-schemas-1.4-sources.jar>
   [delete] Deleting directory <https://builds.apache.org/job/POI-DSL-Windows-1.12/ws/build\xmlbean-xsds>
   [delete] Deleting directory <https://builds.apache.org/job/POI-DSL-Windows-1.12/ws/build\xmlbean-sources>
   [delete] Deleting directory <https://builds.apache.org/job/POI-DSL-Windows-1.12/ws/build\xmlbean-classes>
    [mkdir] Created dir: <https://builds.apache.org/job/POI-DSL-Windows-1.12/ws/build\xmlbean-xsds>
    [mkdir] Created dir: <https://builds.apache.org/job/POI-DSL-Windows-1.12/ws/build\xmlbean-sources>
    [mkdir] Created dir: <https://builds.apache.org/job/POI-DSL-Windows-1.12/ws/build\xmlbean-classes>
     [copy] Copying 10 files to <https://builds.apache.org/job/POI-DSL-Windows-1.12/ws/build\xmlbean-xsds>
     [copy] Copying 2 resources to <https://builds.apache.org/job/POI-DSL-Windows-1.12/ws/build\xmlbean-xsds>
  [xmlbean] Time to build schema type system: 0.781 seconds
  [xmlbean] Time to generate code: 5.516 seconds
     [echo] Forking javac with max heap size 1536m
    [javac] Compiling 372 source files to <https://builds.apache.org/job/POI-DSL-Windows-1.12/ws/build\xmlbean-classes>
    [javac] warning: [options] bootstrap class path not set in conjunction with -source 8
    [javac] Note: Some input files use unchecked or unsafe operations.
    [javac] Note: Recompile with -Xlint:unchecked for details.
    [javac] 1 warning
      [jar] Building jar: <https://builds.apache.org/job/POI-DSL-Windows-1.12/ws/ooxml-lib\ooxml-security-1.1.jar>
      [jar] Building jar: <https://builds.apache.org/job/POI-DSL-Windows-1.12/ws/ooxml-lib\ooxml-security-1.1-sources.jar>
   [delete] Deleting directory <https://builds.apache.org/job/POI-DSL-Windows-1.12/ws/build\xmlbean-xsds>
   [delete] Deleting directory <https://builds.apache.org/job/POI-DSL-Windows-1.12/ws/build\xmlbean-sources>
   [delete] Deleting directory <https://builds.apache.org/job/POI-DSL-Windows-1.12/ws/build\xmlbean-classes>

compile-ooxml:
    [javac] Compiling 595 source files to <https://builds.apache.org/job/POI-DSL-Windows-1.12/ws/build\ooxml-classes>
    [javac] warning: [options] bootstrap class path not set in conjunction with -source 8
    [javac] Note: Some input files use or override a deprecated API.
    [javac] Note: Recompile with -Xlint:deprecation for details.
    [javac] Note: Some input files use unchecked or unsafe operations.
    [javac] Note: Recompile with -Xlint:unchecked for details.
    [javac] 1 warning
    [javac] Compiling 268 source files to <https://builds.apache.org/job/POI-DSL-Windows-1.12/ws/build\ooxml-test-classes>
    [javac] warning: [options] bootstrap class path not set in conjunction with -source 8
    [javac] Note: Some input files use or override a deprecated API.
    [javac] Note: Recompile with -Xlint:deprecation for details.
    [javac] Note: <https://builds.apache.org/job/POI-DSL-Windows-1.12/ws/src\ooxml\testcases\org\apache\poi\sl\TestOleShape.java> uses unchecked or unsafe operations.
    [javac] Note: Recompile with -Xlint:unchecked for details.
    [javac] 1 warning
     [copy] Copying 3 files to <https://builds.apache.org/job/POI-DSL-Windows-1.12/ws/build\ooxml-classes>

compile-examples:
    [javac] Compiling 155 source files to <https://builds.apache.org/job/POI-DSL-Windows-1.12/ws/build\examples-classes>
    [javac] warning: [options] bootstrap class path not set in conjunction with -source 8
    [javac] Note: Some input files use or override a deprecated API.
    [javac] Note: Recompile with -Xlint:deprecation for details.
    [javac] 1 warning
     [copy] Copying 1 file to <https://builds.apache.org/job/POI-DSL-Windows-1.12/ws/build\examples-classes>

compile-excelant:
    [javac] Compiling 14 source files to <https://builds.apache.org/job/POI-DSL-Windows-1.12/ws/build\excelant-classes>
    [javac] warning: [options] bootstrap class path not set in conjunction with -source 8
    [javac] Note: Some input files use or override a deprecated API.
    [javac] Note: Recompile with -Xlint:deprecation for details.
    [javac] 1 warning
    [javac] Compiling 13 source files to <https://builds.apache.org/job/POI-DSL-Windows-1.12/ws/build\excelant-test-classes>
    [javac] warning: [options] bootstrap class path not set in conjunction with -source 8
    [javac] 1 warning
     [copy] Copying 1 file to <https://builds.apache.org/job/POI-DSL-Windows-1.12/ws/build\excelant-classes>

compile:

jacocotask:
     [echo] Coverage reporting: true

-test-main-check:

test-main:
   [script] Warning: Nashorn engine is planned to be removed from a future JDK release
[jacoco:coverage] Enhancing junit with coverage
    [junit] Error: --add-opens requires modules to be specified
    [junit] Running org.apache.poi.util.Batch-With-Multiple-Tests
    [junit] Tests run: 1, Failures: 0, Errors: 1, Skipped: 0, Time elapsed: 0 sec

BUILD FAILED
<https://builds.apache.org/job/POI-DSL-Windows-1.12/ws/build.xml>:1496: The following error occurred while executing this line:
<https://builds.apache.org/job/POI-DSL-Windows-1.12/ws/build.xml>:1226: Tests failed (crashed)

Total time: 7 minutes 55 seconds
Build step 'Invoke Ant' marked build as failure
Skipping publisher since build result is FAILURE
Archiving artifacts
[Fast Archiver] No prior successful build to compare, so performing full copy of artifacts
Skipping publisher since build result is FAILURE
Recording test results

---------------------------------------------------------------------
To unsubscribe, e-mail: [hidden email]
For additional commands, e-mail: [hidden email]

Reply | Threaded
Open this post in threaded view
|

Build failed in Jenkins: POI-DSL-Windows-1.12 #4

Apache Jenkins Server
See <https://builds.apache.org/job/POI-DSL-Windows-1.12/4/display/redirect?page=changes>

Changes:

[centic] Add required --add-opens and other settings for JDK 12 on Windows

------------------------------------------
Started by user centic
[EnvInject] - Loading node environment variables.
[EnvInject] - Preparing an environment for the build.
[EnvInject] - Keeping Jenkins system variables.
[EnvInject] - Keeping Jenkins build variables.
[EnvInject] - Injecting as environment variables the properties content
LANG=en_US.UTF-8
FORREST_HOME=f:jenkins ools orrestlatest

[EnvInject] - Variables injected successfully.
[EnvInject] - Injecting contributions.
Building remotely on windows-2016-2 (Windows) in workspace <https://builds.apache.org/job/POI-DSL-Windows-1.12/ws/>
[WS-CLEANUP] Deleting project workspace...
[WS-CLEANUP] Done
Updating https://svn.apache.org/repos/asf/poi/trunk at revision '2019-01-22T02:54:32.612 -0800'
U         jenkins\create_jobs.groovy

<-- Got one external: documentation, svn url: https://svn.apache.org/repos/asf/poi/site/src/documentation -->
Fetching 'https://svn.apache.org/repos/asf/poi/site/src/documentation' at -1 into 'F:\jenkins\jenkins-slave\workspace\POI-DSL-Windows-1.12\src\documentation'
At revision 1851804


<-- Got one external: forrest.properties, svn url: https://svn.apache.org/repos/asf/poi/site/forrest.properties -->
Fetching 'https://svn.apache.org/repos/asf/poi/site/forrest.properties' at -1 into 'F:\jenkins\jenkins-slave\workspace\POI-DSL-Windows-1.12\forrest.properties'
At revision 1851804

At revision 1851804

No changes for https://svn.apache.org/repos/asf/poi/site/src/documentation since the previous build
No changes for https://svn.apache.org/repos/asf/poi/site/forrest.properties since the previous build
[POI-DSL-Windows-1.12] $ cmd /c call F:\jenkins\jenkins-slave\temp\jenkins4812253245928082934.bat
    X   forrest.properties
X       src\documentation

Performing status on external item at 'src\documentation':
Java-Home: f:\\jenkins\\tools\\java\\latest12
 Volume in drive F is Data
 Volume Serial Number is 741C-2BD4

 Directory of f:\jenkins\tools\java\latest12

01/21/2019  10:31 AM    <DIR>          .
01/21/2019  10:31 AM    <DIR>          ..
01/21/2019  10:31 AM    <DIR>          bin
01/21/2019  10:31 AM    <DIR>          conf
01/21/2019  10:31 AM    <DIR>          include
01/21/2019  10:31 AM    <DIR>          jmods
01/21/2019  10:31 AM    <DIR>          legal
01/21/2019  10:31 AM    <DIR>          lib
01/16/2019  11:41 PM             1,213 release
               1 File(s)          1,213 bytes
               8 Dir(s)  174,817,214,464 bytes free
openjdk version "12-ea" 2019-03-19
OpenJDK Runtime Environment (build 12-ea+28)
OpenJDK 64-Bit Server VM (build 12-ea+28, mixed mode, sharing)
[POI-DSL-Windows-1.12] $ cmd.exe /C "F:\jenkins\tools\ant\apache-ant-1.9.9\bin\ant.bat -Dcoverage.enabled=true clean jenkins -Djava9addmodsvalue=-Dsun.reflect.debugModuleAccessChecks=true -Djava9addopens1=--add-opens=java.xml/com.sun.org.apache.xerces.internal.util=ALL-UNNAMED -Djava9addopens2=--add-opens=java.base/java.io=ALL-UNNAMED -Djava9addopens3=--add-opens=java.base/java.nio=ALL-UNNAMED -Djava9addopens4=--add-opens=java.base/java.lang=ALL-UNNAMED -Djava9addopens5=--add-opens=java.base/jdk.internal.ref=ALL-UNNAMED "-Djava.locale.providers=JRE,CLDR" && exit %%ERRORLEVEL%%"
Buildfile: <https://builds.apache.org/job/POI-DSL-Windows-1.12/ws/build.xml>
[propertyreset] Warning: Nashorn engine is planned to be removed from a future JDK release
[propertyreset] Warning: Nashorn engine is planned to be removed from a future JDK release

clean:
   [delete] Deleting directory <https://builds.apache.org/job/POI-DSL-Windows-1.12/ws/build>

check-jars:

fetch-jars:

check-ooxml-jars:

fetch-ooxml-jars:

init:
    [mkdir] Created dir: <https://builds.apache.org/job/POI-DSL-Windows-1.12/ws/build>
    [mkdir] Created dir: <https://builds.apache.org/job/POI-DSL-Windows-1.12/ws/build\classes>
    [mkdir] Created dir: <https://builds.apache.org/job/POI-DSL-Windows-1.12/ws/build\test-classes>
    [mkdir] Created dir: <https://builds.apache.org/job/POI-DSL-Windows-1.12/ws/build\test-results>
    [mkdir] Created dir: <https://builds.apache.org/job/POI-DSL-Windows-1.12/ws/build\scratchpad-classes>
    [mkdir] Created dir: <https://builds.apache.org/job/POI-DSL-Windows-1.12/ws/build\scratchpad-test-classes>
    [mkdir] Created dir: <https://builds.apache.org/job/POI-DSL-Windows-1.12/ws/build\scratchpad-test-results>
    [mkdir] Created dir: <https://builds.apache.org/job/POI-DSL-Windows-1.12/ws/build\geometry-java>
    [mkdir] Created dir: <https://builds.apache.org/job/POI-DSL-Windows-1.12/ws/build\ooxml-classes>
    [mkdir] Created dir: <https://builds.apache.org/job/POI-DSL-Windows-1.12/ws/build\ooxml-test-classes>
    [mkdir] Created dir: <https://builds.apache.org/job/POI-DSL-Windows-1.12/ws/build\ooxml-test-results>
    [mkdir] Created dir: <https://builds.apache.org/job/POI-DSL-Windows-1.12/ws/build\excelant-classes>
    [mkdir] Created dir: <https://builds.apache.org/job/POI-DSL-Windows-1.12/ws/build\excelant-test-classes>
    [mkdir] Created dir: <https://builds.apache.org/job/POI-DSL-Windows-1.12/ws/build\excelant-test-results>
    [mkdir] Created dir: <https://builds.apache.org/job/POI-DSL-Windows-1.12/ws/build\examples-classes>
    [mkdir] Created dir: <https://builds.apache.org/job/POI-DSL-Windows-1.12/ws/build\integration-test-classes>
    [mkdir] Created dir: <https://builds.apache.org/job/POI-DSL-Windows-1.12/ws/build\integration-test-results>
    [mkdir] Created dir: <https://builds.apache.org/job/POI-DSL-Windows-1.12/ws/build\dist>
    [mkdir] Created dir: <https://builds.apache.org/job/POI-DSL-Windows-1.12/ws/build\site>
     [echo] Using Ant: Apache Ant(TM) version 1.9.9 compiled on February 2 2017 from F:\\jenkins\\tools\\ant\\apache-ant-1.9.9, Ant detected Java 9 (may be different than actual Java sometimes...)
     [echo] Using Java: 12-ea/12-ea+28/12-ea+28/OpenJDK 64-Bit Server VM from Oracle Corporation on Windows Server 2016: 10.0
[release_tag] Warning: Nashorn engine is planned to be removed from a future JDK release

compile-main:
    [javac] Compiling 1213 source files to <https://builds.apache.org/job/POI-DSL-Windows-1.12/ws/build\classes>
    [javac] warning: [options] bootstrap class path not set in conjunction with -source 8
    [javac] Note: Some input files use or override a deprecated API.
    [javac] Note: Recompile with -Xlint:deprecation for details.
    [javac] Note: Some input files use unchecked or unsafe operations.
    [javac] Note: Recompile with -Xlint:unchecked for details.
    [javac] 1 warning
    [javac] Creating empty <https://builds.apache.org/job/POI-DSL-Windows-1.12/ws/build\classes\org\apache\poi\poifs\dev\package-info.class>
    [javac] Creating empty <https://builds.apache.org/job/POI-DSL-Windows-1.12/ws/build\classes\org\apache\poi\poifs\common\package-info.class>
    [javac] Creating empty <https://builds.apache.org/job/POI-DSL-Windows-1.12/ws/build\classes\org\apache\poi\poifs\filesystem\package-info.class>
    [javac] Creating empty <https://builds.apache.org/job/POI-DSL-Windows-1.12/ws/build\classes\org\apache\poi\poifs\storage\package-info.class>
    [javac] Creating empty <https://builds.apache.org/job/POI-DSL-Windows-1.12/ws/build\classes\org\apache\poi\poifs\package-info.class>
    [javac] Creating empty <https://builds.apache.org/job/POI-DSL-Windows-1.12/ws/build\classes\org\apache\poi\poifs\crypt\package-info.class>
    [javac] Creating empty <https://builds.apache.org/job/POI-DSL-Windows-1.12/ws/build\classes\org\apache\poi\poifs\eventfilesystem\package-info.class>
    [javac] Creating empty <https://builds.apache.org/job/POI-DSL-Windows-1.12/ws/build\classes\org\apache\poi\poifs\property\package-info.class>
    [javac] Compiling 546 source files to <https://builds.apache.org/job/POI-DSL-Windows-1.12/ws/build\test-classes>
    [javac] warning: [options] bootstrap class path not set in conjunction with -source 8
    [javac] Note: Some input files use or override a deprecated API.
    [javac] Note: Recompile with -Xlint:deprecation for details.
    [javac] 1 warning
     [copy] Copying 4 files to <https://builds.apache.org/job/POI-DSL-Windows-1.12/ws/build\classes>

check-ooxml-xsds:

fetch-ooxml-xsds:

generate-geometry:

compile-scratchpad:
    [javac] Compiling 497 source files to <https://builds.apache.org/job/POI-DSL-Windows-1.12/ws/build\scratchpad-classes>
    [javac] warning: [options] bootstrap class path not set in conjunction with -source 8
    [javac] Note: Some input files use or override a deprecated API.
    [javac] Note: Recompile with -Xlint:deprecation for details.
    [javac] Note: <https://builds.apache.org/job/POI-DSL-Windows-1.12/ws/src\scratchpad\src\org\apache\poi\extractor\ole2\OLE2ScratchpadExtractorFactory.java> uses unchecked or unsafe operations.
    [javac] Note: Recompile with -Xlint:unchecked for details.
    [javac] 1 warning
    [javac] Compiling 202 source files to <https://builds.apache.org/job/POI-DSL-Windows-1.12/ws/build\scratchpad-test-classes>
    [javac] warning: [options] bootstrap class path not set in conjunction with -source 8
    [javac] Note: Some input files use or override a deprecated API.
    [javac] Note: Recompile with -Xlint:deprecation for details.
    [javac] Note: <https://builds.apache.org/job/POI-DSL-Windows-1.12/ws/src\scratchpad\testcases\org\apache\poi\hslf\usermodel\TestBugs.java> uses unchecked or unsafe operations.
    [javac] Note: Recompile with -Xlint:unchecked for details.
    [javac] 1 warning
     [copy] Copying 2 files to <https://builds.apache.org/job/POI-DSL-Windows-1.12/ws/build\scratchpad-classes>

check-compiled-ooxml-xsds:

compile-ooxml-xsds:
    [mkdir] Created dir: <https://builds.apache.org/job/POI-DSL-Windows-1.12/ws/build\xmlbean-xsds>
    [mkdir] Created dir: <https://builds.apache.org/job/POI-DSL-Windows-1.12/ws/build\xmlbean-sources>
    [mkdir] Created dir: <https://builds.apache.org/job/POI-DSL-Windows-1.12/ws/build\xmlbean-classes>
     [copy] Copying 3 files to <https://builds.apache.org/job/POI-DSL-Windows-1.12/ws/build\xmlbean-xsds>
     [copy] Copying 87 resources to <https://builds.apache.org/job/POI-DSL-Windows-1.12/ws/build\xmlbean-xsds>
  [xmlbean] Time to build schema type system: 3.135 seconds
  [xmlbean] Time to generate code: 75.444 seconds
     [echo] Forking javac with max heap size 1536m
    [javac] Compiling 4576 source files to <https://builds.apache.org/job/POI-DSL-Windows-1.12/ws/build\xmlbean-classes>
    [javac] warning: [options] bootstrap class path not set in conjunction with -source 8
    [javac] Note: Some input files use unchecked or unsafe operations.
    [javac] Note: Recompile with -Xlint:unchecked for details.
    [javac] 1 warning
      [jar] Building jar: <https://builds.apache.org/job/POI-DSL-Windows-1.12/ws/ooxml-lib\ooxml-schemas-1.4.jar>
      [jar] Building jar: <https://builds.apache.org/job/POI-DSL-Windows-1.12/ws/ooxml-lib\ooxml-schemas-1.4-sources.jar>
   [delete] Deleting directory <https://builds.apache.org/job/POI-DSL-Windows-1.12/ws/build\xmlbean-xsds>
   [delete] Deleting directory <https://builds.apache.org/job/POI-DSL-Windows-1.12/ws/build\xmlbean-sources>
   [delete] Deleting directory <https://builds.apache.org/job/POI-DSL-Windows-1.12/ws/build\xmlbean-classes>
    [mkdir] Created dir: <https://builds.apache.org/job/POI-DSL-Windows-1.12/ws/build\xmlbean-xsds>
    [mkdir] Created dir: <https://builds.apache.org/job/POI-DSL-Windows-1.12/ws/build\xmlbean-sources>
    [mkdir] Created dir: <https://builds.apache.org/job/POI-DSL-Windows-1.12/ws/build\xmlbean-classes>
     [copy] Copying 10 files to <https://builds.apache.org/job/POI-DSL-Windows-1.12/ws/build\xmlbean-xsds>
     [copy] Copying 2 resources to <https://builds.apache.org/job/POI-DSL-Windows-1.12/ws/build\xmlbean-xsds>
  [xmlbean] Time to build schema type system: 0.88 seconds
  [xmlbean] Time to generate code: 6.314 seconds
     [echo] Forking javac with max heap size 1536m
    [javac] Compiling 372 source files to <https://builds.apache.org/job/POI-DSL-Windows-1.12/ws/build\xmlbean-classes>
    [javac] warning: [options] bootstrap class path not set in conjunction with -source 8
    [javac] Note: Some input files use unchecked or unsafe operations.
    [javac] Note: Recompile with -Xlint:unchecked for details.
    [javac] 1 warning
      [jar] Building jar: <https://builds.apache.org/job/POI-DSL-Windows-1.12/ws/ooxml-lib\ooxml-security-1.1.jar>
      [jar] Building jar: <https://builds.apache.org/job/POI-DSL-Windows-1.12/ws/ooxml-lib\ooxml-security-1.1-sources.jar>
   [delete] Deleting directory <https://builds.apache.org/job/POI-DSL-Windows-1.12/ws/build\xmlbean-xsds>
   [delete] Deleting directory <https://builds.apache.org/job/POI-DSL-Windows-1.12/ws/build\xmlbean-sources>
   [delete] Deleting directory <https://builds.apache.org/job/POI-DSL-Windows-1.12/ws/build\xmlbean-classes>

compile-ooxml:
    [javac] Compiling 595 source files to <https://builds.apache.org/job/POI-DSL-Windows-1.12/ws/build\ooxml-classes>
    [javac] warning: [options] bootstrap class path not set in conjunction with -source 8
    [javac] Note: Some input files use or override a deprecated API.
    [javac] Note: Recompile with -Xlint:deprecation for details.
    [javac] Note: Some input files use unchecked or unsafe operations.
    [javac] Note: Recompile with -Xlint:unchecked for details.
    [javac] 1 warning
    [javac] Compiling 268 source files to <https://builds.apache.org/job/POI-DSL-Windows-1.12/ws/build\ooxml-test-classes>
    [javac] warning: [options] bootstrap class path not set in conjunction with -source 8
    [javac] Note: Some input files use or override a deprecated API.
    [javac] Note: Recompile with -Xlint:deprecation for details.
    [javac] Note: <https://builds.apache.org/job/POI-DSL-Windows-1.12/ws/src\ooxml\testcases\org\apache\poi\sl\TestOleShape.java> uses unchecked or unsafe operations.
    [javac] Note: Recompile with -Xlint:unchecked for details.
    [javac] 1 warning
     [copy] Copying 3 files to <https://builds.apache.org/job/POI-DSL-Windows-1.12/ws/build\ooxml-classes>

compile-examples:
    [javac] Compiling 155 source files to <https://builds.apache.org/job/POI-DSL-Windows-1.12/ws/build\examples-classes>
    [javac] warning: [options] bootstrap class path not set in conjunction with -source 8
    [javac] Note: Some input files use or override a deprecated API.
    [javac] Note: Recompile with -Xlint:deprecation for details.
    [javac] 1 warning
     [copy] Copying 1 file to <https://builds.apache.org/job/POI-DSL-Windows-1.12/ws/build\examples-classes>

compile-excelant:
    [javac] Compiling 14 source files to <https://builds.apache.org/job/POI-DSL-Windows-1.12/ws/build\excelant-classes>
    [javac] warning: [options] bootstrap class path not set in conjunction with -source 8
    [javac] Note: Some input files use or override a deprecated API.
    [javac] Note: Recompile with -Xlint:deprecation for details.
    [javac] 1 warning
    [javac] Compiling 13 source files to <https://builds.apache.org/job/POI-DSL-Windows-1.12/ws/build\excelant-test-classes>
    [javac] warning: [options] bootstrap class path not set in conjunction with -source 8
    [javac] 1 warning
     [copy] Copying 1 file to <https://builds.apache.org/job/POI-DSL-Windows-1.12/ws/build\excelant-classes>

compile:

jacocotask:
     [echo] Coverage reporting: true

-test-main-check:

test-main:
   [script] Warning: Nashorn engine is planned to be removed from a future JDK release
[jacoco:coverage] Enhancing junit with coverage
    [junit] Error: --add-opens requires modules to be specified
    [junit] Running org.apache.poi.util.Batch-With-Multiple-Tests
    [junit] Tests run: 1, Failures: 0, Errors: 1, Skipped: 0, Time elapsed: 0 sec

BUILD FAILED
<https://builds.apache.org/job/POI-DSL-Windows-1.12/ws/build.xml>:1496: The following error occurred while executing this line:
<https://builds.apache.org/job/POI-DSL-Windows-1.12/ws/build.xml>:1226: Tests failed (crashed)

Total time: 7 minutes 57 seconds
Build step 'Invoke Ant' marked build as failure
Skipping publisher since build result is FAILURE
Archiving artifacts
[Fast Archiver] No prior successful build to compare, so performing full copy of artifacts
Skipping publisher since build result is FAILURE
Recording test results

---------------------------------------------------------------------
To unsubscribe, e-mail: [hidden email]
For additional commands, e-mail: [hidden email]

Reply | Threaded
Open this post in threaded view
|

Jenkins build is back to normal : POI-DSL-Windows-1.12 #5

Apache Jenkins Server
See <https://builds.apache.org/job/POI-DSL-Windows-1.12/5/display/redirect?page=changes>


---------------------------------------------------------------------
To unsubscribe, e-mail: [hidden email]
For additional commands, e-mail: [hidden email]