Build failed in Jenkins: POI-DSL-SonarQube #543

classic Classic list List threaded Threaded
5 messages Options
Reply | Threaded
Open this post in threaded view
|

Build failed in Jenkins: POI-DSL-SonarQube #543

Apache Jenkins Server
See <https://builds.apache.org/job/POI-DSL-SonarQube/543/display/redirect?page=changes>

Changes:

[kiwiwings] prepare for 4.1.2

[kiwiwings] release prepare for 4.1.1 - updating build.xml and changes.xml


------------------------------------------
[...truncated 378.84 KB...]
AU        src/documentation/resources/images/hslf_shapes.gif
AU        src/documentation/resources/images/logoWendyWise2.png
AU        src/documentation/resources/images/POIFSLifeCycle.gif
AU        src/documentation/resources/images/logoAdria1.png
AU        src/documentation/resources/images/logoAdria2.png
AU        src/documentation/resources/images/logoAdria3.png
AU        src/documentation/resources/images/remove.jpg
AU        src/documentation/resources/images/logoKarmokar3s.png
AU        src/documentation/resources/images/logoGlenStampoutlzis.png
AU        src/documentation/resources/images/logoKarmokar1.png
AU        src/documentation/resources/images/POIFSInitialization.gif
AU        src/documentation/resources/images/logoKarmokar2.png
AU        src/documentation/resources/images/logoRaPiGmbH10.png
AU        src/documentation/resources/images/logoKarmokar3.png
AU        src/documentation/resources/images/logoRaPiGmbH11.png
AU        src/documentation/resources/images/logoMichaelMosmann.png
AU        src/documentation/resources/images/logoKarmokar4.png
AU        src/documentation/resources/images/logoRaPiGmbH12.png
AU        src/documentation/resources/images/logoKarmokar5.png
AU        src/documentation/resources/images/logoKarmokar6.png
AU        src/documentation/resources/images/ApacheConEu08.jpg
AU        src/documentation/resources/images/BlockClassDiagram.gif
AU        src/documentation/resources/images/calculatePayment.jpg
AU        src/documentation/resources/images/PropertyTableClassDiagram.gif
AU        src/documentation/resources/images/logoRussellBeattie1.png
AU        src/documentation/resources/images/logoRussellBeattie2.png
AU        src/documentation/resources/images/logoRussellBeattie3.png
A         src/documentation/resources/schema
A         src/documentation/resources/schema/catalog.xcat
AU        src/documentation/resources/schema/changes-poi.dtd
AU        src/documentation/resources/schema/changes-poi.mod
A         src/documentation/sitemap.xmap
AU        src/documentation/skinconf.xml
AU        src/documentation/release-guide.txt
A         src/documentation/cli.xconf
AU        src/documentation/RELEASE-NOTES.txt
AU        src/documentation/README.txt
A         src/documentation/classes
A         src/documentation/classes/CatalogManager.properties
At revision 1868501

At revision 1868501

No changes for https://svn.apache.org/repos/asf/poi/site/forrest.properties since the previous build
Injecting SonarQube environment variables using the configuration: ASF Sonar Analysis
[POI-DSL-SonarQube] $ /bin/bash -xe /tmp/jenkins4761538714032984608.sh
+ svn status
    X   forrest.properties
X       src/documentation

Performing status on external item at 'src/documentation':
+ echo Java-Home: /home/jenkins/tools/java/latest1.8
Java-Home: /home/jenkins/tools/java/latest1.8
+ ls -al /home/jenkins/tools/java/latest1.8/
total 26000
drwxr-xr-x  7 root root     4096 Aug 26 09:32 .
drwxr-xr-x 27 root root     4096 Oct 13 18:32 ..
drwxr-xr-x  2 root root     4096 Aug 26 09:32 bin
-r--r--r--  1 root root     3244 Oct  6  2018 COPYRIGHT
drwxr-xr-x  3 root root     4096 Aug 26 09:32 include
-rw-r--r--  1 root root  5207154 Sep 12  2018 javafx-src.zip
drwxr-xr-x  5 root root     4096 Aug 26 09:32 jre
drwxr-xr-x  5 root root     4096 Aug 26 09:32 lib
-r--r--r--  1 root root       40 Oct  6  2018 LICENSE
drwxr-xr-x  4 root root     4096 Aug 26 09:32 man
-r--r--r--  1 root root      159 Oct  6  2018 README.html
-rw-r--r--  1 root root      424 Oct  6  2018 release
-rw-r--r--  1 root root 21101479 Oct  6  2018 src.zip
-rw-r--r--  1 root root   108062 Sep 12  2018 THIRDPARTYLICENSEREADME-JAVAFX.txt
-r--r--r--  1 root root   155003 Oct  6  2018 THIRDPARTYLICENSEREADME.txt
+ ls -al /home/jenkins/tools/java/latest1.8/bin
total 904
drwxr-xr-x 2 root root   4096 Aug 26 09:32 .
drwxr-xr-x 7 root root   4096 Aug 26 09:32 ..
-rwxr-xr-x 1 root root   8592 Oct  6  2018 appletviewer
lrwxrwxrwx 1 root root      8 Oct  6  2018 ControlPanel -> jcontrol
-rwxr-xr-x 1 root root   8584 Oct  6  2018 extcheck
-rwxr-xr-x 1 root root   8584 Oct  6  2018 idlj
-rwxr-xr-x 1 root root   8584 Oct  6  2018 jar
-rwxr-xr-x 1 root root   8584 Oct  6  2018 jarsigner
-rwxr-xr-x 1 root root   8464 Oct  6  2018 java
-rwxr-xr-x 1 root root   8584 Oct  6  2018 javac
-rwxr-xr-x 1 root root   8584 Oct  6  2018 javadoc
-rwxr-xr-x 1 root root   2293 Sep 12  2018 javafxpackager
-rwxr-xr-x 1 root root   8584 Oct  6  2018 javah
-rwxr-xr-x 1 root root   8584 Oct  6  2018 javap
-rwxr-xr-x 1 root root   2293 Sep 12  2018 javapackager
-rwxr-xr-x 1 root root   1809 Oct  6  2018 java-rmi.cgi
-rwxr-xr-x 1 root root 140248 Oct  6  2018 javaws
-rwxr-xr-x 1 root root   8584 Oct  6  2018 jcmd
-rwxr-xr-x 1 root root   8608 Oct  6  2018 jconsole
-rwxr-xr-x 1 root root   6264 Oct  6  2018 jcontrol
-rwxr-xr-x 1 root root   8600 Oct  6  2018 jdb
-rwxr-xr-x 1 root root   8584 Oct  6  2018 jdeps
-rwxr-xr-x 1 root root   8584 Oct  6  2018 jhat
-rwxr-xr-x 1 root root   8648 Oct  6  2018 jinfo
-rwxr-xr-x 1 root root   8584 Oct  6  2018 jjs
-rwxr-xr-x 1 root root   8648 Oct  6  2018 jmap
-rwxr-xr-x 1 root root  74675 Dec  8  2017 jmc
-rwxr-xr-x 1 root root    402 Dec  8  2017 jmc.ini
-rwxr-xr-x 1 root root   8584 Oct  6  2018 jps
-rwxr-xr-x 1 root root   8592 Oct  6  2018 jrunscript
-rwxr-xr-x 1 root root   8600 Oct  6  2018 jsadebugd
-rwxr-xr-x 1 root root   8648 Oct  6  2018 jstack
-rwxr-xr-x 1 root root   8584 Oct  6  2018 jstat
-rwxr-xr-x 1 root root   8584 Oct  6  2018 jstatd
-rwxr-xr-x 1 root root   5110 Jan 14  2017 jvisualvm
-rwxr-xr-x 1 root root   8584 Oct  6  2018 keytool
-rwxr-xr-x 1 root root   8592 Oct  6  2018 native2ascii
-rwxr-xr-x 1 root root   8656 Oct  6  2018 orbd
-rwxr-xr-x 1 root root   8584 Oct  6  2018 pack200
-rwxr-xr-x 1 root root   8592 Oct  6  2018 policytool
-rwxr-xr-x 1 root root   8584 Oct  6  2018 rmic
-rwxr-xr-x 1 root root   8584 Oct  6  2018 rmid
-rwxr-xr-x 1 root root   8592 Oct  6  2018 rmiregistry
-rwxr-xr-x 1 root root   8584 Oct  6  2018 schemagen
-rwxr-xr-x 1 root root   8584 Oct  6  2018 serialver
-rwxr-xr-x 1 root root   8592 Oct  6  2018 servertool
-rwxr-xr-x 1 root root   8656 Oct  6  2018 tnameserv
-rwxr-xr-x 1 root root 182536 Oct  6  2018 unpack200
-rwxr-xr-x 1 root root   8584 Oct  6  2018 wsgen
-rwxr-xr-x 1 root root   8584 Oct  6  2018 wsimport
-rwxr-xr-x 1 root root   8584 Oct  6  2018 xjc
+ /home/jenkins/tools/java/latest1.8/bin/java -version
java version "1.8.0_191"
Java(TM) SE Runtime Environment (build 1.8.0_191-b12)
Java HotSpot(TM) 64-Bit Server VM (build 25.191-b12, mixed mode)
+ echo which java
which java
+ which java
/home/jenkins/tools/java/latest1.8/bin/java
+ java -version
java version "1.8.0_191"
Java(TM) SE Runtime Environment (build 1.8.0_191-b12)
Java HotSpot(TM) 64-Bit Server VM (build 25.191-b12, mixed mode)
+ echo which javac
which javac
+ which javac
/home/jenkins/tools/java/latest1.8/bin/javac
+ javac -version
javac 1.8.0_191
+ echo Ant-Home:
Ant-Home:
+ ls -al
total 484
drwxr-xr-x  15 jenkins jenkins   4096 Oct 16 09:28 .
drwxr-xr-x 466 jenkins jenkins  36864 Oct 16 09:26 ..
-rw-r--r--   1 jenkins jenkins  11321 Oct 16 09:27 build.gradle
-rw-r--r--   1 jenkins jenkins 142300 Oct 16 09:26 build.xml
-rw-r--r--   1 jenkins jenkins   3279 Oct 16 09:27 .classpath
drwxr-xr-x   2 jenkins jenkins   4096 Oct 16 09:27 compile-lib
-rw-r--r--   1 jenkins jenkins   5814 Oct 16 09:27 doap_POI.rdf
-rw-r--r--   1 jenkins jenkins   2596 Oct 16 09:27 file-leak-detector.exclude
-rw-r--r--   1 jenkins jenkins   6229 Oct 16 09:28 forrest.properties
-rw-r--r--   1 jenkins jenkins     53 Oct 16 09:27 .gitattributes
-rw-r--r--   1 jenkins jenkins    493 Oct 16 09:27 .gitignore
drwxr-xr-x   3 jenkins jenkins   4096 Oct 16 09:27 gradle
-rwxr-xr-x   1 jenkins jenkins   5299 Oct 16 09:27 gradlew
-rw-r--r--   1 jenkins jenkins   2260 Oct 16 09:27 gradlew.bat
drwxr-xr-x   2 jenkins jenkins   4096 Oct 16 09:27 jenkins
-rw-r--r--   1 jenkins jenkins 166411 Oct 16 09:27 KEYS
drwxr-xr-x   2 jenkins jenkins   4096 Oct 16 09:27 legal
drwxr-xr-x   2 jenkins jenkins   4096 Oct 16 09:27 lib
drwxr-xr-x   2 jenkins jenkins   4096 Oct 16 09:27 maven
drwxr-xr-x   2 jenkins jenkins   4096 Oct 16 09:27 ooxml-lib
drwxr-xr-x   4 jenkins jenkins   4096 Oct 16 09:27 osgi
-rw-r--r--   1 jenkins jenkins   4813 Oct 16 09:27 patch.xml
-rw-r--r--   1 jenkins jenkins    426 Oct 16 09:27 .project
-rw-r--r--   1 jenkins jenkins   4280 Oct 16 09:27 README.rst
drwxr-xr-x   2 jenkins jenkins   4096 Oct 16 09:27 .settings
-rw-r--r--   1 jenkins jenkins    556 Oct 16 09:27 settings.gradle
drwxr-xr-x  10 jenkins jenkins   4096 Oct 16 09:27 sonar
drwxr-xr-x  15 jenkins jenkins   4096 Oct 16 09:28 src
drwxr-xr-x   4 jenkins jenkins   4096 Oct 16 09:28 .svn
drwxr-xr-x  14 jenkins jenkins   4096 Oct 16 09:27 test-data
-rw-r--r--   1 jenkins jenkins    136 Oct 16 09:27 .travis.yml
+ echo which ant
which ant
+ which ant
/usr/bin/ant
+ ant -version
Apache Ant(TM) version 1.10.5 compiled on March 28 2019
+ echo '<project default="test"><target name="test"><echo>Java ${ant.java.version}/${java.version}</echo><exec executable="javac"><arg value="-version"/></exec></target></project>'
+ ant -f build.javacheck.xml -v
Apache Ant(TM) version 1.10.5 compiled on March 28 2019
Buildfile: <https://builds.apache.org/job/POI-DSL-SonarQube/ws/build.javacheck.xml>
Detected Java version: 1.8 in: /usr/local/asfpackages/java/jdk1.8.0_191/jre
Detected OS: Linux
parsing buildfile <https://builds.apache.org/job/POI-DSL-SonarQube/ws/build.javacheck.xml> with URI = <https://builds.apache.org/job/POI-DSL-SonarQube/ws/build.javacheck.xml>
Project base dir set to: <https://builds.apache.org/job/POI-DSL-SonarQube/ws/>
Build sequence for target(s) `test' is [test]
Complete build sequence is [test, ]

test:
parsing buildfile jar:file:/usr/share/ant/lib/ant.jar!/org/apache/tools/ant/antlib.xml with URI = jar:file:/usr/share/ant/lib/ant.jar!/org/apache/tools/ant/antlib.xml from a zip file
     [echo] Java 1.8/1.8.0_191
     [exec] Current OS is Linux
     [exec] Executing 'javac' with arguments:
     [exec] '-version'
     [exec]
     [exec] The ' characters around the executable and arguments are
     [exec] not part of the command.
     [exec] javac 1.8.0_191

BUILD SUCCESSFUL
Total time: 0 seconds
+ exit 0
[POI-DSL-SonarQube] $ mvn -f sonar/pom.xml -Dmaven.repo.local=<https://builds.apache.org/job/POI-DSL-SonarQube/ws/.repository> clean
FATAL: command execution failed
java.io.IOException: error=2, No such file or directory
        at java.lang.UNIXProcess.forkAndExec(Native Method)
        at java.lang.UNIXProcess.<init>(UNIXProcess.java:247)
        at java.lang.ProcessImpl.start(ProcessImpl.java:134)
        at java.lang.ProcessBuilder.start(ProcessBuilder.java:1029)
Also:   hudson.remoting.Channel$CallSiteStackTrace: Remote call to H22
                at hudson.remoting.Channel.attachCallSiteStackTrace(Channel.java:1743)
                at hudson.remoting.UserRequest$ExceptionResponse.retrieve(UserRequest.java:357)
                at hudson.remoting.Channel.call(Channel.java:957)
                at hudson.Launcher$RemoteLauncher.launch(Launcher.java:1060)
                at hudson.Launcher$ProcStarter.start(Launcher.java:455)
                at hudson.Launcher$ProcStarter.join(Launcher.java:466)
                at hudson.tasks.Maven.perform(Maven.java:368)
                at hudson.tasks.BuildStepMonitor$1.perform(BuildStepMonitor.java:20)
                at hudson.model.AbstractBuild$AbstractBuildExecution.perform(AbstractBuild.java:741)
                at hudson.model.Build$BuildExecution.build(Build.java:206)
                at hudson.model.Build$BuildExecution.doRun(Build.java:163)
                at hudson.model.AbstractBuild$AbstractBuildExecution.run(AbstractBuild.java:504)
                at hudson.model.Run.execute(Run.java:1815)
                at hudson.model.FreeStyleBuild.run(FreeStyleBuild.java:43)
                at hudson.model.ResourceController.execute(ResourceController.java:97)
                at hudson.model.Executor.run(Executor.java:429)
Caused: java.io.IOException: Cannot run program "mvn" (in directory "<https://builds.apache.org/job/POI-DSL-SonarQube/ws/")>: error=2, No such file or directory
        at java.lang.ProcessBuilder.start(ProcessBuilder.java:1048)
        at hudson.Proc$LocalProc.<init>(Proc.java:250)
        at hudson.Proc$LocalProc.<init>(Proc.java:219)
        at hudson.Launcher$LocalLauncher.launch(Launcher.java:937)
        at hudson.Launcher$ProcStarter.start(Launcher.java:455)
        at hudson.Launcher$RemoteLaunchCallable.call(Launcher.java:1319)
        at hudson.Launcher$RemoteLaunchCallable.call(Launcher.java:1272)
        at hudson.remoting.UserRequest.perform(UserRequest.java:212)
        at hudson.remoting.UserRequest.perform(UserRequest.java:54)
        at hudson.remoting.Request$2.run(Request.java:369)
        at hudson.remoting.InterceptingExecutorService$1.call(InterceptingExecutorService.java:72)
        at java.util.concurrent.FutureTask.run(FutureTask.java:266)
        at java.util.concurrent.ThreadPoolExecutor.runWorker(ThreadPoolExecutor.java:1149)
        at java.util.concurrent.ThreadPoolExecutor$Worker.run(ThreadPoolExecutor.java:624)
        at java.lang.Thread.run(Thread.java:748)
Build step 'Invoke top-level Maven targets' marked build as failure
WARN: Unable to locate 'report-task.txt' in the workspace. Did the SonarScanner succeeded?

---------------------------------------------------------------------
To unsubscribe, e-mail: [hidden email]
For additional commands, e-mail: [hidden email]

Reply | Threaded
Open this post in threaded view
|

Build failed in Jenkins: POI-DSL-SonarQube #544

Apache Jenkins Server
See <https://builds.apache.org/job/POI-DSL-SonarQube/544/display/redirect?page=changes>

Changes:

[kiwiwings] POI 4.1.1 release infos

[kiwiwings] POI 4.1.1 release infos

[kiwiwings] POI 4.1.1 release infos


------------------------------------------
[...truncated 378.84 KB...]
AU        src/documentation/resources/images/hslf_shapes.gif
AU        src/documentation/resources/images/logoWendyWise2.png
AU        src/documentation/resources/images/POIFSLifeCycle.gif
AU        src/documentation/resources/images/logoAdria1.png
AU        src/documentation/resources/images/logoAdria2.png
AU        src/documentation/resources/images/logoAdria3.png
AU        src/documentation/resources/images/remove.jpg
AU        src/documentation/resources/images/logoKarmokar3s.png
AU        src/documentation/resources/images/logoGlenStampoutlzis.png
AU        src/documentation/resources/images/logoKarmokar1.png
AU        src/documentation/resources/images/POIFSInitialization.gif
AU        src/documentation/resources/images/logoKarmokar2.png
AU        src/documentation/resources/images/logoRaPiGmbH10.png
AU        src/documentation/resources/images/logoKarmokar3.png
AU        src/documentation/resources/images/logoRaPiGmbH11.png
AU        src/documentation/resources/images/logoMichaelMosmann.png
AU        src/documentation/resources/images/logoKarmokar4.png
AU        src/documentation/resources/images/logoRaPiGmbH12.png
AU        src/documentation/resources/images/logoKarmokar5.png
AU        src/documentation/resources/images/logoKarmokar6.png
AU        src/documentation/resources/images/ApacheConEu08.jpg
AU        src/documentation/resources/images/BlockClassDiagram.gif
AU        src/documentation/resources/images/calculatePayment.jpg
AU        src/documentation/resources/images/PropertyTableClassDiagram.gif
AU        src/documentation/resources/images/logoRussellBeattie1.png
AU        src/documentation/resources/images/logoRussellBeattie2.png
AU        src/documentation/resources/images/logoRussellBeattie3.png
A         src/documentation/resources/schema
A         src/documentation/resources/schema/catalog.xcat
AU        src/documentation/resources/schema/changes-poi.dtd
AU        src/documentation/resources/schema/changes-poi.mod
A         src/documentation/sitemap.xmap
AU        src/documentation/skinconf.xml
AU        src/documentation/release-guide.txt
A         src/documentation/cli.xconf
AU        src/documentation/RELEASE-NOTES.txt
AU        src/documentation/README.txt
A         src/documentation/classes
A         src/documentation/classes/CatalogManager.properties
At revision 1868684

At revision 1868684

No changes for https://svn.apache.org/repos/asf/poi/site/forrest.properties since the previous build
Injecting SonarQube environment variables using the configuration: ASF Sonar Analysis
[POI-DSL-SonarQube] $ /bin/bash -xe /tmp/jenkins554816064911463642.sh
+ svn status
    X   forrest.properties
X       src/documentation

Performing status on external item at 'src/documentation':
+ echo Java-Home: /home/jenkins/tools/java/latest1.8
Java-Home: /home/jenkins/tools/java/latest1.8
+ ls -al /home/jenkins/tools/java/latest1.8/
total 26000
drwxr-xr-x  7 root root     4096 Oct  2 17:13 .
drwxr-xr-x 27 root root     4096 Oct 13 18:30 ..
drwxr-xr-x  2 root root     4096 Oct  2 17:13 bin
-r--r--r--  1 root root     3244 Oct  6  2018 COPYRIGHT
drwxr-xr-x  3 root root     4096 Oct  2 17:13 include
-rw-r--r--  1 root root  5207154 Sep 12  2018 javafx-src.zip
drwxr-xr-x  5 root root     4096 Oct  2 17:13 jre
drwxr-xr-x  5 root root     4096 Oct  2 17:13 lib
-r--r--r--  1 root root       40 Oct  6  2018 LICENSE
drwxr-xr-x  4 root root     4096 Oct  2 17:13 man
-r--r--r--  1 root root      159 Oct  6  2018 README.html
-rw-r--r--  1 root root      424 Oct  6  2018 release
-rw-r--r--  1 root root 21101479 Oct  6  2018 src.zip
-rw-r--r--  1 root root   108062 Sep 12  2018 THIRDPARTYLICENSEREADME-JAVAFX.txt
-r--r--r--  1 root root   155003 Oct  6  2018 THIRDPARTYLICENSEREADME.txt
+ ls -al /home/jenkins/tools/java/latest1.8/bin
total 904
drwxr-xr-x 2 root root   4096 Oct  2 17:13 .
drwxr-xr-x 7 root root   4096 Oct  2 17:13 ..
-rwxr-xr-x 1 root root   8592 Oct  6  2018 appletviewer
lrwxrwxrwx 1 root root      8 Oct  6  2018 ControlPanel -> jcontrol
-rwxr-xr-x 1 root root   8584 Oct  6  2018 extcheck
-rwxr-xr-x 1 root root   8584 Oct  6  2018 idlj
-rwxr-xr-x 1 root root   8584 Oct  6  2018 jar
-rwxr-xr-x 1 root root   8584 Oct  6  2018 jarsigner
-rwxr-xr-x 1 root root   8464 Oct  6  2018 java
-rwxr-xr-x 1 root root   8584 Oct  6  2018 javac
-rwxr-xr-x 1 root root   8584 Oct  6  2018 javadoc
-rwxr-xr-x 1 root root   2293 Sep 12  2018 javafxpackager
-rwxr-xr-x 1 root root   8584 Oct  6  2018 javah
-rwxr-xr-x 1 root root   8584 Oct  6  2018 javap
-rwxr-xr-x 1 root root   2293 Sep 12  2018 javapackager
-rwxr-xr-x 1 root root   1809 Oct  6  2018 java-rmi.cgi
-rwxr-xr-x 1 root root 140248 Oct  6  2018 javaws
-rwxr-xr-x 1 root root   8584 Oct  6  2018 jcmd
-rwxr-xr-x 1 root root   8608 Oct  6  2018 jconsole
-rwxr-xr-x 1 root root   6264 Oct  6  2018 jcontrol
-rwxr-xr-x 1 root root   8600 Oct  6  2018 jdb
-rwxr-xr-x 1 root root   8584 Oct  6  2018 jdeps
-rwxr-xr-x 1 root root   8584 Oct  6  2018 jhat
-rwxr-xr-x 1 root root   8648 Oct  6  2018 jinfo
-rwxr-xr-x 1 root root   8584 Oct  6  2018 jjs
-rwxr-xr-x 1 root root   8648 Oct  6  2018 jmap
-rwxr-xr-x 1 root root  74675 Dec  8  2017 jmc
-rwxr-xr-x 1 root root    402 Dec  8  2017 jmc.ini
-rwxr-xr-x 1 root root   8584 Oct  6  2018 jps
-rwxr-xr-x 1 root root   8592 Oct  6  2018 jrunscript
-rwxr-xr-x 1 root root   8600 Oct  6  2018 jsadebugd
-rwxr-xr-x 1 root root   8648 Oct  6  2018 jstack
-rwxr-xr-x 1 root root   8584 Oct  6  2018 jstat
-rwxr-xr-x 1 root root   8584 Oct  6  2018 jstatd
-rwxr-xr-x 1 root root   5110 Jan 14  2017 jvisualvm
-rwxr-xr-x 1 root root   8584 Oct  6  2018 keytool
-rwxr-xr-x 1 root root   8592 Oct  6  2018 native2ascii
-rwxr-xr-x 1 root root   8656 Oct  6  2018 orbd
-rwxr-xr-x 1 root root   8584 Oct  6  2018 pack200
-rwxr-xr-x 1 root root   8592 Oct  6  2018 policytool
-rwxr-xr-x 1 root root   8584 Oct  6  2018 rmic
-rwxr-xr-x 1 root root   8584 Oct  6  2018 rmid
-rwxr-xr-x 1 root root   8592 Oct  6  2018 rmiregistry
-rwxr-xr-x 1 root root   8584 Oct  6  2018 schemagen
-rwxr-xr-x 1 root root   8584 Oct  6  2018 serialver
-rwxr-xr-x 1 root root   8592 Oct  6  2018 servertool
-rwxr-xr-x 1 root root   8656 Oct  6  2018 tnameserv
-rwxr-xr-x 1 root root 182536 Oct  6  2018 unpack200
-rwxr-xr-x 1 root root   8584 Oct  6  2018 wsgen
-rwxr-xr-x 1 root root   8584 Oct  6  2018 wsimport
-rwxr-xr-x 1 root root   8584 Oct  6  2018 xjc
+ /home/jenkins/tools/java/latest1.8/bin/java -version
java version "1.8.0_191"
Java(TM) SE Runtime Environment (build 1.8.0_191-b12)
Java HotSpot(TM) 64-Bit Server VM (build 25.191-b12, mixed mode)
+ echo which java
which java
+ which java
/home/jenkins/tools/java/latest1.8/bin/java
+ java -version
java version "1.8.0_191"
Java(TM) SE Runtime Environment (build 1.8.0_191-b12)
Java HotSpot(TM) 64-Bit Server VM (build 25.191-b12, mixed mode)
+ echo which javac
which javac
+ which javac
/home/jenkins/tools/java/latest1.8/bin/javac
+ javac -version
javac 1.8.0_191
+ echo Ant-Home:
Ant-Home:
+ ls -al
total 456
drwxr-xr-x  15 jenkins jenkins   4096 Oct 21 09:27 .
drwxr-xr-x 208 jenkins jenkins  12288 Oct 21 09:26 ..
-rw-r--r--   1 jenkins jenkins  11321 Oct 21 09:27 build.gradle
-rw-r--r--   1 jenkins jenkins 142300 Oct 21 09:26 build.xml
-rw-r--r--   1 jenkins jenkins   3279 Oct 21 09:27 .classpath
drwxr-xr-x   2 jenkins jenkins   4096 Oct 21 09:27 compile-lib
-rw-r--r--   1 jenkins jenkins   5987 Oct 21 09:26 doap_POI.rdf
-rw-r--r--   1 jenkins jenkins   2596 Oct 21 09:27 file-leak-detector.exclude
-rw-r--r--   1 jenkins jenkins   6229 Oct 21 09:27 forrest.properties
-rw-r--r--   1 jenkins jenkins     53 Oct 21 09:27 .gitattributes
-rw-r--r--   1 jenkins jenkins    493 Oct 21 09:27 .gitignore
drwxr-xr-x   3 jenkins jenkins   4096 Oct 21 09:27 gradle
-rwxr-xr-x   1 jenkins jenkins   5299 Oct 21 09:27 gradlew
-rw-r--r--   1 jenkins jenkins   2260 Oct 21 09:27 gradlew.bat
drwxr-xr-x   2 jenkins jenkins   4096 Oct 21 09:27 jenkins
-rw-r--r--   1 jenkins jenkins 166411 Oct 21 09:27 KEYS
drwxr-xr-x   2 jenkins jenkins   4096 Oct 21 09:27 legal
drwxr-xr-x   2 jenkins jenkins   4096 Oct 21 09:27 lib
drwxr-xr-x   2 jenkins jenkins   4096 Oct 21 09:27 maven
drwxr-xr-x   2 jenkins jenkins   4096 Oct 21 09:27 ooxml-lib
drwxr-xr-x   4 jenkins jenkins   4096 Oct 21 09:27 osgi
-rw-r--r--   1 jenkins jenkins   4813 Oct 21 09:27 patch.xml
-rw-r--r--   1 jenkins jenkins    426 Oct 21 09:27 .project
-rw-r--r--   1 jenkins jenkins   4280 Oct 21 09:27 README.rst
drwxr-xr-x   2 jenkins jenkins   4096 Oct 21 09:27 .settings
-rw-r--r--   1 jenkins jenkins    556 Oct 21 09:27 settings.gradle
drwxr-xr-x  10 jenkins jenkins   4096 Oct 21 09:27 sonar
drwxr-xr-x  15 jenkins jenkins   4096 Oct 21 09:27 src
drwxr-xr-x   4 jenkins jenkins   4096 Oct 21 09:28 .svn
drwxr-xr-x  14 jenkins jenkins   4096 Oct 21 09:27 test-data
-rw-r--r--   1 jenkins jenkins    136 Oct 21 09:27 .travis.yml
+ echo which ant
which ant
+ which ant
/usr/bin/ant
+ ant -version
Apache Ant(TM) version 1.10.5 compiled on March 28 2019
+ echo '<project default="test"><target name="test"><echo>Java ${ant.java.version}/${java.version}</echo><exec executable="javac"><arg value="-version"/></exec></target></project>'
+ ant -f build.javacheck.xml -v
Apache Ant(TM) version 1.10.5 compiled on March 28 2019
Buildfile: <https://builds.apache.org/job/POI-DSL-SonarQube/ws/build.javacheck.xml>
Detected Java version: 1.8 in: /usr/local/asfpackages/java/jdk1.8.0_191/jre
Detected OS: Linux
parsing buildfile <https://builds.apache.org/job/POI-DSL-SonarQube/ws/build.javacheck.xml> with URI = <https://builds.apache.org/job/POI-DSL-SonarQube/ws/build.javacheck.xml>
Project base dir set to: <https://builds.apache.org/job/POI-DSL-SonarQube/ws/>
Build sequence for target(s) `test' is [test]
Complete build sequence is [test, ]

test:
parsing buildfile jar:file:/usr/share/ant/lib/ant.jar!/org/apache/tools/ant/antlib.xml with URI = jar:file:/usr/share/ant/lib/ant.jar!/org/apache/tools/ant/antlib.xml from a zip file
     [echo] Java 1.8/1.8.0_191
     [exec] Current OS is Linux
     [exec] Executing 'javac' with arguments:
     [exec] '-version'
     [exec]
     [exec] The ' characters around the executable and arguments are
     [exec] not part of the command.
     [exec] javac 1.8.0_191

BUILD SUCCESSFUL
Total time: 0 seconds
+ exit 0
[POI-DSL-SonarQube] $ mvn -f sonar/pom.xml -Dmaven.repo.local=<https://builds.apache.org/job/POI-DSL-SonarQube/ws/.repository> clean
FATAL: command execution failed
java.io.IOException: error=2, No such file or directory
        at java.lang.UNIXProcess.forkAndExec(Native Method)
        at java.lang.UNIXProcess.<init>(UNIXProcess.java:247)
        at java.lang.ProcessImpl.start(ProcessImpl.java:134)
        at java.lang.ProcessBuilder.start(ProcessBuilder.java:1029)
Also:   hudson.remoting.Channel$CallSiteStackTrace: Remote call to H29
                at hudson.remoting.Channel.attachCallSiteStackTrace(Channel.java:1743)
                at hudson.remoting.UserRequest$ExceptionResponse.retrieve(UserRequest.java:357)
                at hudson.remoting.Channel.call(Channel.java:957)
                at hudson.Launcher$RemoteLauncher.launch(Launcher.java:1060)
                at hudson.Launcher$ProcStarter.start(Launcher.java:455)
                at hudson.Launcher$ProcStarter.join(Launcher.java:466)
                at hudson.tasks.Maven.perform(Maven.java:368)
                at hudson.tasks.BuildStepMonitor$1.perform(BuildStepMonitor.java:20)
                at hudson.model.AbstractBuild$AbstractBuildExecution.perform(AbstractBuild.java:741)
                at hudson.model.Build$BuildExecution.build(Build.java:206)
                at hudson.model.Build$BuildExecution.doRun(Build.java:163)
                at hudson.model.AbstractBuild$AbstractBuildExecution.run(AbstractBuild.java:504)
                at hudson.model.Run.execute(Run.java:1815)
                at hudson.model.FreeStyleBuild.run(FreeStyleBuild.java:43)
                at hudson.model.ResourceController.execute(ResourceController.java:97)
                at hudson.model.Executor.run(Executor.java:429)
Caused: java.io.IOException: Cannot run program "mvn" (in directory "<https://builds.apache.org/job/POI-DSL-SonarQube/ws/")>: error=2, No such file or directory
        at java.lang.ProcessBuilder.start(ProcessBuilder.java:1048)
        at hudson.Proc$LocalProc.<init>(Proc.java:250)
        at hudson.Proc$LocalProc.<init>(Proc.java:219)
        at hudson.Launcher$LocalLauncher.launch(Launcher.java:937)
        at hudson.Launcher$ProcStarter.start(Launcher.java:455)
        at hudson.Launcher$RemoteLaunchCallable.call(Launcher.java:1319)
        at hudson.Launcher$RemoteLaunchCallable.call(Launcher.java:1272)
        at hudson.remoting.UserRequest.perform(UserRequest.java:212)
        at hudson.remoting.UserRequest.perform(UserRequest.java:54)
        at hudson.remoting.Request$2.run(Request.java:369)
        at hudson.remoting.InterceptingExecutorService$1.call(InterceptingExecutorService.java:72)
        at java.util.concurrent.FutureTask.run(FutureTask.java:266)
        at java.util.concurrent.ThreadPoolExecutor.runWorker(ThreadPoolExecutor.java:1149)
        at java.util.concurrent.ThreadPoolExecutor$Worker.run(ThreadPoolExecutor.java:624)
        at java.lang.Thread.run(Thread.java:748)
Build step 'Invoke top-level Maven targets' marked build as failure
WARN: Unable to locate 'report-task.txt' in the workspace. Did the SonarScanner succeeded?

---------------------------------------------------------------------
To unsubscribe, e-mail: [hidden email]
For additional commands, e-mail: [hidden email]

Reply | Threaded
Open this post in threaded view
|

Build failed in Jenkins: POI-DSL-SonarQube #545

Apache Jenkins Server
See <https://builds.apache.org/job/POI-DSL-SonarQube/545/display/redirect?page=changes>

Changes:

[centic] Bug 63805: BigDecimal: use enum args instead of integers (deprecated in Java 9)


------------------------------------------
[...truncated 378.91 KB...]
AU        src/documentation/resources/images/logoWendyWise2.png
AU        src/documentation/resources/images/POIFSLifeCycle.gif
AU        src/documentation/resources/images/logoAdria1.png
AU        src/documentation/resources/images/logoAdria2.png
AU        src/documentation/resources/images/logoAdria3.png
AU        src/documentation/resources/images/remove.jpg
AU        src/documentation/resources/images/logoKarmokar3s.png
AU        src/documentation/resources/images/logoGlenStampoutlzis.png
AU        src/documentation/resources/images/logoKarmokar1.png
AU        src/documentation/resources/images/POIFSInitialization.gif
AU        src/documentation/resources/images/logoKarmokar2.png
AU        src/documentation/resources/images/logoRaPiGmbH10.png
AU        src/documentation/resources/images/logoKarmokar3.png
AU        src/documentation/resources/images/logoRaPiGmbH11.png
AU        src/documentation/resources/images/logoMichaelMosmann.png
AU        src/documentation/resources/images/logoKarmokar4.png
AU        src/documentation/resources/images/logoRaPiGmbH12.png
AU        src/documentation/resources/images/logoKarmokar5.png
AU        src/documentation/resources/images/logoKarmokar6.png
AU        src/documentation/resources/images/ApacheConEu08.jpg
AU        src/documentation/resources/images/BlockClassDiagram.gif
AU        src/documentation/resources/images/calculatePayment.jpg
AU        src/documentation/resources/images/PropertyTableClassDiagram.gif
AU        src/documentation/resources/images/logoRussellBeattie1.png
AU        src/documentation/resources/images/logoRussellBeattie2.png
AU        src/documentation/resources/images/logoRussellBeattie3.png
A         src/documentation/resources/schema
A         src/documentation/resources/schema/catalog.xcat
AU        src/documentation/resources/schema/changes-poi.dtd
AU        src/documentation/resources/schema/changes-poi.mod
A         src/documentation/sitemap.xmap
AU        src/documentation/skinconf.xml
AU        src/documentation/release-guide.txt
A         src/documentation/cli.xconf
AU        src/documentation/RELEASE-NOTES.txt
AU        src/documentation/README.txt
A         src/documentation/classes
A         src/documentation/classes/CatalogManager.properties
At revision 1868917

At revision 1868917

No changes for https://svn.apache.org/repos/asf/poi/site/forrest.properties since the previous build
No changes for https://svn.apache.org/repos/asf/poi/site/src/documentation since the previous build
Injecting SonarQube environment variables using the configuration: ASF Sonar Analysis
[POI-DSL-SonarQube] $ /bin/bash -xe /tmp/jenkins2569891591896625158.sh
+ svn status
    X   forrest.properties
X       src/documentation

Performing status on external item at 'src/documentation':
+ echo Java-Home: /home/jenkins/tools/java/latest1.8
Java-Home: /home/jenkins/tools/java/latest1.8
+ ls -al /home/jenkins/tools/java/latest1.8/
total 26000
drwxr-xr-x  7 root root     4096 Oct  3 10:14 .
drwxr-xr-x 27 root root     4096 Oct 13 18:21 ..
drwxr-xr-x  2 root root     4096 Oct  3 10:14 bin
-r--r--r--  1 root root     3244 Oct  6  2018 COPYRIGHT
drwxr-xr-x  3 root root     4096 Oct  3 10:14 include
-rw-r--r--  1 root root  5207154 Sep 12  2018 javafx-src.zip
drwxr-xr-x  5 root root     4096 Oct  3 10:14 jre
drwxr-xr-x  5 root root     4096 Oct  3 10:14 lib
-r--r--r--  1 root root       40 Oct  6  2018 LICENSE
drwxr-xr-x  4 root root     4096 Oct  3 10:14 man
-r--r--r--  1 root root      159 Oct  6  2018 README.html
-rw-r--r--  1 root root      424 Oct  6  2018 release
-rw-r--r--  1 root root 21101479 Oct  6  2018 src.zip
-rw-r--r--  1 root root   108062 Sep 12  2018 THIRDPARTYLICENSEREADME-JAVAFX.txt
-r--r--r--  1 root root   155003 Oct  6  2018 THIRDPARTYLICENSEREADME.txt
+ ls -al /home/jenkins/tools/java/latest1.8/bin
total 904
drwxr-xr-x 2 root root   4096 Oct  3 10:14 .
drwxr-xr-x 7 root root   4096 Oct  3 10:14 ..
-rwxr-xr-x 1 root root   8592 Oct  6  2018 appletviewer
lrwxrwxrwx 1 root root      8 Oct  6  2018 ControlPanel -> jcontrol
-rwxr-xr-x 1 root root   8584 Oct  6  2018 extcheck
-rwxr-xr-x 1 root root   8584 Oct  6  2018 idlj
-rwxr-xr-x 1 root root   8584 Oct  6  2018 jar
-rwxr-xr-x 1 root root   8584 Oct  6  2018 jarsigner
-rwxr-xr-x 1 root root   8464 Oct  6  2018 java
-rwxr-xr-x 1 root root   8584 Oct  6  2018 javac
-rwxr-xr-x 1 root root   8584 Oct  6  2018 javadoc
-rwxr-xr-x 1 root root   2293 Sep 12  2018 javafxpackager
-rwxr-xr-x 1 root root   8584 Oct  6  2018 javah
-rwxr-xr-x 1 root root   8584 Oct  6  2018 javap
-rwxr-xr-x 1 root root   2293 Sep 12  2018 javapackager
-rwxr-xr-x 1 root root   1809 Oct  6  2018 java-rmi.cgi
-rwxr-xr-x 1 root root 140248 Oct  6  2018 javaws
-rwxr-xr-x 1 root root   8584 Oct  6  2018 jcmd
-rwxr-xr-x 1 root root   8608 Oct  6  2018 jconsole
-rwxr-xr-x 1 root root   6264 Oct  6  2018 jcontrol
-rwxr-xr-x 1 root root   8600 Oct  6  2018 jdb
-rwxr-xr-x 1 root root   8584 Oct  6  2018 jdeps
-rwxr-xr-x 1 root root   8584 Oct  6  2018 jhat
-rwxr-xr-x 1 root root   8648 Oct  6  2018 jinfo
-rwxr-xr-x 1 root root   8584 Oct  6  2018 jjs
-rwxr-xr-x 1 root root   8648 Oct  6  2018 jmap
-rwxr-xr-x 1 root root  74675 Dec  8  2017 jmc
-rwxr-xr-x 1 root root    402 Dec  8  2017 jmc.ini
-rwxr-xr-x 1 root root   8584 Oct  6  2018 jps
-rwxr-xr-x 1 root root   8592 Oct  6  2018 jrunscript
-rwxr-xr-x 1 root root   8600 Oct  6  2018 jsadebugd
-rwxr-xr-x 1 root root   8648 Oct  6  2018 jstack
-rwxr-xr-x 1 root root   8584 Oct  6  2018 jstat
-rwxr-xr-x 1 root root   8584 Oct  6  2018 jstatd
-rwxr-xr-x 1 root root   5110 Jan 14  2017 jvisualvm
-rwxr-xr-x 1 root root   8584 Oct  6  2018 keytool
-rwxr-xr-x 1 root root   8592 Oct  6  2018 native2ascii
-rwxr-xr-x 1 root root   8656 Oct  6  2018 orbd
-rwxr-xr-x 1 root root   8584 Oct  6  2018 pack200
-rwxr-xr-x 1 root root   8592 Oct  6  2018 policytool
-rwxr-xr-x 1 root root   8584 Oct  6  2018 rmic
-rwxr-xr-x 1 root root   8584 Oct  6  2018 rmid
-rwxr-xr-x 1 root root   8592 Oct  6  2018 rmiregistry
-rwxr-xr-x 1 root root   8584 Oct  6  2018 schemagen
-rwxr-xr-x 1 root root   8584 Oct  6  2018 serialver
-rwxr-xr-x 1 root root   8592 Oct  6  2018 servertool
-rwxr-xr-x 1 root root   8656 Oct  6  2018 tnameserv
-rwxr-xr-x 1 root root 182536 Oct  6  2018 unpack200
-rwxr-xr-x 1 root root   8584 Oct  6  2018 wsgen
-rwxr-xr-x 1 root root   8584 Oct  6  2018 wsimport
-rwxr-xr-x 1 root root   8584 Oct  6  2018 xjc
+ /home/jenkins/tools/java/latest1.8/bin/java -version
java version "1.8.0_191"
Java(TM) SE Runtime Environment (build 1.8.0_191-b12)
Java HotSpot(TM) 64-Bit Server VM (build 25.191-b12, mixed mode)
+ echo which java
which java
+ which java
/home/jenkins/tools/java/latest1.8/bin/java
+ java -version
java version "1.8.0_191"
Java(TM) SE Runtime Environment (build 1.8.0_191-b12)
Java HotSpot(TM) 64-Bit Server VM (build 25.191-b12, mixed mode)
+ echo which javac
which javac
+ which javac
/home/jenkins/tools/java/latest1.8/bin/javac
+ javac -version
javac 1.8.0_191
+ echo Ant-Home:
Ant-Home:
+ ls -al
total 460
drwxr-xr-x  15 jenkins jenkins   4096 Oct 25 10:29 .
drwxr-xr-x 231 jenkins jenkins  16384 Oct 25 10:28 ..
-rw-r--r--   1 jenkins jenkins  11321 Oct 25 10:29 build.gradle
-rw-r--r--   1 jenkins jenkins 142300 Oct 25 10:29 build.xml
-rw-r--r--   1 jenkins jenkins   3279 Oct 25 10:29 .classpath
drwxr-xr-x   2 jenkins jenkins   4096 Oct 25 10:29 compile-lib
-rw-r--r--   1 jenkins jenkins   5987 Oct 25 10:29 doap_POI.rdf
-rw-r--r--   1 jenkins jenkins   2596 Oct 25 10:29 file-leak-detector.exclude
-rw-r--r--   1 jenkins jenkins   6229 Oct 25 10:29 forrest.properties
-rw-r--r--   1 jenkins jenkins     53 Oct 25 10:29 .gitattributes
-rw-r--r--   1 jenkins jenkins    493 Oct 25 10:29 .gitignore
drwxr-xr-x   3 jenkins jenkins   4096 Oct 25 10:29 gradle
-rwxr-xr-x   1 jenkins jenkins   5299 Oct 25 10:29 gradlew
-rw-r--r--   1 jenkins jenkins   2260 Oct 25 10:29 gradlew.bat
drwxr-xr-x   2 jenkins jenkins   4096 Oct 25 10:29 jenkins
-rw-r--r--   1 jenkins jenkins 166411 Oct 25 10:29 KEYS
drwxr-xr-x   2 jenkins jenkins   4096 Oct 25 10:29 legal
drwxr-xr-x   2 jenkins jenkins   4096 Oct 25 10:29 lib
drwxr-xr-x   2 jenkins jenkins   4096 Oct 25 10:29 maven
drwxr-xr-x   2 jenkins jenkins   4096 Oct 25 10:29 ooxml-lib
drwxr-xr-x   4 jenkins jenkins   4096 Oct 25 10:29 osgi
-rw-r--r--   1 jenkins jenkins   4813 Oct 25 10:29 patch.xml
-rw-r--r--   1 jenkins jenkins    426 Oct 25 10:29 .project
-rw-r--r--   1 jenkins jenkins   4280 Oct 25 10:29 README.rst
drwxr-xr-x   2 jenkins jenkins   4096 Oct 25 10:29 .settings
-rw-r--r--   1 jenkins jenkins    556 Oct 25 10:29 settings.gradle
drwxr-xr-x  10 jenkins jenkins   4096 Oct 25 10:29 sonar
drwxr-xr-x  15 jenkins jenkins   4096 Oct 25 10:29 src
drwxr-xr-x   4 jenkins jenkins   4096 Oct 25 10:29 .svn
drwxr-xr-x  14 jenkins jenkins   4096 Oct 25 10:29 test-data
-rw-r--r--   1 jenkins jenkins    136 Oct 25 10:29 .travis.yml
+ echo which ant
which ant
+ which ant
/usr/bin/ant
+ ant -version
Apache Ant(TM) version 1.10.5 compiled on March 28 2019
+ echo '<project default="test"><target name="test"><echo>Java ${ant.java.version}/${java.version}</echo><exec executable="javac"><arg value="-version"/></exec></target></project>'
+ ant -f build.javacheck.xml -v
Apache Ant(TM) version 1.10.5 compiled on March 28 2019
Buildfile: <https://builds.apache.org/job/POI-DSL-SonarQube/ws/build.javacheck.xml>
Detected Java version: 1.8 in: /usr/local/asfpackages/java/jdk1.8.0_191/jre
Detected OS: Linux
parsing buildfile <https://builds.apache.org/job/POI-DSL-SonarQube/ws/build.javacheck.xml> with URI = <https://builds.apache.org/job/POI-DSL-SonarQube/ws/build.javacheck.xml>
Project base dir set to: <https://builds.apache.org/job/POI-DSL-SonarQube/ws/>
Build sequence for target(s) `test' is [test]
Complete build sequence is [test, ]

test:
parsing buildfile jar:file:/usr/share/ant/lib/ant.jar!/org/apache/tools/ant/antlib.xml with URI = jar:file:/usr/share/ant/lib/ant.jar!/org/apache/tools/ant/antlib.xml from a zip file
     [echo] Java 1.8/1.8.0_191
     [exec] Current OS is Linux
     [exec] Executing 'javac' with arguments:
     [exec] '-version'
     [exec]
     [exec] The ' characters around the executable and arguments are
     [exec] not part of the command.
     [exec] javac 1.8.0_191

BUILD SUCCESSFUL
Total time: 0 seconds
+ exit 0
[POI-DSL-SonarQube] $ mvn -f sonar/pom.xml -Dmaven.repo.local=<https://builds.apache.org/job/POI-DSL-SonarQube/ws/.repository> clean
FATAL: command execution failed
java.io.IOException: error=2, No such file or directory
        at java.lang.UNIXProcess.forkAndExec(Native Method)
        at java.lang.UNIXProcess.<init>(UNIXProcess.java:247)
        at java.lang.ProcessImpl.start(ProcessImpl.java:134)
        at java.lang.ProcessBuilder.start(ProcessBuilder.java:1029)
Also:   hudson.remoting.Channel$CallSiteStackTrace: Remote call to H36
                at hudson.remoting.Channel.attachCallSiteStackTrace(Channel.java:1743)
                at hudson.remoting.UserRequest$ExceptionResponse.retrieve(UserRequest.java:357)
                at hudson.remoting.Channel.call(Channel.java:957)
                at hudson.Launcher$RemoteLauncher.launch(Launcher.java:1060)
                at hudson.Launcher$ProcStarter.start(Launcher.java:455)
                at hudson.Launcher$ProcStarter.join(Launcher.java:466)
                at hudson.tasks.Maven.perform(Maven.java:368)
                at hudson.tasks.BuildStepMonitor$1.perform(BuildStepMonitor.java:20)
                at hudson.model.AbstractBuild$AbstractBuildExecution.perform(AbstractBuild.java:741)
                at hudson.model.Build$BuildExecution.build(Build.java:206)
                at hudson.model.Build$BuildExecution.doRun(Build.java:163)
                at hudson.model.AbstractBuild$AbstractBuildExecution.run(AbstractBuild.java:504)
                at hudson.model.Run.execute(Run.java:1815)
                at hudson.model.FreeStyleBuild.run(FreeStyleBuild.java:43)
                at hudson.model.ResourceController.execute(ResourceController.java:97)
                at hudson.model.Executor.run(Executor.java:429)
Caused: java.io.IOException: Cannot run program "mvn" (in directory "<https://builds.apache.org/job/POI-DSL-SonarQube/ws/")>: error=2, No such file or directory
        at java.lang.ProcessBuilder.start(ProcessBuilder.java:1048)
        at hudson.Proc$LocalProc.<init>(Proc.java:250)
        at hudson.Proc$LocalProc.<init>(Proc.java:219)
        at hudson.Launcher$LocalLauncher.launch(Launcher.java:937)
        at hudson.Launcher$ProcStarter.start(Launcher.java:455)
        at hudson.Launcher$RemoteLaunchCallable.call(Launcher.java:1319)
        at hudson.Launcher$RemoteLaunchCallable.call(Launcher.java:1272)
        at hudson.remoting.UserRequest.perform(UserRequest.java:212)
        at hudson.remoting.UserRequest.perform(UserRequest.java:54)
        at hudson.remoting.Request$2.run(Request.java:369)
        at hudson.remoting.InterceptingExecutorService$1.call(InterceptingExecutorService.java:72)
        at java.util.concurrent.FutureTask.run(FutureTask.java:266)
        at java.util.concurrent.ThreadPoolExecutor.runWorker(ThreadPoolExecutor.java:1149)
        at java.util.concurrent.ThreadPoolExecutor$Worker.run(ThreadPoolExecutor.java:624)
        at java.lang.Thread.run(Thread.java:748)
Build step 'Invoke top-level Maven targets' marked build as failure
WARN: Unable to locate 'report-task.txt' in the workspace. Did the SonarScanner succeeded?

---------------------------------------------------------------------
To unsubscribe, e-mail: [hidden email]
For additional commands, e-mail: [hidden email]

Reply | Threaded
Open this post in threaded view
|

Build failed in Jenkins: POI-DSL-SonarQube #546

Apache Jenkins Server
See <https://builds.apache.org/job/POI-DSL-SonarQube/546/display/redirect?page=changes>

Changes:

[centic] Revert "Add script to convert PPT to PNGs"

This reverts commit 81beb58ab32078387afc546ff7d6bd287cbc799b.

[centic] Revert "Add script to run ant locally with Java 1.6/Ant 1.8.x"

This reverts commit 9843e1ab7150f5d105879cd6dc04e744dce0aa55.

[centic] Revert "Add script to run BiffViewer"

This reverts commit b1684d5c2bf83265db5878fdbeb6375ba052352e.

[centic] Add script to convert PPT to PNGs

[centic] Add script to run ant locally with Java 1.6/Ant 1.8.x

[centic] Add script to run BiffViewer
Set property to include escher-records in view.sh and add Launchconfig for BiffViewer

[centic] Jenkins-DSL: Do not expect to find mvn executable in Test-Environment

[centic] Jenkins-DSL: Add JDK 14, remove JDK 10, add testing for Maven to Test-Environment

[centic] Try to fix test which is still failing on Windows in a different way

[centic] Update to latest Gradle 5.6 to allow to build with newer Java versions
Adjust build.gradle slightly to work with new version of Gradle

[centic] Adjust comments and add slightly more test-coverage

[centic] Sync version in more places and use -SNAPSHOT everywhere during development

[centic] Adjust an error message slightly

[centic] Add one more file-type to the integration tests

[centic] XWPF: Insert newlines between multiple paragraphs in comments.

Closes PR #161 on GitHub

[centic] Fix some IDE warnings and update some JavaDoc

[kiwiwings] #63869 - Download page should use KEYS for the link text

[kiwiwings] Remove references to DatatypeConverter

[kiwiwings] #63745 - Make GenericRecordJsonWriter Json-conformant


------------------------------------------
[...truncated 4.05 KB...]
U         src/scratchpad/src/org/apache/poi/hslf/usermodel/HSLFShape.java
U         src/scratchpad/src/org/apache/poi/hemf/record/emfplus/HemfPlusDraw.java
U         src/scratchpad/src/org/apache/poi/hemf/record/emf/HemfComment.java
U         src/scratchpad/src/org/apache/poi/hemf/usermodel/HemfEmbeddedIterator.java
U         src/scratchpad/src/org/apache/poi/hwmf/record/HwmfEscape.java
U         build.gradle
U         gradle/wrapper/gradle-wrapper.jar
U         gradle/wrapper/gradle-wrapper.properties
U         gradlew
U         gradlew.bat
U         build.xml
U         osgi/build.xml
A         test-data/document/comment.docx
U         doap_POI.rdf
U         sonar/examples/pom.xml
U         sonar/excelant/pom.xml
U         sonar/main/pom.xml
U         sonar/ooxml/pom.xml
U         sonar/ooxml-schema/pom.xml
U         sonar/ooxml-schema-encryption/pom.xml
U         sonar/ooxml-schema-security/pom.xml
U         sonar/pom.xml
U         sonar/scratchpad/pom.xml

<-- Got one external: forrest.properties, svn url: https://svn.apache.org/repos/asf/poi/site/forrest.properties -->
Fetching 'https://svn.apache.org/repos/asf/poi/site/forrest.properties' at -1 into '<https://builds.apache.org/job/POI-DSL-SonarQube/ws/forrest.properties'>
At revision 1868994


<-- Got one external: documentation, svn url: https://svn.apache.org/repos/asf/poi/site/src/documentation -->
Fetching 'https://svn.apache.org/repos/asf/poi/site/src/documentation' at -1 into '<https://builds.apache.org/job/POI-DSL-SonarQube/ws/src/documentation'>
U         src/documentation/content/xdocs/download.xml
U         src/documentation/content/xdocs/index.xml
U         src/documentation/content/xdocs/apidocs/index.xml
U         src/documentation/content/xdocs/changes.xml
At revision 1868994

At revision 1868994

No changes for https://svn.apache.org/repos/asf/poi/site/forrest.properties since the previous build
Injecting SonarQube environment variables using the configuration: ASF Sonar Analysis
[POI-DSL-SonarQube] $ /bin/bash -xe /tmp/jenkins7890736586126937385.sh
+ svn status
?       .repository
?       build.javacheck.xml
    X   forrest.properties
X       src/documentation

Performing status on external item at 'src/documentation':
+ echo Java-Home: /home/jenkins/tools/java/latest1.8
Java-Home: /home/jenkins/tools/java/latest1.8
+ ls -al /home/jenkins/tools/java/latest1.8/
total 26000
drwxr-xr-x  7 root root     4096 Nov  5  2018 .
drwxr-xr-x 51 root root     4096 Sep 15 02:28 ..
drwxr-xr-x  2 root root     4096 Nov  5  2018 bin
-r--r--r--  1 root root     3244 Oct  6  2018 COPYRIGHT
drwxr-xr-x  3 root root     4096 Nov  5  2018 include
-rw-r--r--  1 root root  5207154 Sep 12  2018 javafx-src.zip
drwxr-xr-x  5 root root     4096 Nov  5  2018 jre
drwxr-xr-x  5 root root     4096 Nov  5  2018 lib
-r--r--r--  1 root root       40 Oct  6  2018 LICENSE
drwxr-xr-x  4 root root     4096 Nov  5  2018 man
-r--r--r--  1 root root      159 Oct  6  2018 README.html
-rw-r--r--  1 root root      424 Oct  6  2018 release
-rw-r--r--  1 root root 21101479 Oct  6  2018 src.zip
-rw-r--r--  1 root root   108062 Sep 12  2018 THIRDPARTYLICENSEREADME-JAVAFX.txt
-r--r--r--  1 root root   155003 Oct  6  2018 THIRDPARTYLICENSEREADME.txt
+ ls -al /home/jenkins/tools/java/latest1.8/bin
total 904
drwxr-xr-x 2 root root   4096 Nov  5  2018 .
drwxr-xr-x 7 root root   4096 Nov  5  2018 ..
-rwxr-xr-x 1 root root   8592 Oct  6  2018 appletviewer
lrwxrwxrwx 1 root root      8 Oct  6  2018 ControlPanel -> jcontrol
-rwxr-xr-x 1 root root   8584 Oct  6  2018 extcheck
-rwxr-xr-x 1 root root   8584 Oct  6  2018 idlj
-rwxr-xr-x 1 root root   8584 Oct  6  2018 jar
-rwxr-xr-x 1 root root   8584 Oct  6  2018 jarsigner
-rwxr-xr-x 1 root root   8464 Oct  6  2018 java
-rwxr-xr-x 1 root root   8584 Oct  6  2018 javac
-rwxr-xr-x 1 root root   8584 Oct  6  2018 javadoc
-rwxr-xr-x 1 root root   2293 Sep 12  2018 javafxpackager
-rwxr-xr-x 1 root root   8584 Oct  6  2018 javah
-rwxr-xr-x 1 root root   8584 Oct  6  2018 javap
-rwxr-xr-x 1 root root   2293 Sep 12  2018 javapackager
-rwxr-xr-x 1 root root   1809 Oct  6  2018 java-rmi.cgi
-rwxr-xr-x 1 root root 140248 Oct  6  2018 javaws
-rwxr-xr-x 1 root root   8584 Oct  6  2018 jcmd
-rwxr-xr-x 1 root root   8608 Oct  6  2018 jconsole
-rwxr-xr-x 1 root root   6264 Oct  6  2018 jcontrol
-rwxr-xr-x 1 root root   8600 Oct  6  2018 jdb
-rwxr-xr-x 1 root root   8584 Oct  6  2018 jdeps
-rwxr-xr-x 1 root root   8584 Oct  6  2018 jhat
-rwxr-xr-x 1 root root   8648 Oct  6  2018 jinfo
-rwxr-xr-x 1 root root   8584 Oct  6  2018 jjs
-rwxr-xr-x 1 root root   8648 Oct  6  2018 jmap
-rwxr-xr-x 1 root root  74675 Dec  8  2017 jmc
-rwxr-xr-x 1 root root    402 Dec  8  2017 jmc.ini
-rwxr-xr-x 1 root root   8584 Oct  6  2018 jps
-rwxr-xr-x 1 root root   8592 Oct  6  2018 jrunscript
-rwxr-xr-x 1 root root   8600 Oct  6  2018 jsadebugd
-rwxr-xr-x 1 root root   8648 Oct  6  2018 jstack
-rwxr-xr-x 1 root root   8584 Oct  6  2018 jstat
-rwxr-xr-x 1 root root   8584 Oct  6  2018 jstatd
-rwxr-xr-x 1 root root   5110 Jan 14  2017 jvisualvm
-rwxr-xr-x 1 root root   8584 Oct  6  2018 keytool
-rwxr-xr-x 1 root root   8592 Oct  6  2018 native2ascii
-rwxr-xr-x 1 root root   8656 Oct  6  2018 orbd
-rwxr-xr-x 1 root root   8584 Oct  6  2018 pack200
-rwxr-xr-x 1 root root   8592 Oct  6  2018 policytool
-rwxr-xr-x 1 root root   8584 Oct  6  2018 rmic
-rwxr-xr-x 1 root root   8584 Oct  6  2018 rmid
-rwxr-xr-x 1 root root   8592 Oct  6  2018 rmiregistry
-rwxr-xr-x 1 root root   8584 Oct  6  2018 schemagen
-rwxr-xr-x 1 root root   8584 Oct  6  2018 serialver
-rwxr-xr-x 1 root root   8592 Oct  6  2018 servertool
-rwxr-xr-x 1 root root   8656 Oct  6  2018 tnameserv
-rwxr-xr-x 1 root root 182536 Oct  6  2018 unpack200
-rwxr-xr-x 1 root root   8584 Oct  6  2018 wsgen
-rwxr-xr-x 1 root root   8584 Oct  6  2018 wsimport
-rwxr-xr-x 1 root root   8584 Oct  6  2018 xjc
+ /home/jenkins/tools/java/latest1.8/bin/java -version
java version "1.8.0_191"
Java(TM) SE Runtime Environment (build 1.8.0_191-b12)
Java HotSpot(TM) 64-Bit Server VM (build 25.191-b12, mixed mode)
+ echo which java
which java
+ which java
/home/jenkins/tools/java/latest1.8/bin/java
+ java -version
java version "1.8.0_191"
Java(TM) SE Runtime Environment (build 1.8.0_191-b12)
Java HotSpot(TM) 64-Bit Server VM (build 25.191-b12, mixed mode)
+ echo which javac
which javac
+ which javac
/home/jenkins/tools/java/latest1.8/bin/javac
+ javac -version
javac 1.8.0_191
+ echo Ant-Home:
Ant-Home:
+ ls -al
total 520
drwxr-xr-x  16 jenkins jenkins   4096 Oct 26 09:26 .
drwxr-xr-x 738 jenkins jenkins  65536 Oct 26 09:25 ..
-rw-r--r--   1 jenkins jenkins  11175 Oct 26 09:26 build.gradle
-rw-r--r--   1 jenkins jenkins    172 Oct 13 09:27 build.javacheck.xml
-rw-r--r--   1 jenkins jenkins 142582 Oct 26 09:26 build.xml
-rw-r--r--   1 jenkins jenkins   3279 Oct 10 09:35 .classpath
drwxr-xr-x   2 jenkins jenkins   4096 Oct 10 09:35 compile-lib
-rw-r--r--   1 jenkins jenkins   5987 Oct 26 09:26 doap_POI.rdf
-rw-r--r--   1 jenkins jenkins   2596 Oct 10 09:35 file-leak-detector.exclude
-rw-r--r--   1 jenkins jenkins   6229 Oct 10 09:35 forrest.properties
-rw-r--r--   1 jenkins jenkins     53 Oct 10 09:35 .gitattributes
-rw-r--r--   1 jenkins jenkins    493 Oct 10 09:35 .gitignore
drwxr-xr-x   3 jenkins jenkins   4096 Oct 10 09:35 gradle
-rwxr-xr-x   1 jenkins jenkins   5917 Oct 26 09:26 gradlew
-rw-r--r--   1 jenkins jenkins   2842 Oct 26 09:26 gradlew.bat
drwxr-xr-x   2 jenkins jenkins   4096 Oct 26 09:26 jenkins
-rw-r--r--   1 jenkins jenkins 166411 Oct 10 09:35 KEYS
drwxr-xr-x   2 jenkins jenkins   4096 Oct 10 09:34 legal
drwxr-xr-x   2 jenkins jenkins   4096 Oct 10 09:35 lib
drwxr-xr-x   2 jenkins jenkins   4096 Oct 10 09:35 maven
drwxr-xr-x   2 jenkins jenkins   4096 Oct 10 09:35 ooxml-lib
drwxr-xr-x   4 jenkins jenkins   4096 Oct 26 09:26 osgi
-rw-r--r--   1 jenkins jenkins   4813 Oct 10 09:35 patch.xml
-rw-r--r--   1 jenkins jenkins    426 Oct 10 09:34 .project
-rw-r--r--   1 jenkins jenkins   4280 Oct 10 09:35 README.rst
drwxr-xr-x  20 jenkins jenkins   4096 Oct 11 01:12 .repository
drwxr-xr-x   2 jenkins jenkins   4096 Oct 10 09:35 .settings
-rw-r--r--   1 jenkins jenkins    556 Oct 10 09:35 settings.gradle
drwxr-xr-x  10 jenkins jenkins   4096 Oct 26 09:26 sonar
drwxr-xr-x  15 jenkins jenkins   4096 Oct 10 09:35 src
drwxr-xr-x   4 jenkins jenkins   4096 Oct 26 09:26 .svn
drwxr-xr-x  14 jenkins jenkins   4096 Oct 10 09:35 test-data
-rw-r--r--   1 jenkins jenkins    136 Oct 10 09:34 .travis.yml
+ echo which ant
which ant
+ which ant
/usr/bin/ant
+ ant -version
Apache Ant(TM) version 1.9.6 compiled on July 20 2018
+ echo '<project default="test"><target name="test"><echo>Java ${ant.java.version}/${java.version}</echo><exec executable="javac"><arg value="-version"/></exec></target></project>'
+ ant -f build.javacheck.xml -v
Apache Ant(TM) version 1.9.6 compiled on July 20 2018
Buildfile: <https://builds.apache.org/job/POI-DSL-SonarQube/ws/build.javacheck.xml>
Detected Java version: 1.8 in: /usr/local/asfpackages/java/jdk1.8.0_191/jre
Detected OS: Linux
parsing buildfile <https://builds.apache.org/job/POI-DSL-SonarQube/ws/build.javacheck.xml> with URI = <https://builds.apache.org/job/POI-DSL-SonarQube/ws/build.javacheck.xml>
Project base dir set to: <https://builds.apache.org/job/POI-DSL-SonarQube/ws/>
Build sequence for target(s) `test' is [test]
Complete build sequence is [test, ]

test:
parsing buildfile jar:file:/usr/share/ant/lib/ant.jar!/org/apache/tools/ant/antlib.xml with URI = jar:file:/usr/share/ant/lib/ant.jar!/org/apache/tools/ant/antlib.xml from a zip file
     [echo] Java 1.8/1.8.0_191
     [exec] Current OS is Linux
     [exec] Executing 'javac' with arguments:
     [exec] '-version'
     [exec]
     [exec] The ' characters around the executable and arguments are
     [exec] not part of the command.
     [exec] javac 1.8.0_191

BUILD SUCCESSFUL
Total time: 0 seconds
+ exit 0
[POI-DSL-SonarQube] $ mvn -f sonar/pom.xml -Dmaven.repo.local=<https://builds.apache.org/job/POI-DSL-SonarQube/ws/.repository> clean
FATAL: command execution failed
java.io.IOException: error=2, No such file or directory
        at java.lang.UNIXProcess.forkAndExec(Native Method)
        at java.lang.UNIXProcess.<init>(UNIXProcess.java:247)
        at java.lang.ProcessImpl.start(ProcessImpl.java:134)
        at java.lang.ProcessBuilder.start(ProcessBuilder.java:1029)
Also:   hudson.remoting.Channel$CallSiteStackTrace: Remote call to H38
                at hudson.remoting.Channel.attachCallSiteStackTrace(Channel.java:1743)
                at hudson.remoting.UserRequest$ExceptionResponse.retrieve(UserRequest.java:357)
                at hudson.remoting.Channel.call(Channel.java:957)
                at hudson.Launcher$RemoteLauncher.launch(Launcher.java:1060)
                at hudson.Launcher$ProcStarter.start(Launcher.java:455)
                at hudson.Launcher$ProcStarter.join(Launcher.java:466)
                at hudson.tasks.Maven.perform(Maven.java:368)
                at hudson.tasks.BuildStepMonitor$1.perform(BuildStepMonitor.java:20)
                at hudson.model.AbstractBuild$AbstractBuildExecution.perform(AbstractBuild.java:741)
                at hudson.model.Build$BuildExecution.build(Build.java:206)
                at hudson.model.Build$BuildExecution.doRun(Build.java:163)
                at hudson.model.AbstractBuild$AbstractBuildExecution.run(AbstractBuild.java:504)
                at hudson.model.Run.execute(Run.java:1815)
                at hudson.model.FreeStyleBuild.run(FreeStyleBuild.java:43)
                at hudson.model.ResourceController.execute(ResourceController.java:97)
                at hudson.model.Executor.run(Executor.java:429)
Caused: java.io.IOException: Cannot run program "mvn" (in directory "<https://builds.apache.org/job/POI-DSL-SonarQube/ws/")>: error=2, No such file or directory
        at java.lang.ProcessBuilder.start(ProcessBuilder.java:1048)
        at hudson.Proc$LocalProc.<init>(Proc.java:250)
        at hudson.Proc$LocalProc.<init>(Proc.java:219)
        at hudson.Launcher$LocalLauncher.launch(Launcher.java:937)
        at hudson.Launcher$ProcStarter.start(Launcher.java:455)
        at hudson.Launcher$RemoteLaunchCallable.call(Launcher.java:1319)
        at hudson.Launcher$RemoteLaunchCallable.call(Launcher.java:1272)
        at hudson.remoting.UserRequest.perform(UserRequest.java:212)
        at hudson.remoting.UserRequest.perform(UserRequest.java:54)
        at hudson.remoting.Request$2.run(Request.java:369)
        at hudson.remoting.InterceptingExecutorService$1.call(InterceptingExecutorService.java:72)
        at java.util.concurrent.FutureTask.run(FutureTask.java:266)
        at java.util.concurrent.ThreadPoolExecutor.runWorker(ThreadPoolExecutor.java:1142)
        at java.util.concurrent.ThreadPoolExecutor$Worker.run(ThreadPoolExecutor.java:617)
        at java.lang.Thread.run(Thread.java:748)
Build step 'Invoke top-level Maven targets' marked build as failure
WARN: Unable to locate 'report-task.txt' in the workspace. Did the SonarScanner succeeded?

---------------------------------------------------------------------
To unsubscribe, e-mail: [hidden email]
For additional commands, e-mail: [hidden email]

Reply | Threaded
Open this post in threaded view
|

Jenkins build is back to normal : POI-DSL-SonarQube #547

Apache Jenkins Server
See <https://builds.apache.org/job/POI-DSL-SonarQube/547/display/redirect?page=changes>


---------------------------------------------------------------------
To unsubscribe, e-mail: [hidden email]
For additional commands, e-mail: [hidden email]