Build failed in Jenkins: POI-DSL-OpenJDK #95

classic Classic list List threaded Threaded
2 messages Options
Reply | Threaded
Open this post in threaded view
|

Build failed in Jenkins: POI-DSL-OpenJDK #95

Apache Jenkins Server
See <https://builds.apache.org/job/POI-DSL-OpenJDK/95/display/redirect?page=changes>

Changes:

[sayi] add removeTable method in cell


------------------------------------------
[...truncated 114.50 KB...]
    [junit] Running org.apache.poi.hslf.usermodel.TestTable
    [junit] Tests run: 3, Failures: 0, Errors: 0, Skipped: 0, Time elapsed: 0.035 sec
    [junit] Running org.apache.poi.hslf.usermodel.TestTextRun
    [junit] Tests run: 14, Failures: 0, Errors: 0, Skipped: 0, Time elapsed: 0.059 sec
    [junit] Running org.apache.poi.hslf.usermodel.TestTextShape
    [junit] Tests run: 6, Failures: 0, Errors: 0, Skipped: 0, Time elapsed: 0.019 sec
    [junit] Running org.apache.poi.hslf.util.TestSystemTimeUtils
    [junit] Tests run: 4, Failures: 0, Errors: 0, Skipped: 0, Time elapsed: 0.004 sec
    [junit] Running org.apache.poi.hsmf.Test7BitCodepage
    [junit] Tests run: 1, Failures: 0, Errors: 0, Skipped: 0, Time elapsed: 0.068 sec
    [junit] Running org.apache.poi.hsmf.TestBasics
    [junit] Tests run: 9, Failures: 0, Errors: 0, Skipped: 0, Time elapsed: 0.256 sec
    [junit] Running org.apache.poi.hsmf.TestBlankFileRead
    [junit] Tests run: 7, Failures: 0, Errors: 0, Skipped: 0, Time elapsed: 0.007 sec
    [junit] Running org.apache.poi.hsmf.TestExtractEmbeddedMSG
    [junit] Tests run: 1, Failures: 0, Errors: 0, Skipped: 0, Time elapsed: 0.013 sec
    [junit] Running org.apache.poi.hsmf.TestFileWithAttachmentsRead
    [junit] Tests run: 4, Failures: 0, Errors: 0, Skipped: 0, Time elapsed: 0.009 sec
    [junit] Running org.apache.poi.hsmf.TestFixedSizedProperties
    [junit] Tests run: 8, Failures: 0, Errors: 0, Skipped: 0, Time elapsed: 0.071 sec
    [junit] Running org.apache.poi.hsmf.TestMessageSubmissionChunk
    [junit] Tests run: 2, Failures: 0, Errors: 0, Skipped: 0, Time elapsed: 0.009 sec
    [junit] Running org.apache.poi.hsmf.TestMessageSubmissionChunkY2KRead
    [junit] Tests run: 3, Failures: 0, Errors: 0, Skipped: 0, Time elapsed: 0.017 sec
    [junit] Running org.apache.poi.hsmf.TestNameIdChunks
    [junit] Tests run: 2, Failures: 0, Errors: 0, Skipped: 0, Time elapsed: 0.017 sec
    [junit] Running org.apache.poi.hsmf.TestOutlook30FileRead
    [junit] Tests run: 9, Failures: 0, Errors: 0, Skipped: 0, Time elapsed: 0.072 sec
    [junit] Running org.apache.poi.hsmf.TestSimpleFileRead
    [junit] Tests run: 9, Failures: 0, Errors: 0, Skipped: 0, Time elapsed: 0.026 sec
    [junit] Running org.apache.poi.hsmf.datatypes.TestChunkData
    [junit] Tests run: 6, Failures: 0, Errors: 0, Skipped: 0, Time elapsed: 0.006 sec
    [junit] Running org.apache.poi.hsmf.datatypes.TestMAPIProperty
    [junit] Tests run: 3, Failures: 0, Errors: 0, Skipped: 0, Time elapsed: 0.003 sec
    [junit] Running org.apache.poi.hsmf.datatypes.TestSorters
    [junit] Tests run: 2, Failures: 0, Errors: 0, Skipped: 0, Time elapsed: 0.001 sec
    [junit] Running org.apache.poi.hsmf.datatypes.TestTypes
    [junit] Tests run: 3, Failures: 0, Errors: 0, Skipped: 0, Time elapsed: 0.001 sec
    [junit] Running org.apache.poi.hsmf.extractor.TestOutlookTextExtractor
    [junit] Tests run: 9, Failures: 0, Errors: 0, Skipped: 0, Time elapsed: 0.114 sec
    [junit] Running org.apache.poi.hsmf.parsers.TestPOIFSChunkParser
    [junit] Tests run: 6, Failures: 0, Errors: 0, Skipped: 0, Time elapsed: 0.058 sec
    [junit] Running org.apache.poi.hssf.converter.TestExcelConverterSuite
    [junit] Tests run: 778, Failures: 0, Errors: 0, Skipped: 0, Time elapsed: 15.598 sec
    [junit] Running org.apache.poi.hwmf.TestHwmfParsing
    [junit] Tests run: 5, Failures: 0, Errors: 0, Skipped: 1, Time elapsed: 0.016 sec
    [junit] Running org.apache.poi.hwpf.TestFieldsTables
    [junit] Tests run: 1, Failures: 0, Errors: 0, Skipped: 0, Time elapsed: 0.004 sec
    [junit] Running org.apache.poi.hwpf.TestHWPFPictures
    [junit] Tests run: 6, Failures: 0, Errors: 0, Skipped: 0, Time elapsed: 0.087 sec
    [junit] Running org.apache.poi.hwpf.TestHWPFRangeParts
    [junit] Tests run: 2, Failures: 0, Errors: 0, Skipped: 0, Time elapsed: 0.012 sec
    [junit] Running org.apache.poi.hwpf.converter.TestNumberFormatter
    [junit] Tests run: 2, Failures: 0, Errors: 0, Skipped: 0, Time elapsed: 0.083 sec
    [junit] Running org.apache.poi.hwpf.converter.TestWordToConverterSuite
    [junit] Tests run: 411, Failures: 0, Errors: 0, Skipped: 0, Time elapsed: 5.208 sec
    [junit] Running org.apache.poi.hwpf.converter.TestWordToFoConverter
    [junit] Tests run: 8, Failures: 0, Errors: 0, Skipped: 0, Time elapsed: 0.048 sec
    [junit] Running org.apache.poi.hwpf.converter.TestWordToHtmlConverter
    [junit] Tests run: 21, Failures: 0, Errors: 0, Skipped: 0, Time elapsed: 0.161 sec
    [junit] Running org.apache.poi.hwpf.converter.TestWordToTextConverter
    [junit] Tests run: 3, Failures: 0, Errors: 0, Skipped: 0, Time elapsed: 0.047 sec
    [junit] Running org.apache.poi.hwpf.dev.TestHWPFLister
    [junit] Tests run: 2, Failures: 0, Errors: 0, Skipped: 0, Time elapsed: 0.027 sec
    [junit] Running org.apache.poi.hwpf.extractor.TestDifferentRoutes
    [junit] Tests run: 2, Failures: 0, Errors: 0, Skipped: 0, Time elapsed: 0.002 sec
    [junit] Running org.apache.poi.hwpf.extractor.TestWordExtractor
    [junit] Tests run: 18, Failures: 0, Errors: 0, Skipped: 0, Time elapsed: 0.043 sec
    [junit] Running org.apache.poi.hwpf.extractor.TestWordExtractorBugs
    [junit] Tests run: 3, Failures: 0, Errors: 0, Skipped: 0, Time elapsed: 0.148 sec
    [junit] Running org.apache.poi.hwpf.model.TestBookmarksTables
    [junit] Tests run: 5, Failures: 0, Errors: 0, Skipped: 0, Time elapsed: 0.005 sec
    [junit] Running org.apache.poi.hwpf.model.TestCHPBinTable
    [junit] Tests run: 1, Failures: 0, Errors: 0, Skipped: 0, Time elapsed: 0.002 sec
    [junit] Running org.apache.poi.hwpf.model.TestDocumentProperties
    [junit] Tests run: 1, Failures: 0, Errors: 0, Skipped: 0, Time elapsed: 0.008 sec
    [junit] Running org.apache.poi.hwpf.model.TestFileInformationBlock
    [junit] Tests run: 1, Failures: 0, Errors: 0, Skipped: 0, Time elapsed: 0.01 sec
    [junit] Running org.apache.poi.hwpf.model.TestFontTable
    [junit] Tests run: 1, Failures: 0, Errors: 0, Skipped: 0, Time elapsed: 0.002 sec
    [junit] Running org.apache.poi.hwpf.model.TestListTables
    [junit] Tests run: 1, Failures: 0, Errors: 0, Skipped: 0, Time elapsed: 0.001 sec
    [junit] Running org.apache.poi.hwpf.model.TestNotesTables
    [junit] Tests run: 1, Failures: 0, Errors: 0, Skipped: 0, Time elapsed: 0.003 sec
    [junit] Running org.apache.poi.hwpf.model.TestPAPBinTable
    [junit] Tests run: 2, Failures: 0, Errors: 0, Skipped: 0, Time elapsed: 0.01 sec
    [junit] Running org.apache.poi.hwpf.model.TestPlexOfCps
    [junit] Tests run: 1, Failures: 0, Errors: 0, Skipped: 0, Time elapsed: 0.002 sec
    [junit] Running org.apache.poi.hwpf.model.TestRevisionMarkAuthorTable
    [junit] Tests run: 3, Failures: 0, Errors: 0, Skipped: 0, Time elapsed: 0.004 sec
    [junit] Running org.apache.poi.hwpf.model.TestSavedByTable
    [junit] Tests run: 1, Failures: 0, Errors: 0, Skipped: 0, Time elapsed: 0.014 sec
    [junit] Running org.apache.poi.hwpf.model.TestSectionTable
    [junit] Tests run: 1, Failures: 0, Errors: 0, Skipped: 0, Time elapsed: 0.002 sec
    [junit] Running org.apache.poi.hwpf.model.TestStyleSheet
    [junit] Tests run: 2, Failures: 0, Errors: 0, Skipped: 0, Time elapsed: 0.002 sec
    [junit] Running org.apache.poi.hwpf.model.TestTextPieceTable
    [junit] Tests run: 4, Failures: 0, Errors: 0, Skipped: 0, Time elapsed: 0.009 sec
    [junit] Running org.apache.poi.hwpf.sprm.TestSprms
    [junit] Tests run: 2, Failures: 0, Errors: 0, Skipped: 0, Time elapsed: 0.006 sec
    [junit] Running org.apache.poi.hwpf.usermodel.TestBorderCode
    [junit] Tests run: 1, Failures: 0, Errors: 0, Skipped: 0, Time elapsed: 0.002 sec
    [junit] Running org.apache.poi.hwpf.usermodel.TestBug46610
    [junit] Tests run: 3, Failures: 0, Errors: 0, Skipped: 0, Time elapsed: 0.008 sec
    [junit] Running org.apache.poi.hwpf.usermodel.TestBug47563
    [junit] Tests run: 8, Failures: 0, Errors: 0, Skipped: 0, Time elapsed: 0.03 sec
    [junit] Running org.apache.poi.hwpf.usermodel.TestBug49820
    [junit] Tests run: 1, Failures: 0, Errors: 0, Skipped: 0, Time elapsed: 0.002 sec
    [junit] Running org.apache.poi.hwpf.usermodel.TestBug50075
    [junit] Tests run: 1, Failures: 0, Errors: 0, Skipped: 0, Time elapsed: 0.002 sec
    [junit] Running org.apache.poi.hwpf.usermodel.TestBugs
    [junit] Tests run: 41, Failures: 0, Errors: 0, Skipped: 0, Time elapsed: 0.593 sec
    [junit] Running org.apache.poi.hwpf.usermodel.TestHWPFOldDocument
    [junit] Tests run: 14, Failures: 0, Errors: 0, Skipped: 0, Time elapsed: 0.064 sec
    [junit] Running org.apache.poi.hwpf.usermodel.TestHWPFWrite
    [junit] Tests run: 5, Failures: 0, Errors: 0, Skipped: 0, Time elapsed: 0.015 sec
    [junit] Running org.apache.poi.hwpf.usermodel.TestHeaderStories
    [junit] Tests run: 8, Failures: 0, Errors: 0, Skipped: 0, Time elapsed: 0.032 sec
    [junit] Running org.apache.poi.hwpf.usermodel.TestLists
    [junit] Tests run: 7, Failures: 0, Errors: 0, Skipped: 0, Time elapsed: 0.009 sec
    [junit] Running org.apache.poi.hwpf.usermodel.TestOfficeDrawings
    [junit] Tests run: 1, Failures: 0, Errors: 0, Skipped: 0, Time elapsed: 0.002 sec
    [junit] Running org.apache.poi.hwpf.usermodel.TestPictures
    [junit] Tests run: 16, Failures: 0, Errors: 0, Skipped: 2, Time elapsed: 0.068 sec
    [junit] Running org.apache.poi.hwpf.usermodel.TestProblems
    [junit] Tests run: 10, Failures: 0, Errors: 0, Skipped: 0, Time elapsed: 0.031 sec
    [junit] Running org.apache.poi.hwpf.usermodel.TestRange
    [junit] Tests run: 2, Failures: 0, Errors: 0, Skipped: 0, Time elapsed: 0.004 sec
    [junit] Running org.apache.poi.hwpf.usermodel.TestRangeDelete
    [junit] Tests run: 4, Failures: 0, Errors: 0, Skipped: 0, Time elapsed: 0.005 sec
    [junit] Running org.apache.poi.hwpf.usermodel.TestRangeInsertion
    [junit] Tests run: 3, Failures: 0, Errors: 0, Skipped: 0, Time elapsed: 0.004 sec
    [junit] Running org.apache.poi.hwpf.usermodel.TestRangeProperties
    [junit] Tests run: 5, Failures: 0, Errors: 0, Skipped: 0, Time elapsed: 0.026 sec
    [junit] Running org.apache.poi.hwpf.usermodel.TestRangeReplacement
    [junit] Tests run: 3, Failures: 0, Errors: 0, Skipped: 0, Time elapsed: 0.003 sec
    [junit] Running org.apache.poi.hwpf.usermodel.TestRangeSymbols
    [junit] Tests run: 2, Failures: 0, Errors: 0, Skipped: 0, Time elapsed: 0.002 sec
    [junit] Running org.apache.poi.hwpf.usermodel.TestTableRow
    [junit] Tests run: 2, Failures: 0, Errors: 0, Skipped: 0, Time elapsed: 0.002 sec

-test-scratchpad-write-testfile:

-test-ooxml-check:

test-ooxml:
[jacoco:coverage] Enhancing junit with coverage
    [junit] Running org.apache.poi.extractor.ooxml.TestExtractorFactory
    [junit] Tests run: 14, Failures: 0, Errors: 0, Skipped: 0, Time elapsed: 4.855 sec
    [junit] Running org.apache.poi.ooxml.TestDetectAsOOXML
    [junit] Tests run: 3, Failures: 0, Errors: 0, Skipped: 0, Time elapsed: 0.015 sec
    [junit] Running org.apache.poi.ooxml.TestEmbedded
    [junit] Tests run: 3, Failures: 0, Errors: 0, Skipped: 0, Time elapsed: 0.532 sec
    [junit] Running org.apache.poi.ooxml.TestPOIXMLDocument
    [junit] Tests run: 11, Failures: 0, Errors: 0, Skipped: 0, Time elapsed: 2.639 sec
    [junit] Running org.apache.poi.ooxml.TestPOIXMLProperties
    [junit] Tests run: 10, Failures: 0, Errors: 0, Skipped: 1, Time elapsed: 0.34 sec
    [junit] Running org.apache.poi.ooxml.TestXMLPropertiesTextExtractor
    [junit] Tests run: 5, Failures: 0, Errors: 0, Skipped: 0, Time elapsed: 0.124 sec
    [junit] Running org.apache.poi.openxml4j.opc.TestContentType
    [junit] Tests run: 7, Failures: 0, Errors: 0, Skipped: 0, Time elapsed: 0.019 sec
    [junit] Running org.apache.poi.openxml4j.opc.TestFileHelper
    [junit] Tests run: 1, Failures: 0, Errors: 0, Skipped: 0, Time elapsed: 0.002 sec
    [junit] Running org.apache.poi.openxml4j.opc.TestListParts
    [junit] Tests run: 1, Failures: 0, Errors: 0, Skipped: 0, Time elapsed: 0.005 sec
    [junit] Running org.apache.poi.openxml4j.opc.TestPackage
    [junit] Tests run: 46, Failures: 0, Errors: 0, Skipped: 1, Time elapsed: 1.665 sec
    [junit] Running org.apache.poi.openxml4j.opc.TestPackageCoreProperties
    [junit] Tests run: 7, Failures: 0, Errors: 0, Skipped: 0, Time elapsed: 0.089 sec
    [junit] Running org.apache.poi.openxml4j.opc.TestPackagePartName
    [junit] Tests run: 1, Failures: 0, Errors: 0, Skipped: 0, Time elapsed: 0.002 sec
    [junit] Running org.apache.poi.openxml4j.opc.TestPackageThumbnail
    [junit] Tests run: 1, Failures: 0, Errors: 0, Skipped: 0, Time elapsed: 0.017 sec
    [junit] Running org.apache.poi.openxml4j.opc.TestPackagingURIHelper
    [junit] Tests run: 5, Failures: 0, Errors: 0, Skipped: 0, Time elapsed: 0.004 sec
    [junit] Running org.apache.poi.openxml4j.opc.TestRelationships
    [junit] Tests run: 9, Failures: 0, Errors: 0, Skipped: 0, Time elapsed: 0.079 sec
    [junit] Running org.apache.poi.openxml4j.opc.compliance.TestOPCComplianceCoreProperties
    [junit] Tests run: 11, Failures: 0, Errors: 0, Skipped: 0, Time elapsed: 0.068 sec
    [junit] Running org.apache.poi.openxml4j.opc.compliance.TestOPCCompliancePackageModel
    [junit] Tests run: 5, Failures: 0, Errors: 0, Skipped: 0, Time elapsed: 0.006 sec
    [junit] Running org.apache.poi.openxml4j.opc.compliance.TestOPCCompliancePartName
    [junit] Tests run: 10, Failures: 0, Errors: 0, Skipped: 0, Time elapsed: 0.007 sec
    [junit] Running org.apache.poi.openxml4j.opc.internal.TestContentTypeManager
    [junit] Tests run: 5, Failures: 0, Errors: 0, Skipped: 1, Time elapsed: 0.225 sec
    [junit] Running org.apache.poi.openxml4j.opc.internal.marshallers.TestZipPackagePropertiesMarshaller
    [junit] Tests run: 4, Failures: 0, Errors: 0, Skipped: 0, Time elapsed: 0.006 sec
    [junit] Running org.apache.poi.openxml4j.util.TestZipSecureFile
    [junit] Tests run: 1, Failures: 0, Errors: 0, Skipped: 0, Time elapsed: 0.004 sec
    [junit] Running org.apache.poi.poifs.crypt.dsig.TestSignatureConfig
    [junit] Tests run: 2, Failures: 0, Errors: 0, Skipped: 1, Time elapsed: 0.008 sec
    [junit] Running org.apache.poi.poifs.crypt.dsig.TestSignatureInfo
    [junit] Tests run: 14, Failures: 0, Errors: 0, Skipped: 1, Time elapsed: 7.015 sec
    [junit] Running org.apache.poi.poifs.crypt.tests.TestAgileEncryptionParameters
    [junit] Tests run: 60, Failures: 0, Errors: 0, Skipped: 0, Time elapsed: 11.305 sec
    [junit] Running org.apache.poi.poifs.crypt.tests.TestDecryptor
    [junit] Tests run: 7, Failures: 0, Errors: 0, Skipped: 0, Time elapsed: 0.373 sec
    [junit] Running org.apache.poi.poifs.crypt.tests.TestEncryptionInfo
    [junit] Tests run: 2, Failures: 0, Errors: 0, Skipped: 0, Time elapsed: 0.003 sec
    [junit] Running org.apache.poi.poifs.crypt.tests.TestEncryptor
    [junit] Exception in thread "main" Unable to write output java.io.IOException: No space left on device
    [junit] at org.apache.tools.ant.taskdefs.optional.junit.PlainJUnitResultFormatter.write(PlainJUnitResultFormatter.java:310)
    [junit] at org.apache.tools.ant.taskdefs.optional.junit.PlainJUnitResultFormatter.endTestSuite(PlainJUnitResultFormatter.java:143)
    [junit] at org.apache.tools.ant.taskdefs.optional.junit.JUnitTestRunner.fireEndTestSuite(JUnitTestRunner.java:853)
    [junit] at org.apache.tools.ant.taskdefs.optional.junit.JUnitTestRunner.run(JUnitTestRunner.java:577)
    [junit] at org.apache.tools.ant.taskdefs.optional.junit.JUnitTestRunner.launch(JUnitTestRunner.java:1196)
    [junit] at org.apache.tools.ant.taskdefs.optional.junit.JUnitTestRunner.main(JUnitTestRunner.java:1014)
    [junit] Caused by: java.io.IOException: No space left on device
    [junit] at sun.nio.ch.FileDispatcherImpl.write0(Native Method)
    [junit] at sun.nio.ch.FileDispatcherImpl.write(FileDispatcherImpl.java:60)
    [junit] at sun.nio.ch.IOUtil.writeFromNativeBuffer(IOUtil.java:93)
    [junit] at sun.nio.ch.IOUtil.write(IOUtil.java:65)
    [junit] at sun.nio.ch.FileChannelImpl.write(FileChannelImpl.java:211)
    [junit] at java.nio.channels.Channels.writeFullyImpl(Channels.java:78)
    [junit] at java.nio.channels.Channels.writeFully(Channels.java:101)
    [junit] at java.nio.channels.Channels.access$000(Channels.java:61)
    [junit] at java.nio.channels.Channels$1.write(Channels.java:174)
    [junit] at java.io.BufferedOutputStream.flushBuffer(BufferedOutputStream.java:82)
    [junit] at java.io.BufferedOutputStream.write(BufferedOutputStream.java:95)
    [junit] at org.apache.tools.ant.taskdefs.optional.junit.FormatterElement$DelayedFileOutputStream.write(FormatterElement.java:382)
    [junit] at java.io.OutputStream.write(OutputStream.java:116)
    [junit] at java.io.OutputStream.write(OutputStream.java:75)
    [junit] at org.apache.tools.ant.taskdefs.optional.junit.PlainJUnitResultFormatter.write(PlainJUnitResultFormatter.java:307)
    [junit] ... 5 more
    [junit] java.io.IOException: No space left on device
    [junit] at java.io.FileOutputStream.write(Native Method)
    [junit] at java.io.FileOutputStream.write(FileOutputStream.java:290)
    [junit] at java.io.DataOutputStream.writeByte(DataOutputStream.java:153)
    [junit] at org.jacoco.agent.rt.internal_43f5073.core.data.ExecutionDataWriter.writeHeader(ExecutionDataWriter.java:74)
    [junit] at org.jacoco.agent.rt.internal_43f5073.core.data.ExecutionDataWriter.<init>(ExecutionDataWriter.java:64)
    [junit] at org.jacoco.agent.rt.internal_43f5073.output.FileOutput.writeExecutionData(FileOutput.java:56)
    [junit] at org.jacoco.agent.rt.internal_43f5073.Agent.shutdown(Agent.java:145)
    [junit] at org.jacoco.agent.rt.internal_43f5073.Agent$1.run(Agent.java:58)
    [junit] Tests run: 8, Failures: 0, Errors: 7, Skipped: 1, Time elapsed: 6.898 sec
    [junit] Running org.apache.poi.xwpf.usermodel.Batch-With-Multiple-Tests
    [junit] Tests run: 1, Failures: 0, Errors: 1, Skipped: 0, Time elapsed: 0 sec

BUILD FAILED
<https://builds.apache.org/job/POI-DSL-OpenJDK/ws/build.xml>:1529: The following error occurred while executing this line:
<https://builds.apache.org/job/POI-DSL-OpenJDK/ws/build.xml>:1497: The following error occurred while executing this line:
<https://builds.apache.org/job/POI-DSL-OpenJDK/ws/build.xml>:1125: Tests failed (crashed)

Total time: 8 minutes 15 seconds
Build step 'Invoke Ant' marked build as failure
Skipping publisher since build result is FAILURE
Archiving artifacts
[Fast Archiver] Compressed 3.04 MB of artifacts by 98.7% relative to #94
Skipping publisher since build result is FAILURE
Recording test results

---------------------------------------------------------------------
To unsubscribe, e-mail: [hidden email]
For additional commands, e-mail: [hidden email]

Reply | Threaded
Open this post in threaded view
|

Jenkins build is back to normal : POI-DSL-OpenJDK #96

Apache Jenkins Server
See <https://builds.apache.org/job/POI-DSL-OpenJDK/96/display/redirect?page=changes>


---------------------------------------------------------------------
To unsubscribe, e-mail: [hidden email]
For additional commands, e-mail: [hidden email]