Build failed in Jenkins: POI-DSL-OpenJDK #82

classic Classic list List threaded Threaded
6 messages Options
Reply | Threaded
Open this post in threaded view
|

Build failed in Jenkins: POI-DSL-OpenJDK #82

Apache Jenkins Server
See <https://builds.apache.org/job/POI-DSL-OpenJDK/82/display/redirect?page=changes>

Changes:

[fanningpj] remove more deprecated code

[fanningpj] remove more deprecated code

[fanningpj] [bug-64605] update javadocs

[fanningpj] [bug-64605] update javadocs

[fanningpj] [bug-64605] add support for non-integer font sizes on character runs (use double instead of float)


------------------------------------------
[...truncated 659.30 KB...]
    [junit] Tests run: 29, Failures: 0, Errors: 0, Skipped: 1, Time elapsed: 0.676 sec
    [junit] Running org.apache.poi.xssf.streaming.TestSXSSFHyperlink
    [junit] Tests run: 2, Failures: 0, Errors: 0, Skipped: 0, Time elapsed: 0.015 sec
    [junit] Running org.apache.poi.xssf.streaming.TestSXSSFRow
    [junit] Tests run: 14, Failures: 0, Errors: 0, Skipped: 2, Time elapsed: 0.151 sec
    [junit] Running org.apache.poi.xssf.streaming.TestSXSSFSheet
    [junit] Tests run: 50, Failures: 0, Errors: 0, Skipped: 0, Time elapsed: 0.605 sec
    [junit] Running org.apache.poi.xssf.streaming.TestSXSSFSheetAutoSizeColumn
    [junit] Tests run: 26, Failures: 0, Errors: 0, Skipped: 0, Time elapsed: 0.121 sec
    [junit] Running org.apache.poi.xssf.streaming.TestSXSSFUnicodeSurrogates
    [junit] Tests run: 1, Failures: 0, Errors: 0, Skipped: 0, Time elapsed: 0.017 sec
    [junit] Running org.apache.poi.xssf.streaming.TestSXSSFWorkbook
    [junit] Tests run: 37, Failures: 0, Errors: 0, Skipped: 4, Time elapsed: 0.712 sec
    [junit] Running org.apache.poi.xssf.streaming.TestSXSSFWorkbookWithCustomZipEntrySource
    [junit] Tests run: 3, Failures: 0, Errors: 0, Skipped: 0, Time elapsed: 0.045 sec
    [junit] Running org.apache.poi.xssf.streaming.TestSheetDataWriter
    [junit] Tests run: 3, Failures: 0, Errors: 0, Skipped: 0, Time elapsed: 0.002 sec
    [junit] Running org.apache.poi.xssf.usermodel.TestFormulaEvaluatorOnXSSF
    [junit] Tests run: 369, Failures: 0, Errors: 0, Skipped: 90, Time elapsed: 0.299 sec
    [junit] Running org.apache.poi.xssf.usermodel.TestMatrixFormulasFromXMLSpreadsheet
    [junit] Tests run: 34, Failures: 0, Errors: 0, Skipped: 0, Time elapsed: 0.147 sec
    [junit] Running org.apache.poi.xssf.usermodel.TestMissingWorkbookOnXSSF
    [junit] Tests run: 3, Failures: 0, Errors: 0, Skipped: 0, Time elapsed: 0.032 sec
    [junit] Running org.apache.poi.xssf.usermodel.TestMultiSheetFormulaEvaluatorOnXSSF
    [junit] Tests run: 2, Failures: 0, Errors: 0, Skipped: 0, Time elapsed: 0.003 sec
    [junit] Running org.apache.poi.xssf.usermodel.TestSXSSFBugs
    [junit] Tests run: 43, Failures: 0, Errors: 0, Skipped: 9, Time elapsed: 4.854 sec
    [junit] Running org.apache.poi.xssf.usermodel.TestSheetHiding
    [junit] Tests run: 5, Failures: 0, Errors: 0, Skipped: 0, Time elapsed: 0.096 sec
    [junit] Running org.apache.poi.xssf.usermodel.TestTableStyles
    [junit] Tests run: 2, Failures: 0, Errors: 0, Skipped: 0, Time elapsed: 0.447 sec
    [junit] Running org.apache.poi.xssf.usermodel.TestXSSFBugs
    [junit] Tests run: 155, Failures: 0, Errors: 0, Skipped: 8, Time elapsed: 12.659 sec
    [junit] Running org.apache.poi.xssf.usermodel.TestXSSFCell
    [junit] Tests run: 76, Failures: 0, Errors: 0, Skipped: 0, Time elapsed: 0.892 sec
    [junit] Running org.apache.poi.xssf.usermodel.TestXSSFCellStyle
    [junit] Tests run: 43, Failures: 0, Errors: 0, Skipped: 0, Time elapsed: 0.184 sec
    [junit] Running org.apache.poi.xssf.usermodel.TestXSSFChart
    [junit] Tests run: 3, Failures: 0, Errors: 0, Skipped: 0, Time elapsed: 0.075 sec
    [junit] Running org.apache.poi.xssf.usermodel.TestXSSFChartSheet
    [junit] Tests run: 3, Failures: 0, Errors: 0, Skipped: 0, Time elapsed: 0.027 sec
    [junit] Running org.apache.poi.xssf.usermodel.TestXSSFColGrouping
    [junit] Tests run: 6, Failures: 0, Errors: 0, Skipped: 0, Time elapsed: 0.049 sec
    [junit] Running org.apache.poi.xssf.usermodel.TestXSSFColor
    [junit] Tests run: 4, Failures: 0, Errors: 0, Skipped: 0, Time elapsed: 0.054 sec
    [junit] Running org.apache.poi.xssf.usermodel.TestXSSFComment
    [junit] Tests run: 19, Failures: 0, Errors: 0, Skipped: 1, Time elapsed: 0.247 sec
    [junit] Running org.apache.poi.xssf.usermodel.TestXSSFConditionalFormatting
    [junit] Tests run: 23, Failures: 0, Errors: 0, Skipped: 0, Time elapsed: 0.147 sec
    [junit] Running org.apache.poi.xssf.usermodel.TestXSSFDataFormat
    [junit] Tests run: 8, Failures: 0, Errors: 0, Skipped: 0, Time elapsed: 0.054 sec
    [junit] Running org.apache.poi.xssf.usermodel.TestXSSFDataValidation
    [junit] Tests run: 9, Failures: 0, Errors: 0, Skipped: 0, Time elapsed: 0.346 sec
    [junit] Running org.apache.poi.xssf.usermodel.TestXSSFDataValidationConstraint
    [junit] Tests run: 4, Failures: 0, Errors: 0, Skipped: 0, Time elapsed: 0.002 sec
    [junit] Running org.apache.poi.xssf.usermodel.TestXSSFDialogSheet
    [junit] Tests run: 14, Failures: 0, Errors: 0, Skipped: 0, Time elapsed: 0.047 sec
    [junit] Running org.apache.poi.xssf.usermodel.TestXSSFDrawing
    [junit] Tests run: 21, Failures: 0, Errors: 0, Skipped: 0, Time elapsed: 0.553 sec
    [junit] Running org.apache.poi.xssf.usermodel.TestXSSFEvaluationSheet
    [junit] Tests run: 2, Failures: 0, Errors: 0, Skipped: 0, Time elapsed: 0.004 sec
    [junit] Running org.apache.poi.xssf.usermodel.TestXSSFEvenFooter
    [junit] Tests run: 1, Failures: 0, Errors: 0, Skipped: 0, Time elapsed: 0.003 sec
    [junit] Running org.apache.poi.xssf.usermodel.TestXSSFEvenHeader
    [junit] Tests run: 1, Failures: 0, Errors: 0, Skipped: 0, Time elapsed: 0.003 sec
    [junit] Running org.apache.poi.xssf.usermodel.TestXSSFExternalFunctions
    [junit] Tests run: 2, Failures: 0, Errors: 0, Skipped: 0, Time elapsed: 0.015 sec
    [junit] Running org.apache.poi.xssf.usermodel.TestXSSFFirstFooter
    [junit] Tests run: 1, Failures: 0, Errors: 0, Skipped: 0, Time elapsed: 0.004 sec
    [junit] Running org.apache.poi.xssf.usermodel.TestXSSFFirstHeader
    [junit] Tests run: 1, Failures: 0, Errors: 0, Skipped: 0, Time elapsed: 0.003 sec
    [junit] Running org.apache.poi.xssf.usermodel.TestXSSFFont
    [junit] Tests run: 23, Failures: 0, Errors: 0, Skipped: 0, Time elapsed: 0.066 sec
    [junit] Running org.apache.poi.xssf.usermodel.TestXSSFForkedEvaluator
    [junit] Tests run: 2, Failures: 0, Errors: 0, Skipped: 0, Time elapsed: 0.015 sec
    [junit] Running org.apache.poi.xssf.usermodel.TestXSSFFormulaEvaluation
    [junit] Tests run: 38, Failures: 0, Errors: 0, Skipped: 3, Time elapsed: 1.667 sec
    [junit] Running org.apache.poi.xssf.usermodel.TestXSSFFormulaParser
    [junit] Tests run: 12, Failures: 0, Errors: 0, Skipped: 0, Time elapsed: 0.094 sec
    [junit] Running org.apache.poi.xssf.usermodel.TestXSSFHeaderFooterProperties
    [junit] Tests run: 8, Failures: 0, Errors: 0, Skipped: 0, Time elapsed: 0.022 sec
    [junit] Running org.apache.poi.xssf.usermodel.TestXSSFHyperlink
    [junit] Tests run: 12, Failures: 0, Errors: 0, Skipped: 0, Time elapsed: 0.187 sec
    [junit] Running org.apache.poi.xssf.usermodel.TestXSSFName
    [junit] Tests run: 26, Failures: 0, Errors: 0, Skipped: 0, Time elapsed: 0.092 sec
    [junit] Running org.apache.poi.xssf.usermodel.TestXSSFOddFooter
    [junit] Tests run: 1, Failures: 0, Errors: 0, Skipped: 0, Time elapsed: 0.003 sec
    [junit] Running org.apache.poi.xssf.usermodel.TestXSSFOddHeader
    [junit] Tests run: 1, Failures: 0, Errors: 0, Skipped: 0, Time elapsed: 0.003 sec
    [junit] Running org.apache.poi.xssf.usermodel.TestXSSFPicture
    [junit] Tests run: 7, Failures: 0, Errors: 0, Skipped: 0, Time elapsed: 0.264 sec
    [junit] Running org.apache.poi.xssf.usermodel.TestXSSFPictureData
    [junit] Tests run: 3, Failures: 0, Errors: 0, Skipped: 0, Time elapsed: 0.05 sec
    [junit] Running org.apache.poi.xssf.usermodel.TestXSSFPivotTableName
    [junit] Tests run: 18, Failures: 0, Errors: 0, Skipped: 0, Time elapsed: 0.432 sec
    [junit] Running org.apache.poi.xssf.usermodel.TestXSSFPivotTableRef
    [junit] Tests run: 18, Failures: 0, Errors: 0, Skipped: 0, Time elapsed: 0.359 sec
    [junit] Running org.apache.poi.xssf.usermodel.TestXSSFPrintSetup
    [junit] Tests run: 19, Failures: 0, Errors: 0, Skipped: 0, Time elapsed: 0.018 sec
    [junit] Running org.apache.poi.xssf.usermodel.TestXSSFRichTextString
    [junit] Tests run: 20, Failures: 0, Errors: 0, Skipped: 0, Time elapsed: 0.026 sec
    [junit] Running org.apache.poi.xssf.usermodel.TestXSSFRow
    [junit] Tests run: 18, Failures: 0, Errors: 0, Skipped: 0, Time elapsed: 0.238 sec
    [junit] Running org.apache.poi.xssf.usermodel.TestXSSFShape
    [junit] Tests run: 2, Failures: 0, Errors: 0, Skipped: 0, Time elapsed: 0.038 sec
    [junit] Running org.apache.poi.xssf.usermodel.TestXSSFSheet
    [junit] Tests run: 98, Failures: 0, Errors: 0, Skipped: 0, Time elapsed: 6.469 sec
    [junit] Running org.apache.poi.xssf.usermodel.TestXSSFSheetAutosizeColumn
    [junit] Tests run: 7, Failures: 0, Errors: 0, Skipped: 0, Time elapsed: 0.04 sec
    [junit] Running org.apache.poi.xssf.usermodel.TestXSSFSheetMergeRegions
    [junit] Tests run: 1, Failures: 0, Errors: 0, Skipped: 0, Time elapsed: 1.305 sec
    [junit] Running org.apache.poi.xssf.usermodel.TestXSSFSheetRowGrouping
    [junit] Tests run: 6, Failures: 0, Errors: 0, Skipped: 0, Time elapsed: 0.132 sec
    [junit] Running org.apache.poi.xssf.usermodel.TestXSSFSheetShiftColumns
    [junit] Tests run: 10, Failures: 0, Errors: 0, Skipped: 0, Time elapsed: 0.07 sec
    [junit] Running org.apache.poi.xssf.usermodel.TestXSSFSheetShiftRows
    [junit] Tests run: 34, Failures: 0, Errors: 0, Skipped: 2, Time elapsed: 29.268 sec
    [junit] Running org.apache.poi.xssf.usermodel.TestXSSFSheetShiftRowsAndColumns
    [junit] Tests run: 5, Failures: 0, Errors: 0, Skipped: 2, Time elapsed: 0.021 sec
    [junit] Running org.apache.poi.xssf.usermodel.TestXSSFSheetUpdateArrayFormulas
    [junit] Tests run: 18, Failures: 0, Errors: 0, Skipped: 1, Time elapsed: 0.044 sec
    [junit] Running org.apache.poi.xssf.usermodel.TestXSSFSimpleShape
    [junit] Tests run: 1, Failures: 0, Errors: 0, Skipped: 0, Time elapsed: 0.012 sec
    [junit] Running org.apache.poi.xssf.usermodel.TestXSSFTable
    [junit] Tests run: 30, Failures: 0, Errors: 0, Skipped: 0, Time elapsed: 0.209 sec
    [junit] Running org.apache.poi.xssf.usermodel.TestXSSFTableColumn
    [junit] Tests run: 3, Failures: 0, Errors: 0, Skipped: 0, Time elapsed: 0.03 sec
    [junit] Running org.apache.poi.xssf.usermodel.TestXSSFTextParagraph
    [junit] Tests run: 1, Failures: 0, Errors: 0, Skipped: 0, Time elapsed: 0.011 sec
    [junit] Running org.apache.poi.xssf.usermodel.TestXSSFTextRun
    [junit] Tests run: 1, Failures: 0, Errors: 0, Skipped: 0, Time elapsed: 0.004 sec
    [junit] Running org.apache.poi.xssf.usermodel.TestXSSFUnicodeSurrogates
    [junit] Tests run: 1, Failures: 0, Errors: 0, Skipped: 0, Time elapsed: 0.009 sec
    [junit] Running org.apache.poi.xssf.usermodel.TestXSSFVMLDrawing
    [junit] Tests run: 4, Failures: 0, Errors: 0, Skipped: 0, Time elapsed: 0.067 sec
    [junit] Running org.apache.poi.xssf.usermodel.TestXSSFWorkbook
    [junit] Tests run: 62, Failures: 0, Errors: 0, Skipped: 0, Time elapsed: 0.708 sec
    [junit] Running org.apache.poi.xssf.usermodel.charts.TestXDDFChartLegend
    [junit] Tests run: 3, Failures: 0, Errors: 0, Skipped: 0, Time elapsed: 0.012 sec
    [junit] Running org.apache.poi.xssf.usermodel.charts.TestXDDFManualLayout
    [junit] Tests run: 2, Failures: 0, Errors: 0, Skipped: 0, Time elapsed: 0.009 sec
    [junit] Running org.apache.poi.xssf.usermodel.charts.TestXSSFCategoryAxis
    [junit] Tests run: 1, Failures: 0, Errors: 0, Skipped: 0, Time elapsed: 0.006 sec
    [junit] Running org.apache.poi.xssf.usermodel.charts.TestXSSFChartAxis
    [junit] Tests run: 8, Failures: 0, Errors: 0, Skipped: 0, Time elapsed: 0.043 sec
    [junit] Running org.apache.poi.xssf.usermodel.charts.TestXSSFChartTitle
    [junit] Tests run: 6, Failures: 0, Errors: 0, Skipped: 0, Time elapsed: 0.045 sec
    [junit] Running org.apache.poi.xssf.usermodel.charts.TestXSSFDateAxis
    [junit] Tests run: 1, Failures: 0, Errors: 0, Skipped: 0, Time elapsed: 0.011 sec
    [junit] Running org.apache.poi.xssf.usermodel.charts.TestXSSFLineChartData
    [junit] Tests run: 1, Failures: 0, Errors: 0, Skipped: 0, Time elapsed: 0.007 sec
    [junit] Running org.apache.poi.xssf.usermodel.charts.TestXSSFScatterChartData
    [junit] Tests run: 1, Failures: 0, Errors: 0, Skipped: 0, Time elapsed: 0.007 sec
    [junit] Running org.apache.poi.xssf.usermodel.charts.TestXSSFValueAxis
    [junit] Tests run: 1, Failures: 0, Errors: 0, Skipped: 0, Time elapsed: 0.004 sec
    [junit] Running org.apache.poi.xssf.usermodel.extensions.TestXSSFBorder
    [junit] Tests run: 1, Failures: 0, Errors: 0, Skipped: 0, Time elapsed: 0.002 sec
    [junit] Running org.apache.poi.xssf.usermodel.extensions.TestXSSFCellFill
    [junit] Tests run: 6, Failures: 0, Errors: 0, Skipped: 0, Time elapsed: 0.022 sec
    [junit] Running org.apache.poi.xssf.usermodel.extensions.TestXSSFHeaderFooter
    [junit] Tests run: 10, Failures: 0, Errors: 0, Skipped: 0, Time elapsed: 0.022 sec
    [junit] Running org.apache.poi.xssf.usermodel.helpers.TestColumnHelper
    [junit] Tests run: 16, Failures: 0, Errors: 0, Skipped: 0, Time elapsed: 0.025 sec
    [junit] Running org.apache.poi.xssf.usermodel.helpers.TestHeaderFooterHelper
    [junit] Tests run: 2, Failures: 0, Errors: 0, Skipped: 0, Time elapsed: 0.001 sec
    [junit] Running org.apache.poi.xssf.usermodel.helpers.TestXSSFColumnShifting
    [junit] Tests run: 2, Failures: 0, Errors: 0, Skipped: 0, Time elapsed: 0.003 sec
    [junit] Running org.apache.poi.xssf.util.TestCTColComparator
    [junit] Tests run: 2, Failures: 0, Errors: 0, Skipped: 0, Time elapsed: 0.002 sec
    [junit] Running org.apache.poi.xssf.util.TestEvilUnclosedBRFixingInputStream
    [junit] Tests run: 3, Failures: 0, Errors: 0, Skipped: 0, Time elapsed: 0.002 sec
    [junit] Running org.apache.poi.xssf.util.TestNumericRanges
    [junit] Tests run: 2, Failures: 0, Errors: 0, Skipped: 0, Time elapsed: 0.001 sec
    [junit] Running org.apache.poi.xwpf.TestAllExtendedProperties
    [junit] Tests run: 1, Failures: 0, Errors: 0, Skipped: 0, Time elapsed: 0.037 sec
    [junit] Running org.apache.poi.xwpf.TestDocumentProtection
    [junit] Tests run: 10, Failures: 0, Errors: 0, Skipped: 0, Time elapsed: 0.404 sec
    [junit] Running org.apache.poi.xwpf.TestNecessaryOOXMLClasses
    [junit] Tests run: 1, Failures: 0, Errors: 0, Skipped: 0, Time elapsed: 0.007 sec
    [junit] Running org.apache.poi.xwpf.TestPackageCorePropertiesGetKeywords
    [junit] Tests run: 1, Failures: 0, Errors: 0, Skipped: 0, Time elapsed: 0.016 sec
    [junit] Running org.apache.poi.xwpf.TestXWPFBugs
    [junit] Tests run: 4, Failures: 0, Errors: 0, Skipped: 0, Time elapsed: 0.242 sec
    [junit] Running org.apache.poi.xwpf.extractor.TestExternalEntities
    [junit] Tests run: 1, Failures: 0, Errors: 0, Skipped: 0, Time elapsed: 0.007 sec
    [junit] Running org.apache.poi.xwpf.extractor.TestXWPFWordExtractor
    [junit] Tests run: 24, Failures: 0, Errors: 0, Skipped: 0, Time elapsed: 0.589 sec
    [junit] Running org.apache.poi.xwpf.model.TestXWPFDecorators
    [junit] Tests run: 2, Failures: 0, Errors: 0, Skipped: 0, Time elapsed: 0.048 sec
    [junit] Running org.apache.poi.xwpf.model.TestXWPFHeaderFooterPolicy
    [junit] Tests run: 3, Failures: 0, Errors: 0, Skipped: 0, Time elapsed: 0.134 sec
    [junit] Running org.apache.poi.xwpf.usermodel.TestChangeTracking
    [junit] Tests run: 3, Failures: 0, Errors: 0, Skipped: 0, Time elapsed: 0.018 sec
    [junit] Running org.apache.poi.xwpf.usermodel.TestXWPFBugs
    [junit] Tests run: 10, Failures: 0, Errors: 0, Skipped: 0, Time elapsed: 0.204 sec
    [junit] Running org.apache.poi.xwpf.usermodel.TestXWPFChart
    [junit] Tests run: 4, Failures: 0, Errors: 0, Skipped: 0, Time elapsed: 0.036 sec
    [junit] Running org.apache.poi.xwpf.usermodel.TestXWPFComment
    [junit] Tests run: 1, Failures: 0, Errors: 0, Skipped: 0, Time elapsed: 0.005 sec
    [junit] Running org.apache.poi.xwpf.usermodel.TestXWPFDocument
    [junit] Tests run: 21, Failures: 0, Errors: 0, Skipped: 1, Time elapsed: 0.243 sec
    [junit] Running org.apache.poi.xwpf.usermodel.TestXWPFEndnote
    [junit] Tests run: 4, Failures: 0, Errors: 0, Skipped: 0, Time elapsed: 0.016 sec
    [junit] Running org.apache.poi.xwpf.usermodel.TestXWPFEndnotes
    [junit] Tests run: 2, Failures: 0, Errors: 0, Skipped: 0, Time elapsed: 0.008 sec
    [junit] Running org.apache.poi.xwpf.usermodel.TestXWPFFootnote
    [junit] Tests run: 4, Failures: 0, Errors: 0, Skipped: 0, Time elapsed: 0.013 sec
    [junit] Running org.apache.poi.xwpf.usermodel.TestXWPFFootnotes
    [junit] Tests run: 3, Failures: 0, Errors: 0, Skipped: 0, Time elapsed: 0.019 sec
    [junit] Running org.apache.poi.xwpf.usermodel.TestXWPFHeader
    [junit] Tests run: 9, Failures: 0, Errors: 0, Skipped: 4, Time elapsed: 0.078 sec
    [junit] Running org.apache.poi.xwpf.usermodel.TestXWPFHeadings
    [junit] Tests run: 1, Failures: 0, Errors: 0, Skipped: 0, Time elapsed: 0.032 sec
    [junit] Running org.apache.poi.xwpf.usermodel.TestXWPFNumbering
    [junit] Tests run: 8, Failures: 0, Errors: 0, Skipped: 0, Time elapsed: 0.068 sec
    [junit] Running org.apache.poi.xwpf.usermodel.TestXWPFParagraph
    [junit] Tests run: 28, Failures: 0, Errors: 0, Skipped: 0, Time elapsed: 0.132 sec
    [junit] Running org.apache.poi.xwpf.usermodel.TestXWPFPictureData
    [junit] Tests run: 5, Failures: 0, Errors: 0, Skipped: 0, Time elapsed: 0.088 sec
    [junit] Running org.apache.poi.xwpf.usermodel.TestXWPFRun
    [junit] Tests run: 34, Failures: 0, Errors: 0, Skipped: 0, Time elapsed: 0.167 sec
    [junit] Running org.apache.poi.xwpf.usermodel.TestXWPFSDT
    [junit] Tests run: 7, Failures: 0, Errors: 0, Skipped: 0, Time elapsed: 0.062 sec
    [junit] Running org.apache.poi.xwpf.usermodel.TestXWPFSmartTag
    [junit] Tests run: 1, Failures: 0, Errors: 0, Skipped: 0, Time elapsed: 0.005 sec
    [junit] Running org.apache.poi.xwpf.usermodel.TestXWPFStyles
    [junit] Tests run: 10, Failures: 0, Errors: 0, Skipped: 0, Time elapsed: 0.069 sec
    [junit] Running org.apache.poi.xwpf.usermodel.TestXWPFTable
    [junit] Tests run: 17, Failures: 0, Errors: 0, Skipped: 0, Time elapsed: 0.066 sec
    [junit] Running org.apache.poi.xwpf.usermodel.TestXWPFTableCell
    [junit] Tests run: 10, Failures: 0, Errors: 0, Skipped: 1, Time elapsed: 0.03 sec
    [junit] Running org.apache.poi.xwpf.usermodel.TestXWPFTableRow
    [junit] Tests run: 6, Failures: 0, Errors: 0, Skipped: 0, Time elapsed: 0.024 sec
    [junit] Running org.apache.poi.poifs.crypt.TestSignatureInfo
    [junit] Tests run: 14, Failures: 0, Errors: 1, Skipped: 1, Time elapsed: 8.418 sec

BUILD FAILED
<https://builds.apache.org/job/POI-DSL-OpenJDK/ws/src/integrationtest/build.xml>:72: The following error occurred while executing this line:
<https://builds.apache.org/job/POI-DSL-OpenJDK/ws/build/distsourcebuild/poi-5.0.0-SNAPSHOT/build.xml>:1483: The following error occurred while executing this line:
<https://builds.apache.org/job/POI-DSL-OpenJDK/ws/build/distsourcebuild/poi-5.0.0-SNAPSHOT/build.xml>:1466: The following error occurred while executing this line:
<https://builds.apache.org/job/POI-DSL-OpenJDK/ws/build/distsourcebuild/poi-5.0.0-SNAPSHOT/build.xml>:1079: Test org.apache.poi.poifs.crypt.TestSignatureInfo failed

Total time: 5 minutes 14 seconds
Build step 'Invoke Ant' marked build as failure
Skipping publisher since build result is FAILURE
Archiving artifacts
[Fast Archiver] Compressed 217.59 MB of artifacts by 32.4% relative to #81
Skipping publisher since build result is FAILURE
Recording test results

---------------------------------------------------------------------
To unsubscribe, e-mail: [hidden email]
For additional commands, e-mail: [hidden email]

Reply | Threaded
Open this post in threaded view
|

Build failed in Jenkins: POI-DSL-OpenJDK #83

Apache Jenkins Server
See <https://builds.apache.org/job/POI-DSL-OpenJDK/83/display/redirect?page=changes>

Changes:

[kiwiwings] use Ant 1.10 for the builds

[fanningpj] add back TempFileUtils.java due to broken build

[kiwiwings] #64411 - Provide JigSaw modules
- use classpath-build for Java 8, otherwise use modulepath
- save module-info classes to source, when using Java 9+ environment
- rename example packages - otherwise package clashes occured in the tests
- move agile encryption from ooxml to main.
  remove EncryptionInfo XmlBeans and schema and use custom xml marshalling
- move ooxml test classes which reside in the same package as their tested main class
- rename base test classes to "BaseTest..." - temporarily I've used a light version of the main test classes to test scratchpad / ooxml
- build.xml - fixed the Rhino javascript errors of the dependency-macros
- DrawTextParagraph - fixed StringIndexOutOfBounds when logging set to debug level
- use JigSaw provider interface (= Java ServiceLoader), i.e. it wasn't possible (without openening everything), to access ooxml factory classes from main factory stub


------------------------------------------
[...truncated 359.22 KB...]
    [junit] Reading spreadsheet/ex41187-19267.xls with HPSFFileHandler
    [junit] Reading spreadsheet/ex42564-21435.xls with HSSFFileHandler
    [junit] Reading spreadsheet/ex42564-21435.xls with HPSFFileHandler
    [junit] Reading spreadsheet/ex42564-21503.xls with HSSFFileHandler
    [junit] Reading spreadsheet/ex42564-21503.xls with HPSFFileHandler
    [junit] Reading spreadsheet/ex42564-elementOrder.xls with HSSFFileHandler
    [junit] Reading spreadsheet/ex42564-elementOrder.xls with HPSFFileHandler
    [junit] Reading spreadsheet/ex42570-20305.xls with HSSFFileHandler
    [junit] Reading spreadsheet/ex42570-20305.xls with HPSFFileHandler
    [junit] Reading spreadsheet/ex44921-21902.xls with HSSFFileHandler
    [junit] Reading spreadsheet/ex44921-21902.xls with HPSFFileHandler
    [junit] Reading spreadsheet/ex45046-21984.xls with HSSFFileHandler
    [junit] Reading spreadsheet/ex45046-21984.xls with HPSFFileHandler
    [junit] Reading spreadsheet/ex45582-22397.xls with HSSFFileHandler
    [junit] Reading spreadsheet/ex45582-22397.xls with HPSFFileHandler
    [junit] Reading spreadsheet/ex45672.xls with HSSFFileHandler
    [junit] Reading spreadsheet/ex45672.xls with HPSFFileHandler
    [junit] Reading spreadsheet/ex45698-22488.xls with HSSFFileHandler
    [junit] Reading spreadsheet/ex45698-22488.xls with HPSFFileHandler
    [junit] Reading spreadsheet/ex45978-extraLinkTableSheets.xls with HSSFFileHandler
    [junit] Reading spreadsheet/ex45978-extraLinkTableSheets.xls with HPSFFileHandler
    [junit] Reading spreadsheet/ex46548-23133.xls with HSSFFileHandler
    [junit] Reading spreadsheet/ex46548-23133.xls with HPSFFileHandler
    [junit] Reading spreadsheet/ex47747-sharedFormula.xls with HSSFFileHandler
    [junit] Reading spreadsheet/ex47747-sharedFormula.xls with HPSFFileHandler
    [junit] Reading spreadsheet/excel_with_embeded.xls with HSSFFileHandler
    [junit] Reading spreadsheet/excel_with_embeded.xls with HPSFFileHandler
    [junit] Reading spreadsheet/excelant.xls with HSSFFileHandler
    [junit] Reading spreadsheet/excelant.xls with HPSFFileHandler
    [junit] Reading spreadsheet/extendedtextstrings.txt with NullFileHandler
    [junit] Reading spreadsheet/externalFunctionExample.xls with HSSFFileHandler
    [junit] Reading spreadsheet/externalFunctionExample.xls with HPSFFileHandler
    [junit] Reading spreadsheet/external_image.xls with HSSFFileHandler
    [junit] Reading spreadsheet/external_image.xls with HPSFFileHandler
    [junit] Reading spreadsheet/external_name.xls with HSSFFileHandler
    [junit] Reading spreadsheet/external_name.xls with HPSFFileHandler
    [junit] Reading spreadsheet/finance.xls with HSSFFileHandler
    [junit] Reading spreadsheet/finance.xls with HPSFFileHandler
    [junit] Reading spreadsheet/florida_data.ashx.xls with HSSFFileHandler
    [junit] Reading spreadsheet/florida_data.ashx.xls with HPSFFileHandler
    [junit] Reading spreadsheet/headerFooterTest.xlsx with XSSFFileHandler
    [junit] Reading spreadsheet/headerFooterTest.xlsx with OPCFileHandler
    [junit] Reading spreadsheet/hyperlink.xlsb with XSSFBFileHandler
    [junit] Reading spreadsheet/intercept.xls with HSSFFileHandler
    [junit] Reading spreadsheet/intercept.xls with HPSFFileHandler
    [junit] Reading spreadsheet/logoKarmokar4.png with NullFileHandler
    [junit] Reading spreadsheet/maxindextest.xls with HSSFFileHandler
    [junit] Reading spreadsheet/maxindextest.xls with HPSFFileHandler
    [junit] Reading spreadsheet/mirrTest.xls with HSSFFileHandler
    [junit] Reading spreadsheet/mirrTest.xls with HPSFFileHandler
    [junit] Reading spreadsheet/missingFuncs44675.xls with HSSFFileHandler
    [junit] Reading spreadsheet/missingFuncs44675.xls with HPSFFileHandler
    [junit] Reading spreadsheet/mortgage-calculation.xls with HSSFFileHandler
    [junit] Reading spreadsheet/mortgage-calculation.xls with HPSFFileHandler
    [junit] Reading spreadsheet/multibookFormulaA.xls with HSSFFileHandler
    [junit] Reading spreadsheet/multibookFormulaA.xls with HPSFFileHandler
    [junit] Reading spreadsheet/multibookFormulaB.xls with HSSFFileHandler
    [junit] Reading spreadsheet/multibookFormulaB.xls with HPSFFileHandler
    [junit] Reading spreadsheet/mv-calculator-final-2-20-2013.xlsm with XSSFFileHandler
    [junit] Reading spreadsheet/mv-calculator-final-2-20-2013.xlsm with OPCFileHandler
    [junit] Reading spreadsheet/named-cell-in-formula-test.xls with HSSFFileHandler
    [junit] Reading spreadsheet/named-cell-in-formula-test.xls with HPSFFileHandler
    [junit] Reading spreadsheet/named-cell-test.xls with HSSFFileHandler
    [junit] Reading spreadsheet/named-cell-test.xls with HPSFFileHandler
    [junit] Reading spreadsheet/namedinput.xls with HSSFFileHandler
    [junit] Reading spreadsheet/namedinput.xls with HPSFFileHandler
    [junit] Reading spreadsheet/noHeaderFooter47244.xls with HSSFFileHandler
    [junit] Reading spreadsheet/noHeaderFooter47244.xls with HPSFFileHandler
    [junit] Reading spreadsheet/noSharedStringTable.xlsx with XSSFFileHandler
    [junit] Reading spreadsheet/noSharedStringTable.xlsx with OPCFileHandler
    [junit] Reading spreadsheet/ole2-embedding.xls with HSSFFileHandler
    [junit] Reading spreadsheet/ole2-embedding.xls with HPSFFileHandler
    [junit] Reading spreadsheet/overlapSharedFormula.xls with HSSFFileHandler
    [junit] Reading spreadsheet/overlapSharedFormula.xls with HPSFFileHandler
    [junit] Reading spreadsheet/password.xls with HSSFFileHandler
    [junit] Reading spreadsheet/password.xls with HPSFFileHandler
    [junit] Reading spreadsheet/picture.xlsx with XSSFFileHandler
    [junit] Reading spreadsheet/picture.xlsx with OPCFileHandler
    [junit] Reading spreadsheet/poc-shared-strings.xlsx with XSSFFileHandler
    [junit] Reading spreadsheet/poc-shared-strings.xlsx with OPCFileHandler
    [junit] Reading spreadsheet/poc-xmlbomb-empty.xlsx with XSSFFileHandler
    [junit] Reading spreadsheet/poc-xmlbomb-empty.xlsx with OPCFileHandler
    [junit] Reading spreadsheet/poc-xmlbomb.xlsx with XSSFFileHandler
    [junit] Reading spreadsheet/poc-xmlbomb.xlsx with OPCFileHandler
    [junit] Reading spreadsheet/protected_passtika.xlsb with XSSFBFileHandler
    [junit] Reading spreadsheet/protected_passtika.xlsx with XSSFFileHandler
    [junit] Reading spreadsheet/protected_passtika.xlsx with OPCFileHandler
    [junit] Reading spreadsheet/rank.xls with HSSFFileHandler
    [junit] Reading spreadsheet/rank.xls with HPSFFileHandler
    [junit] Reading spreadsheet/ref-56737.xlsx with XSSFFileHandler
    [junit] Reading spreadsheet/ref-56737.xlsx with OPCFileHandler
    [junit] Reading spreadsheet/ref2-56737.xlsx with XSSFFileHandler
    [junit] Reading spreadsheet/ref2-56737.xlsx with OPCFileHandler
    [junit] Reading spreadsheet/reordered_sheets.xlsx with XSSFFileHandler
    [junit] Reading spreadsheet/reordered_sheets.xlsx with OPCFileHandler
    [junit] Reading spreadsheet/resize_compare.xls with HSSFFileHandler
    [junit] Reading spreadsheet/resize_compare.xls with HPSFFileHandler
    [junit] Reading spreadsheet/resize_compare.xlsx with XSSFFileHandler
    [junit] Reading spreadsheet/resize_compare.xlsx with OPCFileHandler
    [junit] Reading spreadsheet/richtextdata.txt with NullFileHandler
    [junit] Reading spreadsheet/rk.xls with HSSFFileHandler
    [junit] Reading spreadsheet/rk.xls with HPSFFileHandler
    [junit] Reading spreadsheet/sample-beta.xlsx with XSSFFileHandler
    [junit] Reading spreadsheet/sample-beta.xlsx with OPCFileHandler
    [junit] Reading spreadsheet/sample.strict.xlsx with XSSFFileHandler
    [junit] Reading spreadsheet/sample.strict.xlsx with OPCFileHandler
    [junit] Reading spreadsheet/sample.xlsb with XSSFBFileHandler
    [junit] Reading spreadsheet/sample.xlsx with XSSFFileHandler
    [junit] Reading spreadsheet/sample.xlsx with OPCFileHandler
    [junit] Reading spreadsheet/shared_formulas.xls with HSSFFileHandler
    [junit] Reading spreadsheet/shared_formulas.xls with HPSFFileHandler
    [junit] Reading spreadsheet/shared_formulas.xlsx with XSSFFileHandler
    [junit] Reading spreadsheet/shared_formulas.xlsx with OPCFileHandler
    [junit] Reading spreadsheet/sheetProtection_allLocked.xlsx with XSSFFileHandler
    [junit] Reading spreadsheet/sheetProtection_allLocked.xlsx with OPCFileHandler
    [junit] Reading spreadsheet/sheetProtection_not_protected.xlsx with XSSFFileHandler
    [junit] Reading spreadsheet/sheetProtection_not_protected.xlsx with OPCFileHandler
    [junit] Reading spreadsheet/simple-monthly-budget.xlsx with XSSFFileHandler
    [junit] Reading spreadsheet/simple-monthly-budget.xlsx with OPCFileHandler
    [junit] Reading spreadsheet/simple-table-named-range.xlsx with XSSFFileHandler
    [junit] Reading spreadsheet/simple-table-named-range.xlsx with OPCFileHandler
    [junit] Reading spreadsheet/stringacross2continuations.txt with NullFileHandler
    [junit] Reading spreadsheet/style-alternate-content.xlsx with XSSFFileHandler
    [junit] Reading spreadsheet/style-alternate-content.xlsx with OPCFileHandler
    [junit] Reading spreadsheet/styles.xlsx with XSSFFileHandler
    [junit] Reading spreadsheet/styles.xlsx with OPCFileHandler
    [junit] Reading spreadsheet/sumifformula.xls with HSSFFileHandler
    [junit] Reading spreadsheet/sumifformula.xls with HPSFFileHandler
    [junit] Reading spreadsheet/sumifs.xls with HSSFFileHandler
    [junit] Reading spreadsheet/sumifs.xls with HPSFFileHandler
    [junit] Reading spreadsheet/tableStyle.xlsx with XSSFFileHandler
    [junit] Reading spreadsheet/tableStyle.xlsx with OPCFileHandler
    [junit] Reading spreadsheet/template.xlsx with XSSFFileHandler
    [junit] Reading spreadsheet/template.xlsx with OPCFileHandler
    [junit] Reading spreadsheet/templateExcelWithAutofilter.xls with HSSFFileHandler
    [junit] Reading spreadsheet/templateExcelWithAutofilter.xls with HPSFFileHandler
    [junit] Reading spreadsheet/test.xltx with XSSFFileHandler
    [junit] Reading spreadsheet/test.xltx with OPCFileHandler
    [junit] Reading spreadsheet/testArraysAndTables.xls with HSSFFileHandler
    [junit] Reading spreadsheet/testArraysAndTables.xls with HPSFFileHandler
    [junit] Reading spreadsheet/testEXCEL_3.xls with HSSFFileHandler
    [junit] Reading spreadsheet/testEXCEL_3.xls with HPSFFileHandler
    [junit] Reading spreadsheet/testEXCEL_4.xls with HSSFFileHandler
    [junit] Reading spreadsheet/testEXCEL_4.xls with HPSFFileHandler
    [junit] Reading spreadsheet/testEXCEL_5.xls with HSSFFileHandler
    [junit] Reading spreadsheet/testEXCEL_5.xls with HPSFFileHandler
    [junit] Reading spreadsheet/testEXCEL_95.xls with HSSFFileHandler
    [junit] Reading spreadsheet/testEXCEL_95.xls with HPSFFileHandler
    [junit] Reading spreadsheet/testNames.xls with HSSFFileHandler
    [junit] Reading spreadsheet/testNames.xls with HPSFFileHandler
    [junit] Reading spreadsheet/testNames.xlsm with XSSFFileHandler
    [junit] Reading spreadsheet/testNames.xlsm with OPCFileHandler
    [junit] Reading spreadsheet/testRRaC.xls with HSSFFileHandler
    [junit] Reading spreadsheet/testRRaC.xls with HPSFFileHandler
    [junit] Reading spreadsheet/testRVA.xls with HSSFFileHandler
    [junit] Reading spreadsheet/testRVA.xls with HPSFFileHandler
    [junit] Reading spreadsheet/testVarious.xlsb with XSSFBFileHandler
    [junit] Reading spreadsheet/test_conditional_formatting.xlsx with XSSFFileHandler
    [junit] Reading spreadsheet/test_conditional_formatting.xlsx with OPCFileHandler
    [junit] Reading spreadsheet/test_properties1 with NullFileHandler
    [junit] Reading spreadsheet/text.xls with HSSFFileHandler
    [junit] Reading spreadsheet/text.xls with HPSFFileHandler
    [junit] Reading spreadsheet/tile-range-test.xls with HSSFFileHandler
    [junit] Reading spreadsheet/tile-range-test.xls with HPSFFileHandler
    [junit] Reading spreadsheet/tile-range-test.xlsx with XSSFFileHandler
    [junit] Reading spreadsheet/tile-range-test.xlsx with OPCFileHandler
    [junit] Reading spreadsheet/unicodeNameRecord.xls with HSSFFileHandler
    [junit] Reading spreadsheet/unicodeNameRecord.xls with HPSFFileHandler
    [junit] Reading spreadsheet/unicodeSheetName.xlsx with XSSFFileHandler
    [junit] Reading spreadsheet/unicodeSheetName.xlsx with OPCFileHandler
    [junit] Reading spreadsheet/vmlDrawing1.vml with NullFileHandler
    [junit] Reading spreadsheet/workbookProtection-sheet_password-2013.xlsx with XSSFFileHandler
    [junit] Reading spreadsheet/workbookProtection-sheet_password-2013.xlsx with OPCFileHandler
    [junit] Reading spreadsheet/workbookProtection-workbook_password-2013.xlsx with XSSFFileHandler
    [junit] Reading spreadsheet/workbookProtection-workbook_password-2013.xlsx with OPCFileHandler
    [junit] Reading spreadsheet/workbookProtection-workbook_password_user_range-2010.xlsx with XSSFFileHandler
    [junit] Reading spreadsheet/workbookProtection-workbook_password_user_range-2010.xlsx with OPCFileHandler
    [junit] Reading spreadsheet/workbookProtection_not_protected.xlsx with XSSFFileHandler
    [junit] Reading spreadsheet/workbookProtection_not_protected.xlsx with OPCFileHandler
    [junit] Reading spreadsheet/workbookProtection_workbook_revision_protected.xlsx with XSSFFileHandler
    [junit] Reading spreadsheet/workbookProtection_workbook_revision_protected.xlsx with OPCFileHandler
    [junit] Reading spreadsheet/workbookProtection_workbook_structure_protected.xlsx with XSSFFileHandler
    [junit] Reading spreadsheet/workbookProtection_workbook_structure_protected.xlsx with OPCFileHandler
    [junit] Reading spreadsheet/workbookProtection_workbook_windows_protected.xlsx with XSSFFileHandler
    [junit] Reading spreadsheet/workbookProtection_workbook_windows_protected.xlsx with OPCFileHandler
    [junit] Reading spreadsheet/workbookProtection_worksheet_protected.xlsx with XSSFFileHandler
    [junit] Reading spreadsheet/workbookProtection_worksheet_protected.xlsx with OPCFileHandler
    [junit] Reading spreadsheet/xlsx-corrupted.xlsx with XSSFFileHandler
    [junit] Reading spreadsheet/xlsx-corrupted.xlsx with OPCFileHandler
    [junit] Reading spreadsheet/xlsx-jdbc.xlsx with XSSFFileHandler
    [junit] Reading spreadsheet/xlsx-jdbc.xlsx with OPCFileHandler
    [junit] Reading spreadsheet/xor-encryption-abc.xls with HSSFFileHandler
    [junit] Reading spreadsheet/xor-encryption-abc.xls with HPSFFileHandler
    [junit] Reading spreadsheet/xxe_in_schema.xlsx with XSSFFileHandler
    [junit] Reading spreadsheet/xxe_in_schema.xlsx with OPCFileHandler
    [junit] Reading spreadsheet/yearfracExamples.xls with HSSFFileHandler
    [junit] Reading spreadsheet/yearfracExamples.xls with HPSFFileHandler
    [junit] Reading xmldsign/Office2010-SP1-XAdES-X-L.docx with XWPFFileHandler
    [junit] Reading xmldsign/Office2010-SP1-XAdES-X-L.docx with OPCFileHandler
    [junit] Reading xmldsign/PPT2016withComment.pptx with XSLFFileHandler
    [junit] Reading xmldsign/PPT2016withComment.pptx with OPCFileHandler
    [junit] Reading xmldsign/bug58630.xlsx with XSSFFileHandler
    [junit] Reading xmldsign/bug58630.xlsx with OPCFileHandler
    [junit] Reading xmldsign/bug63011_key1.pem with NullFileHandler
    [junit] Reading xmldsign/bug63011_key2.pem with NullFileHandler
    [junit] Reading xmldsign/chaintest.pfx with NullFileHandler
    [junit] Reading xmldsign/hello-world-office-2010-technical-preview-unsigned.docx with XWPFFileHandler
    [junit] Reading xmldsign/hello-world-office-2010-technical-preview-unsigned.docx with OPCFileHandler
    [junit] Reading xmldsign/hello-world-office-2010-technical-preview.docx with XWPFFileHandler
    [junit] Reading xmldsign/hello-world-office-2010-technical-preview.docx with OPCFileHandler
    [junit] Reading xmldsign/hello-world-signed-twice.docx with XWPFFileHandler
    [junit] Reading xmldsign/hello-world-signed-twice.docx with OPCFileHandler
    [junit] Reading xmldsign/hello-world-signed.docx with XWPFFileHandler
    [junit] Reading xmldsign/hello-world-signed.docx with OPCFileHandler
    [junit] Reading xmldsign/hello-world-signed.pptx with XSLFFileHandler
    [junit] Reading xmldsign/hello-world-signed.pptx with OPCFileHandler
    [junit] Reading xmldsign/hello-world-signed.xlsx with XSSFFileHandler
    [junit] Reading xmldsign/hello-world-signed.xlsx with OPCFileHandler
    [junit] Reading xmldsign/hello-world-unsigned.docx with XWPFFileHandler
    [junit] Reading xmldsign/hello-world-unsigned.docx with OPCFileHandler
    [junit] Reading xmldsign/hello-world-unsigned.pptx with XSLFFileHandler
    [junit] Reading xmldsign/hello-world-unsigned.pptx with OPCFileHandler
    [junit] Reading xmldsign/hello-world-unsigned.xlsx with XSSFFileHandler
    [junit] Reading xmldsign/hello-world-unsigned.xlsx with OPCFileHandler
    [junit] Reading xmldsign/hyperlink-example-signed.docx with XWPFFileHandler
    [junit] Reading xmldsign/hyperlink-example-signed.docx with OPCFileHandler
    [junit] Reading xmldsign/ms-office-2010-signed.docx with XWPFFileHandler
    [junit] Reading xmldsign/ms-office-2010-signed.docx with OPCFileHandler
    [junit] Reading xmldsign/ms-office-2010-signed.pptx with XSLFFileHandler
    [junit] Reading xmldsign/ms-office-2010-signed.pptx with OPCFileHandler
    [junit] Reading xmldsign/ms-office-2010-signed.xlsx with XSSFFileHandler
    [junit] Reading xmldsign/ms-office-2010-signed.xlsx with OPCFileHandler
    [junit] Reading xmldsign/office2007prettyPrintedRels.docx with XWPFFileHandler
    [junit] Reading xmldsign/office2007prettyPrintedRels.docx with OPCFileHandler
    [junit] Reading xmldsign/signed.docx with XWPFFileHandler
    [junit] Reading xmldsign/signed.docx with OPCFileHandler
    [junit] Tests run: 2563, Failures: 0, Errors: 1, Skipped: 0, Time elapsed: 669.436 sec

BUILD FAILED
<https://builds.apache.org/job/POI-DSL-OpenJDK/ws/build.xml>:1549: The following error occurred while executing this line:
<https://builds.apache.org/job/POI-DSL-OpenJDK/ws/build.xml>:1110: Test org.apache.poi.stress.TestAllFiles failed

Total time: 23 minutes 41 seconds
Build step 'Invoke Ant' marked build as failure
Skipping publisher since build result is FAILURE
Archiving artifacts
[Fast Archiver] Compressed 4.13 MB of artifacts by 20.4% relative to #81
Skipping publisher since build result is FAILURE
Recording test results

---------------------------------------------------------------------
To unsubscribe, e-mail: [hidden email]
For additional commands, e-mail: [hidden email]

Reply | Threaded
Open this post in threaded view
|

Build failed in Jenkins: POI-DSL-OpenJDK #84

Apache Jenkins Server
See <https://builds.apache.org/job/POI-DSL-OpenJDK/84/display/redirect?page=changes>

Changes:

[fanningpj] try to make examples more robust - to fix integration tests


------------------------------------------
[...truncated 980.35 KB...]
  [javadoc] <https://builds.apache.org/job/POI-DSL-OpenJDK/ws/src/ooxml/java/org/apache/poi/xssf/usermodel/XSSFColor.java>:265: error: unknown tag: sysClr
  [javadoc]      * Index into the <clrScheme> collection, referencing a particular <sysClr> or
  [javadoc]                                                                        ^
  [javadoc] <https://builds.apache.org/job/POI-DSL-OpenJDK/ws/src/ooxml/java/org/apache/poi/xssf/usermodel/XSSFColor.java>:266: error: unknown tag: srgbClr
  [javadoc]      *  <srgbClr> value expressed in the Theme part.
  [javadoc]         ^
  [javadoc] <https://builds.apache.org/job/POI-DSL-OpenJDK/ws/src/ooxml/java/org/apache/poi/xssf/usermodel/XSSFColor.java>:274: error: unknown tag: clrScheme
  [javadoc]      * Index into the <clrScheme> collection, referencing a particular <sysClr> or
  [javadoc]                       ^
  [javadoc] <https://builds.apache.org/job/POI-DSL-OpenJDK/ws/src/ooxml/java/org/apache/poi/xssf/usermodel/XSSFColor.java>:274: error: unknown tag: sysClr
  [javadoc]      * Index into the <clrScheme> collection, referencing a particular <sysClr> or
  [javadoc]                                                                        ^
  [javadoc] <https://builds.apache.org/job/POI-DSL-OpenJDK/ws/src/ooxml/java/org/apache/poi/xssf/usermodel/XSSFColor.java>:275: error: unknown tag: srgbClr
  [javadoc]      *  <srgbClr> value expressed in the Theme part.
  [javadoc]         ^
  [javadoc] <https://builds.apache.org/job/POI-DSL-OpenJDK/ws/src/ooxml/java/org/apache/poi/xssf/usermodel/XSSFDxfStyleProvider.java>:42: error: bad use of '>'
  [javadoc]      * @param stripeSize 0 for non-stripe styles, > 1 for stripes
  [javadoc]                                                   ^
  [javadoc] <https://builds.apache.org/job/POI-DSL-OpenJDK/ws/src/ooxml/java/org/apache/poi/xssf/usermodel/XSSFName.java>:146: error: tag not allowed here: <blockquote>
  [javadoc]      * <pre><blockquote>
  [javadoc]             ^
  [javadoc] <https://builds.apache.org/job/POI-DSL-OpenJDK/ws/src/ooxml/java/org/apache/poi/xssf/usermodel/XSSFName.java>:165: error: unexpected end tag: </p>
  [javadoc]     * </p>
  [javadoc]       ^
  [javadoc] <https://builds.apache.org/job/POI-DSL-OpenJDK/ws/src/ooxml/java/org/apache/poi/xssf/usermodel/XSSFName.java>:36: error: tag not allowed here: <blockquote>
  [javadoc]  * <pre><blockquote>
  [javadoc]         ^
  [javadoc] <https://builds.apache.org/job/POI-DSL-OpenJDK/ws/src/ooxml/java/org/apache/poi/xssf/usermodel/XSSFName.java>:86: error: tag not allowed here: <li>
  [javadoc]      * <li> this defined name refers to a range to which an advanced filter has been
  [javadoc]        ^
  [javadoc] <https://builds.apache.org/job/POI-DSL-OpenJDK/ws/src/ooxml/java/org/apache/poi/xssf/usermodel/XSSFName.java>:88: error: tag not allowed here: <li>
  [javadoc]      * <li> This defined name refers to a range to which an AutoFilter has been
  [javadoc]        ^
  [javadoc] <https://builds.apache.org/job/POI-DSL-OpenJDK/ws/src/ooxml/java/org/apache/poi/xssf/usermodel/XSSFRichTextString.java>:442: error: bad use of '>'
  [javadoc]      * CTRPrElt --> CTFont adapter
  [javadoc]                   ^
  [javadoc] <https://builds.apache.org/job/POI-DSL-OpenJDK/ws/src/ooxml/java/org/apache/poi/xssf/usermodel/XSSFRow.java>:108: error: unknown tag: Cell
  [javadoc]      * for (Iterator<Cell> it = row.cellIterator(); it.hasNext(); ) {
  [javadoc]                     ^
  [javadoc] <https://builds.apache.org/job/POI-DSL-OpenJDK/ws/src/ooxml/java/org/apache/poi/xssf/usermodel/XSSFRow.java>:195: error: malformed HTML
  [javadoc]      * @throws IllegalArgumentException if columnIndex < 0 or greater than 16384,
  [javadoc]                                                        ^
  [javadoc] <https://builds.apache.org/job/POI-DSL-OpenJDK/ws/src/ooxml/java/org/apache/poi/xssf/usermodel/XSSFRow.java>:209: error: malformed HTML
  [javadoc]      * @throws IllegalArgumentException if the specified cell type is invalid, columnIndex < 0
  [javadoc]                                                                                            ^
  [javadoc] <https://builds.apache.org/job/POI-DSL-OpenJDK/ws/src/ooxml/java/org/apache/poi/xssf/usermodel/XSSFRow.java>:417: error: malformed HTML
  [javadoc]      * @throws IllegalArgumentException if rowNum < 0 or greater than 1048575
  [javadoc]                                                   ^
  [javadoc] <https://builds.apache.org/job/POI-DSL-OpenJDK/ws/src/ooxml/java/org/apache/poi/xssf/usermodel/XSSFSheetConditionalFormatting.java>:70: error: unexpected end tag: </p>
  [javadoc]      * </p>
  [javadoc]        ^
  [javadoc] <https://builds.apache.org/job/POI-DSL-OpenJDK/ws/src/ooxml/java/org/apache/poi/xssf/usermodel/XSSFWorkbook.java>:832: error: unexpected end tag: </p>
  [javadoc]      * </p>
  [javadoc]        ^
  [javadoc] <https://builds.apache.org/job/POI-DSL-OpenJDK/ws/src/ooxml/java/org/apache/poi/xssf/usermodel/XSSFWorkbook.java>:849: error: unexpected end tag: </p>
  [javadoc]      * </p>
  [javadoc]        ^
  [javadoc] <https://builds.apache.org/job/POI-DSL-OpenJDK/ws/src/ooxml/java/org/apache/poi/xssf/usermodel/extensions/XSSFHeaderFooter.java>:40: error: semicolon missing
  [javadoc]  * section), and the date on the second line (center section). &CCenter
  [javadoc]                                                                ^
  [javadoc] <https://builds.apache.org/job/POI-DSL-OpenJDK/ws/src/ooxml/java/org/apache/poi/xssf/usermodel/extensions/XSSFHeaderFooter.java>:41: error: bad HTML entity
  [javadoc]  * &"-,Bold"Bold &"-,Regular"Header_x000A_&D
  [javadoc]    ^
  [javadoc] <https://builds.apache.org/job/POI-DSL-OpenJDK/ws/src/ooxml/java/org/apache/poi/xssf/usermodel/extensions/XSSFHeaderFooter.java>:41: error: bad HTML entity
  [javadoc]  * &"-,Bold"Bold &"-,Regular"Header_x000A_&D
  [javadoc]                  ^
  [javadoc] <https://builds.apache.org/job/POI-DSL-OpenJDK/ws/src/ooxml/java/org/apache/poi/xssf/usermodel/extensions/XSSFHeaderFooter.java>:41: error: semicolon missing
  [javadoc]  * &"-,Bold"Bold &"-,Regular"Header_x000A_&D
  [javadoc]                                           ^
  [javadoc] <https://builds.apache.org/job/POI-DSL-OpenJDK/ws/src/ooxml/java/org/apache/poi/xssf/usermodel/extensions/XSSFHeaderFooter.java>:48: error: semicolon missing
  [javadoc]  * <dt>&L</dt>
  [javadoc]        ^
  [javadoc] <https://builds.apache.org/job/POI-DSL-OpenJDK/ws/src/ooxml/java/org/apache/poi/xssf/usermodel/extensions/XSSFHeaderFooter.java>:53: error: semicolon missing
  [javadoc]  * <dt>&P</dt>
  [javadoc]        ^
  [javadoc] <https://builds.apache.org/job/POI-DSL-OpenJDK/ws/src/ooxml/java/org/apache/poi/xssf/usermodel/extensions/XSSFHeaderFooter.java>:55: error: semicolon missing
  [javadoc]  * <dt>&N</dt>
  [javadoc]        ^
  [javadoc] <https://builds.apache.org/job/POI-DSL-OpenJDK/ws/src/ooxml/java/org/apache/poi/xssf/usermodel/extensions/XSSFHeaderFooter.java>:57: error: semicolon missing
  [javadoc]  * <dt>&font size</dt>
  [javadoc]        ^
  [javadoc] <https://builds.apache.org/job/POI-DSL-OpenJDK/ws/src/ooxml/java/org/apache/poi/xssf/usermodel/extensions/XSSFHeaderFooter.java>:59: error: semicolon missing
  [javadoc]  * <dt>&K</dt>
  [javadoc]        ^
  [javadoc] <https://builds.apache.org/job/POI-DSL-OpenJDK/ws/src/ooxml/java/org/apache/poi/xssf/usermodel/extensions/XSSFHeaderFooter.java>:63: error: semicolon missing
  [javadoc]  * <dt>&S</dt>
  [javadoc]        ^
  [javadoc] <https://builds.apache.org/job/POI-DSL-OpenJDK/ws/src/ooxml/java/org/apache/poi/xssf/usermodel/extensions/XSSFHeaderFooter.java>:65: error: semicolon missing
  [javadoc]  * <dt>&X</dt>
  [javadoc]        ^
  [javadoc] <https://builds.apache.org/job/POI-DSL-OpenJDK/ws/src/ooxml/java/org/apache/poi/xssf/usermodel/extensions/XSSFHeaderFooter.java>:67: error: semicolon missing
  [javadoc]  * <dt>&Y</dt>
  [javadoc]        ^
  [javadoc] <https://builds.apache.org/job/POI-DSL-OpenJDK/ws/src/ooxml/java/org/apache/poi/xssf/usermodel/extensions/XSSFHeaderFooter.java>:69: error: semicolon missing
  [javadoc]  * <dt>&C</dt>
  [javadoc]        ^
  [javadoc] <https://builds.apache.org/job/POI-DSL-OpenJDK/ws/src/ooxml/java/org/apache/poi/xssf/usermodel/extensions/XSSFHeaderFooter.java>:74: error: semicolon missing
  [javadoc]  * <dt>&D</dt>
  [javadoc]        ^
  [javadoc] <https://builds.apache.org/job/POI-DSL-OpenJDK/ws/src/ooxml/java/org/apache/poi/xssf/usermodel/extensions/XSSFHeaderFooter.java>:76: error: semicolon missing
  [javadoc]  * <dt>&T</dt>
  [javadoc]        ^
  [javadoc] <https://builds.apache.org/job/POI-DSL-OpenJDK/ws/src/ooxml/java/org/apache/poi/xssf/usermodel/extensions/XSSFHeaderFooter.java>:78: error: semicolon missing
  [javadoc]  * <dt>&G</dt>
  [javadoc]        ^
  [javadoc] <https://builds.apache.org/job/POI-DSL-OpenJDK/ws/src/ooxml/java/org/apache/poi/xssf/usermodel/extensions/XSSFHeaderFooter.java>:80: error: semicolon missing
  [javadoc]  * <dt>&U</dt>
  [javadoc]        ^
  [javadoc] <https://builds.apache.org/job/POI-DSL-OpenJDK/ws/src/ooxml/java/org/apache/poi/xssf/usermodel/extensions/XSSFHeaderFooter.java>:82: error: semicolon missing
  [javadoc]  * <dt>&E</dt>
  [javadoc]        ^
  [javadoc] <https://builds.apache.org/job/POI-DSL-OpenJDK/ws/src/ooxml/java/org/apache/poi/xssf/usermodel/extensions/XSSFHeaderFooter.java>:84: error: semicolon missing
  [javadoc]  * <dt>&R</dt>
  [javadoc]        ^
  [javadoc] <https://builds.apache.org/job/POI-DSL-OpenJDK/ws/src/ooxml/java/org/apache/poi/xssf/usermodel/extensions/XSSFHeaderFooter.java>:88: error: semicolon missing
  [javadoc]  * <dt>&Z</dt>
  [javadoc]        ^
  [javadoc] <https://builds.apache.org/job/POI-DSL-OpenJDK/ws/src/ooxml/java/org/apache/poi/xssf/usermodel/extensions/XSSFHeaderFooter.java>:90: error: semicolon missing
  [javadoc]  * <dt>&F</dt>
  [javadoc]        ^
  [javadoc] 100 errors
  [javadoc] 100 warnings
      [jar] Building jar: <https://builds.apache.org/job/POI-DSL-OpenJDK/ws/build/dist/maven/poi-ooxml/poi-ooxml-5.0.0-SNAPSHOT-javadoc.jar>

assemble:
      [zip] Building zip: <https://builds.apache.org/job/POI-DSL-OpenJDK/ws/build/dist/poi-bin-5.0.0-SNAPSHOT-20200723.zip>
      [tar] Building tar: <https://builds.apache.org/job/POI-DSL-OpenJDK/84/artifact/build/dist/poi-bin-5.0.0-SNAPSHOT-20200723.tar.gz>
      [zip] Building zip: <https://builds.apache.org/job/POI-DSL-OpenJDK/ws/build/dist/poi-src-5.0.0-SNAPSHOT-20200723.zip>
      [tar] Building tar: <https://builds.apache.org/job/POI-DSL-OpenJDK/84/artifact/build/dist/poi-src-5.0.0-SNAPSHOT-20200723.tar.gz>
     [echo] Creating Maven POMs

maven-poms:
     [copy] Copying 6 files to <https://builds.apache.org/job/POI-DSL-OpenJDK/ws/build/dist/maven>
     [echo] Maven POMs are located in <https://builds.apache.org/job/POI-DSL-OpenJDK/ws/build/dist>
     [echo] Use ant dist-nexus to deploy the artifacts in the remote repository
     [echo] Distribution located in <https://builds.apache.org/job/POI-DSL-OpenJDK/ws/build/dist>
     [echo] Use "ant dist-checksum" to create sha256/sha512 checksums and GPG signatures

findbugs:
    [mkdir] Created dir: <https://builds.apache.org/job/POI-DSL-OpenJDK/ws/build/findbugs/lib/config>
      [get] Getting: https://repo1.maven.org/maven2/com/github/spotbugs/spotbugs/4.0.2/spotbugs-4.0.2.jar
      [get] To: <https://builds.apache.org/job/POI-DSL-OpenJDK/ws/build/findbugs/lib/spotbugs.jar>
      [get] Getting: https://repo1.maven.org/maven2/com/github/spotbugs/spotbugs-ant/4.0.2/spotbugs-ant-4.0.2.jar
      [get] To: <https://builds.apache.org/job/POI-DSL-OpenJDK/ws/build/findbugs/lib/spotbugs-ant.jar>
      [get] Getting: https://repo1.maven.org/maven2/com/github/spotbugs/spotbugs-annotations/4.0.2/spotbugs-annotations-4.0.2.jar
      [get] To: <https://builds.apache.org/job/POI-DSL-OpenJDK/ws/build/findbugs/lib/spotbugs-annotations.jar>
      [get] Getting: https://repo1.maven.org/maven2/org/dom4j/dom4j/2.1.1/dom4j-2.1.1.jar
      [get] To: <https://builds.apache.org/job/POI-DSL-OpenJDK/ws/build/findbugs/lib/dom4j-2.1.1.jar>
      [get] Getting: https://repo1.maven.org/maven2/jaxen/jaxen/1.1.6/jaxen-1.1.6.jar
      [get] To: <https://builds.apache.org/job/POI-DSL-OpenJDK/ws/build/findbugs/lib/jaxen-1.1.6.jar>
      [get] Getting: https://repo1.maven.org/maven2/org/apache/bcel/bcel/6.4.1/bcel-6.4.1.jar
      [get] To: <https://builds.apache.org/job/POI-DSL-OpenJDK/ws/build/findbugs/lib/bcel-6.4.1.jar>
      [get] Getting: https://repo1.maven.org/maven2/org/slf4j/slf4j-api/1.8.0-beta4/slf4j-api-1.8.0-beta4.jar
      [get] To: <https://builds.apache.org/job/POI-DSL-OpenJDK/ws/build/findbugs/lib/slf4j-api-1.8.0-beta4.jar>
      [get] Getting: https://repo1.maven.org/maven2/org/apache/commons/commons-lang3/3.10/commons-lang3-3.10.jar
      [get] To: <https://builds.apache.org/job/POI-DSL-OpenJDK/ws/build/findbugs/lib/commons-lang3-3.10.jar>
      [get] Getting: https://repo1.maven.org/maven2/org/apache/commons/commons-text/1.8/commons-text-1.8.jar
      [get] To: <https://builds.apache.org/job/POI-DSL-OpenJDK/ws/build/findbugs/lib/commons-text-1.8.jar>
      [get] Getting: https://repo1.maven.org/maven2/net/jcip/jcip-annotations/1.0/jcip-annotations-1.0.jar
      [get] To: <https://builds.apache.org/job/POI-DSL-OpenJDK/ws/build/findbugs/lib/jcip-annotations-1.0.jar>
      [get] Getting: https://repo1.maven.org/maven2/com/google/code/findbugs/jsr305/3.0.2/jsr305-3.0.2.jar
      [get] To: <https://builds.apache.org/job/POI-DSL-OpenJDK/ws/build/findbugs/lib/jsr305-3.0.2.jar>
      [get] Getting: https://repo1.maven.org/maven2/org/ow2/asm/asm/8.0.1/asm-8.0.1.jar
      [get] To: <https://builds.apache.org/job/POI-DSL-OpenJDK/ws/build/findbugs/lib/asm-8.0.1.jar>
      [get] Getting: https://repo1.maven.org/maven2/org/ow2/asm/asm-analysis/8.0.1/asm-analysis-8.0.1.jar
      [get] To: <https://builds.apache.org/job/POI-DSL-OpenJDK/ws/build/findbugs/lib/asm-analysis-8.0.1.jar>
      [get] Getting: https://repo1.maven.org/maven2/org/ow2/asm/asm-commons/8.0.1/asm-commons-8.0.1.jar
      [get] To: <https://builds.apache.org/job/POI-DSL-OpenJDK/ws/build/findbugs/lib/asm-commons-8.0.1.jar>
      [get] Getting: https://repo1.maven.org/maven2/org/ow2/asm/asm-tree/8.0.1/asm-tree-8.0.1.jar
      [get] To: <https://builds.apache.org/job/POI-DSL-OpenJDK/ws/build/findbugs/lib/asm-tree-8.0.1.jar>
      [get] Getting: https://repo1.maven.org/maven2/org/ow2/asm/asm-util/8.0.1/asm-util-8.0.1.jar
      [get] To: <https://builds.apache.org/job/POI-DSL-OpenJDK/ws/build/findbugs/lib/asm-util-8.0.1.jar>
      [get] Getting: https://repo1.maven.org/maven2/org/apache/logging/log4j/log4j-api/2.13.1/log4j-api-2.13.1.jar
      [get] To: <https://builds.apache.org/job/POI-DSL-OpenJDK/ws/build/findbugs/lib/log4j-api-2.13.1.jar>
      [get] Getting: https://repo1.maven.org/maven2/org/apache/logging/log4j/log4j-core/2.13.1/log4j-core-2.13.1.jar
      [get] To: <https://builds.apache.org/job/POI-DSL-OpenJDK/ws/build/findbugs/lib/log4j-core-2.13.1.jar>
      [get] Getting: https://repo1.maven.org/maven2/org/apache/logging/log4j/log4j-slf4j18-impl/2.13.1/log4j-slf4j18-impl-2.13.1.jar
      [get] To: <https://builds.apache.org/job/POI-DSL-OpenJDK/ws/build/findbugs/lib/log4j-slf4j18-impl-2.13.1.jar>
      [get] Getting: https://repo1.maven.org/maven2/net/sf/saxon/Saxon-HE/9.9.1-2/Saxon-HE-9.9.1-2.jar
      [get] To: <https://builds.apache.org/job/POI-DSL-OpenJDK/ws/build/findbugs/lib/Saxon-HE-9.9.1-2.jar>
      [get] Getting: https://repo1.maven.org/maven2/com/ibm/icu/icu4j/63.2/icu4j-63.2.jar
      [get] To: <https://builds.apache.org/job/POI-DSL-OpenJDK/ws/build/findbugs/lib/icu4j-63.1.jar>
 [spotbugs] Executing SpotBugs FindBugsTask from ant task
 [spotbugs] Running SpotBugs...
 [spotbugs] Java Result: 1
 [spotbugs] Output saved to build/findbugs.xml
     [xslt] Transforming into <https://builds.apache.org/job/POI-DSL-OpenJDK/ws/build>
     [xslt] Processing <https://builds.apache.org/job/POI-DSL-OpenJDK/ws/build/findbugs.xml> to <https://builds.apache.org/job/POI-DSL-OpenJDK/84/artifact/build/findbugs.html>
     [xslt] Loading stylesheet jar:<https://builds.apache.org/job/POI-DSL-OpenJDK/ws/build/findbugs/lib/spotbugs.jar!/fancy.xsl>

release-notes:
     [copy] Copying 1 file to <https://builds.apache.org/job/POI-DSL-OpenJDK/ws/build/dist>

rat-check:
    [mkdir] Created dir: <https://builds.apache.org/job/POI-DSL-OpenJDK/ws/build/rat>
     [echo]
     [echo] *****************************************************
     [echo] Summary
     [echo] -------
     [echo] Generated at: 2020-07-23T13:15:04+00:00
     [echo]
     [echo] Notes: 0
     [echo] Binaries: 114
     [echo] Archives: 0
     [echo] Standards: 3763
     [echo]
     [echo] Apache Licensed: 3763
     [echo] Generated Documents: 0
     [echo]
     [echo] JavaDocs are generated, thus a license header is optional.
     [echo] Generated files do not require license headers.
     [echo]
     [echo] 0 Unknown Licenses
     [echo]
     [echo] *****************************************************
     [echo]   Files with Apache License headers will be marked AL
     [echo]   Binary files (which do not require any license headers) will be marked B
     [echo]   Compressed archives will be marked A
     [echo]   Notices, licenses etc. will be marked N
     [echo]  
     [echo] *****************************************************

forbidden-apis-check:
[forbiddenapis] Reading bundled API signatures: jdk-unsafe-1.8
[forbiddenapis] Reading bundled API signatures: jdk-deprecated-1.8
[forbiddenapis] Reading bundled API signatures: jdk-internal-1.8
[forbiddenapis] Reading bundled API signatures: jdk-non-portable
[forbiddenapis] Reading bundled API signatures: jdk-reflection
[forbiddenapis] Reading API signatures: <https://builds.apache.org/job/POI-DSL-OpenJDK/ws/src/resources/devtools/forbidden-signatures.txt>
[forbiddenapis] Loading classes to check...
[forbiddenapis] Scanning classes for violations...
[forbiddenapis] Scanned 4432 class file(s) for forbidden API invocations (in 107.48s), 0 error(s).
[forbiddenapis] Reading API signatures: <https://builds.apache.org/job/POI-DSL-OpenJDK/ws/src/resources/devtools/forbidden-signatures-prod.txt>
[forbiddenapis] Loading classes to check...
[forbiddenapis] Scanning classes for violations...
[forbiddenapis] Scanned 3514 class file(s) for forbidden API invocations (in 56.03s), 0 error(s).

integration-test-jar:

BUILD FAILED
<https://builds.apache.org/job/POI-DSL-OpenJDK/ws/build.xml>:1969: required attribute module not set

Total time: 36 minutes 29 seconds
Build step 'Invoke Ant' marked build as failure
Skipping publisher since build result is FAILURE
Archiving artifacts
[Fast Archiver] Compressed 219.29 MB of artifacts by 26.3% relative to #81
Skipping publisher since build result is FAILURE
Recording test results

---------------------------------------------------------------------
To unsubscribe, e-mail: [hidden email]
For additional commands, e-mail: [hidden email]

Reply | Threaded
Open this post in threaded view
|

Build failed in Jenkins: POI-DSL-OpenJDK #85

Apache Jenkins Server
See <https://builds.apache.org/job/POI-DSL-OpenJDK/85/display/redirect?page=changes>

Changes:

[kiwiwings] remove obsolete bouncycastle jars

[kiwiwings] a few jigsaw related fixes


------------------------------------------
[...truncated 711.62 KB...]
    [junit] Reading spreadsheet/multibookFormulaA.xls with HSSFFileHandler
    [junit] Reading spreadsheet/multibookFormulaA.xls with HPSFFileHandler
    [junit] Reading spreadsheet/multibookFormulaB.xls with HSSFFileHandler
    [junit] Reading spreadsheet/multibookFormulaB.xls with HPSFFileHandler
    [junit] Reading spreadsheet/mv-calculator-final-2-20-2013.xlsm with XSSFFileHandler
    [junit] Reading spreadsheet/mv-calculator-final-2-20-2013.xlsm with OPCFileHandler
    [junit] Reading spreadsheet/named-cell-in-formula-test.xls with HSSFFileHandler
    [junit] Reading spreadsheet/named-cell-in-formula-test.xls with HPSFFileHandler
    [junit] Reading spreadsheet/named-cell-test.xls with HSSFFileHandler
    [junit] Reading spreadsheet/named-cell-test.xls with HPSFFileHandler
    [junit] Reading spreadsheet/namedinput.xls with HSSFFileHandler
    [junit] Reading spreadsheet/namedinput.xls with HPSFFileHandler
    [junit] Reading spreadsheet/noHeaderFooter47244.xls with HSSFFileHandler
    [junit] Reading spreadsheet/noHeaderFooter47244.xls with HPSFFileHandler
    [junit] Reading spreadsheet/noSharedStringTable.xlsx with XSSFFileHandler
    [junit] Reading spreadsheet/noSharedStringTable.xlsx with OPCFileHandler
    [junit] Reading spreadsheet/ole2-embedding.xls with HSSFFileHandler
    [junit] Reading spreadsheet/ole2-embedding.xls with HPSFFileHandler
    [junit] Reading spreadsheet/overlapSharedFormula.xls with HSSFFileHandler
    [junit] Reading spreadsheet/overlapSharedFormula.xls with HPSFFileHandler
    [junit] Reading spreadsheet/password.xls with HSSFFileHandler
    [junit] Reading spreadsheet/password.xls with HPSFFileHandler
    [junit] Reading spreadsheet/picture.xlsx with XSSFFileHandler
    [junit] Reading spreadsheet/picture.xlsx with OPCFileHandler
    [junit] Reading spreadsheet/poc-shared-strings.xlsx with XSSFFileHandler
    [junit] Reading spreadsheet/poc-shared-strings.xlsx with OPCFileHandler
    [junit] Reading spreadsheet/poc-xmlbomb-empty.xlsx with XSSFFileHandler
    [junit] Reading spreadsheet/poc-xmlbomb-empty.xlsx with OPCFileHandler
    [junit] Reading spreadsheet/poc-xmlbomb.xlsx with XSSFFileHandler
    [junit] Reading spreadsheet/poc-xmlbomb.xlsx with OPCFileHandler
    [junit] Reading spreadsheet/protected_passtika.xlsb with XSSFBFileHandler
    [junit] Reading spreadsheet/protected_passtika.xlsx with XSSFFileHandler
    [junit] Reading spreadsheet/protected_passtika.xlsx with OPCFileHandler
    [junit] Reading spreadsheet/rank.xls with HSSFFileHandler
    [junit] Reading spreadsheet/rank.xls with HPSFFileHandler
    [junit] Reading spreadsheet/ref-56737.xlsx with XSSFFileHandler
    [junit] Reading spreadsheet/ref-56737.xlsx with OPCFileHandler
    [junit] Reading spreadsheet/ref2-56737.xlsx with XSSFFileHandler
    [junit] Reading spreadsheet/ref2-56737.xlsx with OPCFileHandler
    [junit] Reading spreadsheet/reordered_sheets.xlsx with XSSFFileHandler
    [junit] Reading spreadsheet/reordered_sheets.xlsx with OPCFileHandler
    [junit] Reading spreadsheet/resize_compare.xls with HSSFFileHandler
    [junit] Reading spreadsheet/resize_compare.xls with HPSFFileHandler
    [junit] Reading spreadsheet/resize_compare.xlsx with XSSFFileHandler
    [junit] Reading spreadsheet/resize_compare.xlsx with OPCFileHandler
    [junit] Reading spreadsheet/richtextdata.txt with NullFileHandler
    [junit] Reading spreadsheet/rk.xls with HSSFFileHandler
    [junit] Reading spreadsheet/rk.xls with HPSFFileHandler
    [junit] Reading spreadsheet/sample-beta.xlsx with XSSFFileHandler
    [junit] Reading spreadsheet/sample-beta.xlsx with OPCFileHandler
    [junit] Reading spreadsheet/sample.strict.xlsx with XSSFFileHandler
    [junit] Reading spreadsheet/sample.strict.xlsx with OPCFileHandler
    [junit] Reading spreadsheet/sample.xlsb with XSSFBFileHandler
    [junit] Reading spreadsheet/sample.xlsx with XSSFFileHandler
    [junit] Reading spreadsheet/sample.xlsx with OPCFileHandler
    [junit] Reading spreadsheet/shared_formulas.xls with HSSFFileHandler
    [junit] Reading spreadsheet/shared_formulas.xls with HPSFFileHandler
    [junit] Reading spreadsheet/shared_formulas.xlsx with XSSFFileHandler
    [junit] Reading spreadsheet/shared_formulas.xlsx with OPCFileHandler
    [junit] Reading spreadsheet/sheetProtection_allLocked.xlsx with XSSFFileHandler
    [junit] Reading spreadsheet/sheetProtection_allLocked.xlsx with OPCFileHandler
    [junit] Reading spreadsheet/sheetProtection_not_protected.xlsx with XSSFFileHandler
    [junit] Reading spreadsheet/sheetProtection_not_protected.xlsx with OPCFileHandler
    [junit] Reading spreadsheet/simple-monthly-budget.xlsx with XSSFFileHandler
    [junit] Reading spreadsheet/simple-monthly-budget.xlsx with OPCFileHandler
    [junit] Reading spreadsheet/simple-table-named-range.xlsx with XSSFFileHandler
    [junit] Reading spreadsheet/simple-table-named-range.xlsx with OPCFileHandler
    [junit] Reading spreadsheet/stringacross2continuations.txt with NullFileHandler
    [junit] Reading spreadsheet/style-alternate-content.xlsx with XSSFFileHandler
    [junit] Reading spreadsheet/style-alternate-content.xlsx with OPCFileHandler
    [junit] Reading spreadsheet/styles.xlsx with XSSFFileHandler
    [junit] Reading spreadsheet/styles.xlsx with OPCFileHandler
    [junit] Reading spreadsheet/sumifformula.xls with HSSFFileHandler
    [junit] Reading spreadsheet/sumifformula.xls with HPSFFileHandler
    [junit] Reading spreadsheet/sumifs.xls with HSSFFileHandler
    [junit] Reading spreadsheet/sumifs.xls with HPSFFileHandler
    [junit] Reading spreadsheet/tableStyle.xlsx with XSSFFileHandler
    [junit] Reading spreadsheet/tableStyle.xlsx with OPCFileHandler
    [junit] Reading spreadsheet/template.xlsx with XSSFFileHandler
    [junit] Reading spreadsheet/template.xlsx with OPCFileHandler
    [junit] Reading spreadsheet/templateExcelWithAutofilter.xls with HSSFFileHandler
    [junit] Reading spreadsheet/templateExcelWithAutofilter.xls with HPSFFileHandler
    [junit] Reading spreadsheet/test.xltx with XSSFFileHandler
    [junit] Reading spreadsheet/test.xltx with OPCFileHandler
    [junit] Reading spreadsheet/testArraysAndTables.xls with HSSFFileHandler
    [junit] Reading spreadsheet/testArraysAndTables.xls with HPSFFileHandler
    [junit] Reading spreadsheet/testEXCEL_3.xls with HSSFFileHandler
    [junit] Reading spreadsheet/testEXCEL_3.xls with HPSFFileHandler
    [junit] Reading spreadsheet/testEXCEL_4.xls with HSSFFileHandler
    [junit] Reading spreadsheet/testEXCEL_4.xls with HPSFFileHandler
    [junit] Reading spreadsheet/testEXCEL_5.xls with HSSFFileHandler
    [junit] Reading spreadsheet/testEXCEL_5.xls with HPSFFileHandler
    [junit] Reading spreadsheet/testEXCEL_95.xls with HSSFFileHandler
    [junit] Reading spreadsheet/testEXCEL_95.xls with HPSFFileHandler
    [junit] Reading spreadsheet/testNames.xls with HSSFFileHandler
    [junit] Reading spreadsheet/testNames.xls with HPSFFileHandler
    [junit] Reading spreadsheet/testNames.xlsm with XSSFFileHandler
    [junit] Reading spreadsheet/testNames.xlsm with OPCFileHandler
    [junit] Reading spreadsheet/testRRaC.xls with HSSFFileHandler
    [junit] Reading spreadsheet/testRRaC.xls with HPSFFileHandler
    [junit] Reading spreadsheet/testRVA.xls with HSSFFileHandler
    [junit] Reading spreadsheet/testRVA.xls with HPSFFileHandler
    [junit] Reading spreadsheet/testVarious.xlsb with XSSFBFileHandler
    [junit] Reading spreadsheet/test_conditional_formatting.xlsx with XSSFFileHandler
    [junit] Reading spreadsheet/test_conditional_formatting.xlsx with OPCFileHandler
    [junit] Reading spreadsheet/test_properties1 with NullFileHandler
    [junit] Reading spreadsheet/text.xls with HSSFFileHandler
    [junit] Reading spreadsheet/text.xls with HPSFFileHandler
    [junit] Reading spreadsheet/tile-range-test.xls with HSSFFileHandler
    [junit] Reading spreadsheet/tile-range-test.xls with HPSFFileHandler
    [junit] Reading spreadsheet/tile-range-test.xlsx with XSSFFileHandler
    [junit] Reading spreadsheet/tile-range-test.xlsx with OPCFileHandler
    [junit] Reading spreadsheet/unicodeNameRecord.xls with HSSFFileHandler
    [junit] Reading spreadsheet/unicodeNameRecord.xls with HPSFFileHandler
    [junit] Reading spreadsheet/unicodeSheetName.xlsx with XSSFFileHandler
    [junit] Reading spreadsheet/unicodeSheetName.xlsx with OPCFileHandler
    [junit] Reading spreadsheet/vmlDrawing1.vml with NullFileHandler
    [junit] Reading spreadsheet/workbookProtection-sheet_password-2013.xlsx with XSSFFileHandler
    [junit] Reading spreadsheet/workbookProtection-sheet_password-2013.xlsx with OPCFileHandler
    [junit] Reading spreadsheet/workbookProtection-workbook_password-2013.xlsx with XSSFFileHandler
    [junit] Reading spreadsheet/workbookProtection-workbook_password-2013.xlsx with OPCFileHandler
    [junit] Reading spreadsheet/workbookProtection-workbook_password_user_range-2010.xlsx with XSSFFileHandler
    [junit] Reading spreadsheet/workbookProtection-workbook_password_user_range-2010.xlsx with OPCFileHandler
    [junit] Reading spreadsheet/workbookProtection_not_protected.xlsx with XSSFFileHandler
    [junit] Reading spreadsheet/workbookProtection_not_protected.xlsx with OPCFileHandler
    [junit] Reading spreadsheet/workbookProtection_workbook_revision_protected.xlsx with XSSFFileHandler
    [junit] Reading spreadsheet/workbookProtection_workbook_revision_protected.xlsx with OPCFileHandler
    [junit] Reading spreadsheet/workbookProtection_workbook_structure_protected.xlsx with XSSFFileHandler
    [junit] Reading spreadsheet/workbookProtection_workbook_structure_protected.xlsx with OPCFileHandler
    [junit] Reading spreadsheet/workbookProtection_workbook_windows_protected.xlsx with XSSFFileHandler
    [junit] Reading spreadsheet/workbookProtection_workbook_windows_protected.xlsx with OPCFileHandler
    [junit] Reading spreadsheet/workbookProtection_worksheet_protected.xlsx with XSSFFileHandler
    [junit] Reading spreadsheet/workbookProtection_worksheet_protected.xlsx with OPCFileHandler
    [junit] Reading spreadsheet/xlsx-corrupted.xlsx with XSSFFileHandler
    [junit] Reading spreadsheet/xlsx-corrupted.xlsx with OPCFileHandler
    [junit] Reading spreadsheet/xlsx-jdbc.xlsx with XSSFFileHandler
    [junit] Reading spreadsheet/xlsx-jdbc.xlsx with OPCFileHandler
    [junit] Reading spreadsheet/xor-encryption-abc.xls with HSSFFileHandler
    [junit] Reading spreadsheet/xor-encryption-abc.xls with HPSFFileHandler
    [junit] Reading spreadsheet/xxe_in_schema.xlsx with XSSFFileHandler
    [junit] Reading spreadsheet/xxe_in_schema.xlsx with OPCFileHandler
    [junit] Reading spreadsheet/yearfracExamples.xls with HSSFFileHandler
    [junit] Reading spreadsheet/yearfracExamples.xls with HPSFFileHandler
    [junit] Reading xmldsign/Office2010-SP1-XAdES-X-L.docx with XWPFFileHandler
    [junit] Reading xmldsign/Office2010-SP1-XAdES-X-L.docx with OPCFileHandler
    [junit] Reading xmldsign/PPT2016withComment.pptx with XSLFFileHandler
    [junit] Reading xmldsign/PPT2016withComment.pptx with OPCFileHandler
    [junit] Reading xmldsign/bug58630.xlsx with XSSFFileHandler
    [junit] Reading xmldsign/bug58630.xlsx with OPCFileHandler
    [junit] Reading xmldsign/bug63011_key1.pem with NullFileHandler
    [junit] Reading xmldsign/bug63011_key2.pem with NullFileHandler
    [junit] Reading xmldsign/chaintest.pfx with NullFileHandler
    [junit] Reading xmldsign/hello-world-office-2010-technical-preview-unsigned.docx with XWPFFileHandler
    [junit] Reading xmldsign/hello-world-office-2010-technical-preview-unsigned.docx with OPCFileHandler
    [junit] Reading xmldsign/hello-world-office-2010-technical-preview.docx with XWPFFileHandler
    [junit] Reading xmldsign/hello-world-office-2010-technical-preview.docx with OPCFileHandler
    [junit] Reading xmldsign/hello-world-signed-twice.docx with XWPFFileHandler
    [junit] Reading xmldsign/hello-world-signed-twice.docx with OPCFileHandler
    [junit] Reading xmldsign/hello-world-signed.docx with XWPFFileHandler
    [junit] Reading xmldsign/hello-world-signed.docx with OPCFileHandler
    [junit] Reading xmldsign/hello-world-signed.pptx with XSLFFileHandler
    [junit] Reading xmldsign/hello-world-signed.pptx with OPCFileHandler
    [junit] Reading xmldsign/hello-world-signed.xlsx with XSSFFileHandler
    [junit] Reading xmldsign/hello-world-signed.xlsx with OPCFileHandler
    [junit] Reading xmldsign/hello-world-unsigned.docx with XWPFFileHandler
    [junit] Reading xmldsign/hello-world-unsigned.docx with OPCFileHandler
    [junit] Reading xmldsign/hello-world-unsigned.pptx with XSLFFileHandler
    [junit] Reading xmldsign/hello-world-unsigned.pptx with OPCFileHandler
    [junit] Reading xmldsign/hello-world-unsigned.xlsx with XSSFFileHandler
    [junit] Reading xmldsign/hello-world-unsigned.xlsx with OPCFileHandler
    [junit] Reading xmldsign/hyperlink-example-signed.docx with XWPFFileHandler
    [junit] Reading xmldsign/hyperlink-example-signed.docx with OPCFileHandler
    [junit] Reading xmldsign/ms-office-2010-signed.docx with XWPFFileHandler
    [junit] Reading xmldsign/ms-office-2010-signed.docx with OPCFileHandler
    [junit] Reading xmldsign/ms-office-2010-signed.pptx with XSLFFileHandler
    [junit] Reading xmldsign/ms-office-2010-signed.pptx with OPCFileHandler
    [junit] Reading xmldsign/ms-office-2010-signed.xlsx with XSSFFileHandler
    [junit] Reading xmldsign/ms-office-2010-signed.xlsx with OPCFileHandler
    [junit] Reading xmldsign/office2007prettyPrintedRels.docx with XWPFFileHandler
    [junit] Reading xmldsign/office2007prettyPrintedRels.docx with OPCFileHandler
    [junit] Reading xmldsign/signed.docx with XWPFFileHandler
    [junit] Reading xmldsign/signed.docx with OPCFileHandler
    [junit] Tests run: 2563, Failures: 0, Errors: 0, Skipped: 0, Time elapsed: 750.425 sec

-test-integration-write-testfile:

test-ooxml-lite:
   [delete] Deleting: <https://builds.apache.org/job/POI-DSL-OpenJDK/ws/build/ooxml-testokfile.txt>
     [echo] Running ooxml tests against 'poi-ooxml-schemas'
[jacoco:coverage] Enhancing junit with coverage
    [junit] Running org.apache.poi.extractor.ooxml.TestExtractorFactory
    [junit] Tests run: 14, Failures: 0, Errors: 0, Skipped: 0, Time elapsed: 4.961 sec
    [junit] Running org.apache.poi.ooxml.TestDetectAsOOXML
    [junit] Tests run: 3, Failures: 0, Errors: 0, Skipped: 0, Time elapsed: 0.023 sec
    [junit] Running org.apache.poi.ooxml.TestEmbedded
    [junit] Tests run: 3, Failures: 0, Errors: 0, Skipped: 0, Time elapsed: 0.428 sec
    [junit] Running org.apache.poi.ooxml.TestPOIXMLDocument
    [junit] Tests run: 11, Failures: 0, Errors: 0, Skipped: 0, Time elapsed: 2.35 sec
    [junit] Running org.apache.poi.ooxml.TestPOIXMLProperties
    [junit] Tests run: 10, Failures: 0, Errors: 0, Skipped: 1, Time elapsed: 0.319 sec
    [junit] Running org.apache.poi.ooxml.TestXMLPropertiesTextExtractor
    [junit] Tests run: 5, Failures: 0, Errors: 0, Skipped: 0, Time elapsed: 0.119 sec
    [junit] Running org.apache.poi.openxml4j.opc.TestContentType
    [junit] Tests run: 7, Failures: 0, Errors: 0, Skipped: 0, Time elapsed: 0.059 sec
    [junit] Running org.apache.poi.openxml4j.opc.TestFileHelper
    [junit] Tests run: 1, Failures: 0, Errors: 0, Skipped: 0, Time elapsed: 0.003 sec
    [junit] Running org.apache.poi.openxml4j.opc.TestListParts
    [junit] Tests run: 1, Failures: 0, Errors: 0, Skipped: 0, Time elapsed: 0.005 sec
    [junit] Running org.apache.poi.openxml4j.opc.TestPackage
    [junit] Tests run: 46, Failures: 0, Errors: 0, Skipped: 1, Time elapsed: 1.833 sec
    [junit] Running org.apache.poi.openxml4j.opc.TestPackageCoreProperties
    [junit] Tests run: 7, Failures: 0, Errors: 0, Skipped: 0, Time elapsed: 0.098 sec
    [junit] Running org.apache.poi.openxml4j.opc.TestPackagePartName
    [junit] Tests run: 1, Failures: 0, Errors: 0, Skipped: 0, Time elapsed: 0.002 sec
    [junit] Running org.apache.poi.openxml4j.opc.TestPackageThumbnail
    [junit] Tests run: 1, Failures: 0, Errors: 0, Skipped: 0, Time elapsed: 0.02 sec
    [junit] Running org.apache.poi.openxml4j.opc.TestPackagingURIHelper
    [junit] Tests run: 5, Failures: 0, Errors: 0, Skipped: 0, Time elapsed: 0.035 sec
    [junit] Running org.apache.poi.openxml4j.opc.TestRelationships
    [junit] Tests run: 9, Failures: 0, Errors: 0, Skipped: 0, Time elapsed: 0.099 sec
    [junit] Running org.apache.poi.openxml4j.opc.compliance.TestOPCComplianceCoreProperties
    [junit] Tests run: 11, Failures: 0, Errors: 0, Skipped: 0, Time elapsed: 0.13 sec
    [junit] Running org.apache.poi.openxml4j.opc.compliance.TestOPCCompliancePackageModel
    [junit] Tests run: 5, Failures: 0, Errors: 0, Skipped: 0, Time elapsed: 0.032 sec
    [junit] Running org.apache.poi.openxml4j.opc.compliance.TestOPCCompliancePartName
    [junit] Tests run: 10, Failures: 0, Errors: 0, Skipped: 0, Time elapsed: 0.075 sec
    [junit] Running org.apache.poi.openxml4j.opc.internal.TestContentTypeManager
    [junit] Tests run: 5, Failures: 0, Errors: 0, Skipped: 1, Time elapsed: 0.209 sec
    [junit] Running org.apache.poi.openxml4j.opc.internal.marshallers.TestZipPackagePropertiesMarshaller
    [junit] Tests run: 4, Failures: 0, Errors: 0, Skipped: 0, Time elapsed: 0.029 sec
    [junit] Running org.apache.poi.openxml4j.util.TestZipSecureFile
    [junit] Tests run: 1, Failures: 0, Errors: 0, Skipped: 0, Time elapsed: 0.003 sec
    [junit] Running org.apache.poi.poifs.crypt.dsig.TestSignatureConfig
    [junit] Tests run: 2, Failures: 0, Errors: 0, Skipped: 1, Time elapsed: 0.005 sec
    [junit] Running org.apache.poi.poifs.crypt.dsig.TestSignatureInfo
    [junit] Tests run: 14, Failures: 0, Errors: 1, Skipped: 1, Time elapsed: 3.61 sec

BUILD FAILED
<https://builds.apache.org/job/POI-DSL-OpenJDK/ws/build.xml>:1665: The following error occurred while executing this line:
<https://builds.apache.org/job/POI-DSL-OpenJDK/ws/build.xml>:1486: The following error occurred while executing this line:
<https://builds.apache.org/job/POI-DSL-OpenJDK/ws/build.xml>:1114: Tests failed

Total time: 26 minutes 12 seconds
Build step 'Invoke Ant' marked build as failure
Skipping publisher since build result is FAILURE
Archiving artifacts
[Fast Archiver] Compressed 4.12 MB of artifacts by 22.0% relative to #81
Skipping publisher since build result is FAILURE
Recording test results

---------------------------------------------------------------------
To unsubscribe, e-mail: [hidden email]
For additional commands, e-mail: [hidden email]

Reply | Threaded
Open this post in threaded view
|

Build failed in Jenkins: POI-DSL-OpenJDK #86

Apache Jenkins Server
See <https://builds.apache.org/job/POI-DSL-OpenJDK/86/display/redirect?page=changes>

Changes:

[kiwiwings] examples had been moved due to jigsaw modules migration


------------------------------------------
[...truncated 658.49 KB...]
      [get] Destination already exists (skipping): <https://builds.apache.org/job/POI-DSL-OpenJDK/ws/lib/util/maven-ant-tasks-2.1.3.jar>

mvn-install:
[mvn:install] [INFO] Installing <https://builds.apache.org/job/POI-DSL-OpenJDK/ws/build/dist/maven/poi/poi-5.0.0-SNAPSHOT.jar> to /home/jenkins/.m2/repository/org/apache/poi/poi/5.0.0-SNAPSHOT/poi-5.0.0-SNAPSHOT.jar
[mvn:install] [INFO] Installing <https://builds.apache.org/job/POI-DSL-OpenJDK/ws/build/dist/maven/poi-scratchpad/poi-scratchpad-5.0.0-SNAPSHOT.jar> to /home/jenkins/.m2/repository/org/apache/poi/poi-scratchpad/5.0.0-SNAPSHOT/poi-scratchpad-5.0.0-SNAPSHOT.jar
[mvn:install] [INFO] Installing <https://builds.apache.org/job/POI-DSL-OpenJDK/ws/build/dist/maven/poi-ooxml/poi-ooxml-5.0.0-SNAPSHOT.jar> to /home/jenkins/.m2/repository/org/apache/poi/poi-ooxml/5.0.0-SNAPSHOT/poi-ooxml-5.0.0-SNAPSHOT.jar
[mvn:install] [INFO] Installing <https://builds.apache.org/job/POI-DSL-OpenJDK/ws/build/dist/maven/poi-examples/poi-examples-5.0.0-SNAPSHOT.jar> to /home/jenkins/.m2/repository/org/apache/poi/poi-examples/5.0.0-SNAPSHOT/poi-examples-5.0.0-SNAPSHOT.jar
[mvn:install] [INFO] Installing <https://builds.apache.org/job/POI-DSL-OpenJDK/ws/build/dist/maven/poi-ooxml-schemas/poi-ooxml-schemas-5.0.0-SNAPSHOT.jar> to /home/jenkins/.m2/repository/org/apache/poi/poi-ooxml-schemas/5.0.0-SNAPSHOT/poi-ooxml-schemas-5.0.0-SNAPSHOT.jar
[mvn:install] [INFO] Installing <https://builds.apache.org/job/POI-DSL-OpenJDK/ws/build/dist/maven/poi-excelant/poi-excelant-5.0.0-SNAPSHOT.jar> to /home/jenkins/.m2/repository/org/apache/poi/poi-excelant/5.0.0-SNAPSHOT/poi-excelant-5.0.0-SNAPSHOT.jar

jenkins:

BUILD SUCCESSFUL
Total time: 33 minutes 25 seconds
[integrationtest] $ /home/jenkins/tools/ant/latest1.10/bin/ant -file build.xml run
Buildfile: <https://builds.apache.org/job/POI-DSL-OpenJDK/ws/src/integrationtest/build.xml>

init:

runSourceBuild:
    [mkdir] Created dir: <https://builds.apache.org/job/POI-DSL-OpenJDK/ws/build/distsourcebuild>
     [echo] Found source package at <https://builds.apache.org/job/POI-DSL-OpenJDK/ws/build/dist/poi-src-5.0.0-SNAPSHOT-20200724.zip>
    [unzip] Expanding: <https://builds.apache.org/job/POI-DSL-OpenJDK/ws/build/dist/poi-src-5.0.0-SNAPSHOT-20200724.zip> into <https://builds.apache.org/job/POI-DSL-OpenJDK/ws/build/distsourcebuild>
    [mkdir] Created dir: <https://builds.apache.org/job/POI-DSL-OpenJDK/ws/build/distsourcebuild/poi-5.0.0-SNAPSHOT/lib>
     [copy] Copying 56 files to <https://builds.apache.org/job/POI-DSL-OpenJDK/ws/build/distsourcebuild/poi-5.0.0-SNAPSHOT/lib>
     [echo] Building in temporary dir <https://builds.apache.org/job/POI-DSL-OpenJDK/ws/build/distsourcebuild/poi-5.0.0-SNAPSHOT/>

check-jars:

fetch-jars:

check-ooxml-jars:

fetch-ooxml-jars:

init:
    [mkdir] Created dir: <https://builds.apache.org/job/POI-DSL-OpenJDK/ws/build/distsourcebuild/poi-5.0.0-SNAPSHOT/build>
    [mkdir] Created dir: <https://builds.apache.org/job/POI-DSL-OpenJDK/ws/build/distsourcebuild/poi-5.0.0-SNAPSHOT/build/classes>
    [mkdir] Created dir: <https://builds.apache.org/job/POI-DSL-OpenJDK/ws/build/distsourcebuild/poi-5.0.0-SNAPSHOT/build/test-classes>
    [mkdir] Created dir: <https://builds.apache.org/job/POI-DSL-OpenJDK/ws/build/distsourcebuild/poi-5.0.0-SNAPSHOT/build/test-results>
    [mkdir] Created dir: <https://builds.apache.org/job/POI-DSL-OpenJDK/ws/build/distsourcebuild/poi-5.0.0-SNAPSHOT/build/scratchpad-classes>
    [mkdir] Created dir: <https://builds.apache.org/job/POI-DSL-OpenJDK/ws/build/distsourcebuild/poi-5.0.0-SNAPSHOT/build/scratchpad-test-classes>
    [mkdir] Created dir: <https://builds.apache.org/job/POI-DSL-OpenJDK/ws/build/distsourcebuild/poi-5.0.0-SNAPSHOT/build/scratchpad-test-results>
    [mkdir] Created dir: <https://builds.apache.org/job/POI-DSL-OpenJDK/ws/build/distsourcebuild/poi-5.0.0-SNAPSHOT/build/geometry-java>
    [mkdir] Created dir: <https://builds.apache.org/job/POI-DSL-OpenJDK/ws/build/distsourcebuild/poi-5.0.0-SNAPSHOT/build/ooxml-classes>
    [mkdir] Created dir: <https://builds.apache.org/job/POI-DSL-OpenJDK/ws/build/distsourcebuild/poi-5.0.0-SNAPSHOT/build/ooxml-test-classes>
    [mkdir] Created dir: <https://builds.apache.org/job/POI-DSL-OpenJDK/ws/build/distsourcebuild/poi-5.0.0-SNAPSHOT/build/ooxml-test-results>
    [mkdir] Created dir: <https://builds.apache.org/job/POI-DSL-OpenJDK/ws/build/distsourcebuild/poi-5.0.0-SNAPSHOT/build/excelant-classes>
    [mkdir] Created dir: <https://builds.apache.org/job/POI-DSL-OpenJDK/ws/build/distsourcebuild/poi-5.0.0-SNAPSHOT/build/excelant-test-classes>
    [mkdir] Created dir: <https://builds.apache.org/job/POI-DSL-OpenJDK/ws/build/distsourcebuild/poi-5.0.0-SNAPSHOT/build/excelant-test-results>
    [mkdir] Created dir: <https://builds.apache.org/job/POI-DSL-OpenJDK/ws/build/distsourcebuild/poi-5.0.0-SNAPSHOT/build/examples-classes>
    [mkdir] Created dir: <https://builds.apache.org/job/POI-DSL-OpenJDK/ws/build/distsourcebuild/poi-5.0.0-SNAPSHOT/build/integration-test-classes>
    [mkdir] Created dir: <https://builds.apache.org/job/POI-DSL-OpenJDK/ws/build/distsourcebuild/poi-5.0.0-SNAPSHOT/build/integration-test-results>
    [mkdir] Created dir: <https://builds.apache.org/job/POI-DSL-OpenJDK/ws/build/distsourcebuild/poi-5.0.0-SNAPSHOT/build/dist>
    [mkdir] Created dir: <https://builds.apache.org/job/POI-DSL-OpenJDK/ws/build/distsourcebuild/poi-5.0.0-SNAPSHOT/build/site>
     [echo] Using Ant: Apache Ant(TM) version 1.10.7 compiled on September 1 2019 from /home/jenkins/tools/ant/latest1.10, Ant detected Java 1.8 (may be different than actual Java sometimes...)
     [echo] Using Java: 1.8.0_242/1.8.0_242-b08/25.242-b08/OpenJDK 64-Bit Server VM from Oracle Corporation on Linux: 4.15.0-58-generic
     [echo] Building Apache POI version 5.0.0-SNAPSHOT and RC: RC1

-version-java-check:

compile-version:
     [copy] Copying 1 file to <https://builds.apache.org/job/POI-DSL-OpenJDK/ws/build/distsourcebuild/poi-5.0.0-SNAPSHOT/build/classes/org/apache/poi>
    [javac] Compiling 1 source file to <https://builds.apache.org/job/POI-DSL-OpenJDK/ws/build/distsourcebuild/poi-5.0.0-SNAPSHOT/build/classes>
   [delete] Deleting: <https://builds.apache.org/job/POI-DSL-OpenJDK/ws/build/distsourcebuild/poi-5.0.0-SNAPSHOT/build/classes/org/apache/poi/Version.java>

compile-main:
    [javac] Compiling 1174 source files to <https://builds.apache.org/job/POI-DSL-OpenJDK/ws/build/distsourcebuild/poi-5.0.0-SNAPSHOT/build/classes>
    [javac] Support for javac --release has been added in Java9 ignoring it
    [javac] Note: Some input files use or override a deprecated API.
    [javac] Note: Recompile with -Xlint:deprecation for details.
    [javac] Note: Some input files use unchecked or unsafe operations.
    [javac] Note: Recompile with -Xlint:unchecked for details.
    [javac] Creating empty <https://builds.apache.org/job/POI-DSL-OpenJDK/ws/build/distsourcebuild/poi-5.0.0-SNAPSHOT/build/classes/org/apache/poi/ddf/package-info.class>
    [javac] Creating empty <https://builds.apache.org/job/POI-DSL-OpenJDK/ws/build/distsourcebuild/poi-5.0.0-SNAPSHOT/build/classes/org/apache/poi/hssf/package-info.class>
    [javac] Creating empty <https://builds.apache.org/job/POI-DSL-OpenJDK/ws/build/distsourcebuild/poi-5.0.0-SNAPSHOT/build/classes/org/apache/poi/poifs/dev/package-info.class>
    [javac] Creating empty <https://builds.apache.org/job/POI-DSL-OpenJDK/ws/build/distsourcebuild/poi-5.0.0-SNAPSHOT/build/classes/org/apache/poi/util/package-info.class>
    [javac] Creating empty <https://builds.apache.org/job/POI-DSL-OpenJDK/ws/build/distsourcebuild/poi-5.0.0-SNAPSHOT/build/classes/org/apache/poi/poifs/common/package-info.class>
    [javac] Creating empty <https://builds.apache.org/job/POI-DSL-OpenJDK/ws/build/distsourcebuild/poi-5.0.0-SNAPSHOT/build/classes/org/apache/poi/hssf/record/package-info.class>
    [javac] Creating empty <https://builds.apache.org/job/POI-DSL-OpenJDK/ws/build/distsourcebuild/poi-5.0.0-SNAPSHOT/build/classes/org/apache/poi/poifs/package-info.class>
    [javac] Creating empty <https://builds.apache.org/job/POI-DSL-OpenJDK/ws/build/distsourcebuild/poi-5.0.0-SNAPSHOT/build/classes/org/apache/poi/poifs/crypt/package-info.class>
    [javac] Creating empty <https://builds.apache.org/job/POI-DSL-OpenJDK/ws/build/distsourcebuild/poi-5.0.0-SNAPSHOT/build/classes/org/apache/poi/hpsf/wellknown/package-info.class>
    [javac] Creating empty <https://builds.apache.org/job/POI-DSL-OpenJDK/ws/build/distsourcebuild/poi-5.0.0-SNAPSHOT/build/classes/org/apache/poi/hssf/dev/package-info.class>
    [javac] Creating empty <https://builds.apache.org/job/POI-DSL-OpenJDK/ws/build/distsourcebuild/poi-5.0.0-SNAPSHOT/build/classes/org/apache/poi/ss/formula/package-info.class>
    [javac] Creating empty <https://builds.apache.org/job/POI-DSL-OpenJDK/ws/build/distsourcebuild/poi-5.0.0-SNAPSHOT/build/classes/org/apache/poi/hpsf/package-info.class>
    [javac] Creating empty <https://builds.apache.org/job/POI-DSL-OpenJDK/ws/build/distsourcebuild/poi-5.0.0-SNAPSHOT/build/classes/org/apache/poi/poifs/property/package-info.class>
    [javac] Creating empty <https://builds.apache.org/job/POI-DSL-OpenJDK/ws/build/distsourcebuild/poi-5.0.0-SNAPSHOT/build/classes/org/apache/poi/poifs/filesystem/package-info.class>
    [javac] Creating empty <https://builds.apache.org/job/POI-DSL-OpenJDK/ws/build/distsourcebuild/poi-5.0.0-SNAPSHOT/build/classes/org/apache/poi/ss/formula/ptg/package-info.class>
    [javac] Creating empty <https://builds.apache.org/job/POI-DSL-OpenJDK/ws/build/distsourcebuild/poi-5.0.0-SNAPSHOT/build/classes/org/apache/poi/poifs/storage/package-info.class>
    [javac] Creating empty <https://builds.apache.org/job/POI-DSL-OpenJDK/ws/build/distsourcebuild/poi-5.0.0-SNAPSHOT/build/classes/org/apache/poi/hssf/eventusermodel/package-info.class>
    [javac] Creating empty <https://builds.apache.org/job/POI-DSL-OpenJDK/ws/build/distsourcebuild/poi-5.0.0-SNAPSHOT/build/classes/org/apache/poi/hssf/record/aggregates/package-info.class>
    [javac] Creating empty <https://builds.apache.org/job/POI-DSL-OpenJDK/ws/build/distsourcebuild/poi-5.0.0-SNAPSHOT/build/classes/org/apache/poi/ss/format/package-info.class>
    [javac] Creating empty <https://builds.apache.org/job/POI-DSL-OpenJDK/ws/build/distsourcebuild/poi-5.0.0-SNAPSHOT/build/classes/org/apache/poi/hssf/model/package-info.class>
    [javac] Creating empty <https://builds.apache.org/job/POI-DSL-OpenJDK/ws/build/distsourcebuild/poi-5.0.0-SNAPSHOT/build/classes/org/apache/poi/hssf/usermodel/package-info.class>
    [javac] Creating empty <https://builds.apache.org/job/POI-DSL-OpenJDK/ws/build/distsourcebuild/poi-5.0.0-SNAPSHOT/build/classes/org/apache/poi/hssf/util/package-info.class>
    [javac] Creating empty <https://builds.apache.org/job/POI-DSL-OpenJDK/ws/build/distsourcebuild/poi-5.0.0-SNAPSHOT/build/classes/org/apache/poi/poifs/eventfilesystem/package-info.class>
    [mkdir] Created dir: <https://builds.apache.org/job/POI-DSL-OpenJDK/ws/build/distsourcebuild/poi-5.0.0-SNAPSHOT/build/dist/maven/poi>
      [jar] Building jar: <https://builds.apache.org/job/POI-DSL-OpenJDK/ws/build/distsourcebuild/poi-5.0.0-SNAPSHOT/build/dist/maven/poi/poi-5.0.0-SNAPSHOT.jar>
    [javac] Compiling 549 source files to <https://builds.apache.org/job/POI-DSL-OpenJDK/ws/build/distsourcebuild/poi-5.0.0-SNAPSHOT/build/test-classes>
    [javac] Support for javac --release has been added in Java9 ignoring it
    [javac] Note: Some input files use or override a deprecated API.
    [javac] Note: Recompile with -Xlint:deprecation for details.
      [jar] Building jar: <https://builds.apache.org/job/POI-DSL-OpenJDK/ws/build/distsourcebuild/poi-5.0.0-SNAPSHOT/build/dist/maven/poi-tests/poi-5.0.0-SNAPSHOT-tests.jar>
      [jar] Building jar: <https://builds.apache.org/job/POI-DSL-OpenJDK/ws/build/distsourcebuild/poi-5.0.0-SNAPSHOT/build/dist/maven/poi/poi-5.0.0-SNAPSHOT-sources.jar>

compile-scratchpad:
    [javac] Compiling 513 source files to <https://builds.apache.org/job/POI-DSL-OpenJDK/ws/build/distsourcebuild/poi-5.0.0-SNAPSHOT/build/scratchpad-classes>
    [javac] Support for javac --release has been added in Java9 ignoring it
    [javac] Note: Some input files use or override a deprecated API.
    [javac] Note: Recompile with -Xlint:deprecation for details.
    [javac] Note: Some input files use unchecked or unsafe operations.
    [javac] Note: Recompile with -Xlint:unchecked for details.
    [mkdir] Created dir: <https://builds.apache.org/job/POI-DSL-OpenJDK/ws/build/distsourcebuild/poi-5.0.0-SNAPSHOT/build/dist/maven/poi-scratchpad>
      [jar] Building jar: <https://builds.apache.org/job/POI-DSL-OpenJDK/ws/build/distsourcebuild/poi-5.0.0-SNAPSHOT/build/dist/maven/poi-scratchpad/poi-scratchpad-5.0.0-SNAPSHOT.jar>
    [javac] Compiling 202 source files to <https://builds.apache.org/job/POI-DSL-OpenJDK/ws/build/distsourcebuild/poi-5.0.0-SNAPSHOT/build/scratchpad-test-classes>
    [javac] Support for javac --release has been added in Java9 ignoring it
    [javac] Note: Some input files use or override a deprecated API.
    [javac] Note: Recompile with -Xlint:deprecation for details.
    [javac] Note: <https://builds.apache.org/job/POI-DSL-OpenJDK/ws/build/distsourcebuild/poi-5.0.0-SNAPSHOT/src/scratchpad/testcases/org/apache/poi/hslf/usermodel/TestBugs.java> uses unchecked or unsafe operations.
    [javac] Note: Recompile with -Xlint:unchecked for details.
      [jar] Building jar: <https://builds.apache.org/job/POI-DSL-OpenJDK/ws/build/distsourcebuild/poi-5.0.0-SNAPSHOT/build/dist/maven/poi-scratchpad-tests/poi-scratchpad-5.0.0-SNAPSHOT-tests.jar>
      [jar] Building jar: <https://builds.apache.org/job/POI-DSL-OpenJDK/ws/build/distsourcebuild/poi-5.0.0-SNAPSHOT/build/dist/maven/poi-scratchpad/poi-scratchpad-5.0.0-SNAPSHOT-sources.jar>

check-compiled-ooxml-xsds:

compile-ooxml-xsds:
    [mkdir] Created dir: <https://builds.apache.org/job/POI-DSL-OpenJDK/ws/build/distsourcebuild/poi-5.0.0-SNAPSHOT/build/xmlbean-xsds>
     [copy] Copying 7 files to <https://builds.apache.org/job/POI-DSL-OpenJDK/ws/build/distsourcebuild/poi-5.0.0-SNAPSHOT/build/xmlbean-xsds>
     [copy] Copying 89 resources to <https://builds.apache.org/job/POI-DSL-OpenJDK/ws/build/distsourcebuild/poi-5.0.0-SNAPSHOT/build/xmlbean-xsds>
    [mkdir] Created dir: <https://builds.apache.org/job/POI-DSL-OpenJDK/ws/build/distsourcebuild/poi-5.0.0-SNAPSHOT/build/xmlbean-sources>
    [mkdir] Created dir: <https://builds.apache.org/job/POI-DSL-OpenJDK/ws/build/distsourcebuild/poi-5.0.0-SNAPSHOT/build/xmlbean-classes>
  [xmlbean] SchemaCompiler  Metadata LOAD:org/apache/xmlbeans/metadata GEN:org/apache/poi/schemas/ooxml
  [xmlbean] Time to build schema type system: 2.361 seconds
  [xmlbean] Time to generate code: 5.722 seconds
    [javac] Compiling 4908 source files to <https://builds.apache.org/job/POI-DSL-OpenJDK/ws/build/distsourcebuild/poi-5.0.0-SNAPSHOT/build/xmlbean-classes>
    [javac] Support for javac --release has been added in Java9 ignoring it
    [mkdir] Created dir: <https://builds.apache.org/job/POI-DSL-OpenJDK/ws/build/distsourcebuild/poi-5.0.0-SNAPSHOT/build/dist/maven/ooxml-schemas>
      [jar] Building jar: <https://builds.apache.org/job/POI-DSL-OpenJDK/ws/build/distsourcebuild/poi-5.0.0-SNAPSHOT/build/dist/maven/ooxml-schemas/ooxml-schemas-1.5.jar>
      [jar] Building jar: <https://builds.apache.org/job/POI-DSL-OpenJDK/ws/build/distsourcebuild/poi-5.0.0-SNAPSHOT/build/dist/maven/ooxml-schemas/ooxml-schemas-1.5-sources.jar>

compile-ooxml:
    [javac] Compiling 612 source files to <https://builds.apache.org/job/POI-DSL-OpenJDK/ws/build/distsourcebuild/poi-5.0.0-SNAPSHOT/build/ooxml-classes>
    [javac] Support for javac --release has been added in Java9 ignoring it
    [javac] Note: Some input files use or override a deprecated API.
    [javac] Note: Recompile with -Xlint:deprecation for details.
    [javac] Note: <https://builds.apache.org/job/POI-DSL-OpenJDK/ws/build/distsourcebuild/poi-5.0.0-SNAPSHOT/src/ooxml/java/org/apache/poi/xslf/draw/SVGImageRenderer.java> uses unchecked or unsafe operations.
    [javac] Note: Recompile with -Xlint:unchecked for details.
    [javac] Creating empty <https://builds.apache.org/job/POI-DSL-OpenJDK/ws/build/distsourcebuild/poi-5.0.0-SNAPSHOT/build/ooxml-classes/org/apache/poi/xwpf/package-info.class>
    [javac] Creating empty <https://builds.apache.org/job/POI-DSL-OpenJDK/ws/build/distsourcebuild/poi-5.0.0-SNAPSHOT/build/ooxml-classes/org/apache/poi/xssf/binary/package-info.class>
    [mkdir] Created dir: <https://builds.apache.org/job/POI-DSL-OpenJDK/ws/build/distsourcebuild/poi-5.0.0-SNAPSHOT/build/dist/maven/poi-ooxml>
      [jar] Building jar: <https://builds.apache.org/job/POI-DSL-OpenJDK/ws/build/distsourcebuild/poi-5.0.0-SNAPSHOT/build/dist/maven/poi-ooxml/poi-ooxml-5.0.0-SNAPSHOT.jar>
    [javac] Compiling 270 source files to <https://builds.apache.org/job/POI-DSL-OpenJDK/ws/build/distsourcebuild/poi-5.0.0-SNAPSHOT/build/ooxml-test-classes>
    [javac] Support for javac --release has been added in Java9 ignoring it
    [javac] Note: Some input files use or override a deprecated API.
    [javac] Note: Recompile with -Xlint:deprecation for details.
    [javac] Note: Some input files use unchecked or unsafe operations.
    [javac] Note: Recompile with -Xlint:unchecked for details.
      [jar] Building jar: <https://builds.apache.org/job/POI-DSL-OpenJDK/ws/build/distsourcebuild/poi-5.0.0-SNAPSHOT/build/dist/maven/poi-ooxml-tests/poi-ooxml-5.0.0-SNAPSHOT-tests.jar>
      [jar] Building jar: <https://builds.apache.org/job/POI-DSL-OpenJDK/ws/build/distsourcebuild/poi-5.0.0-SNAPSHOT/build/dist/maven/poi-ooxml/poi-ooxml-5.0.0-SNAPSHOT-sources.jar>
      [jar] Building jar: <https://builds.apache.org/job/POI-DSL-OpenJDK/ws/build/distsourcebuild/poi-5.0.0-SNAPSHOT/lib/ooxml-tests/ooxml-lite-agent.jar>

compile-examples:
    [javac] Compiling 133 source files to <https://builds.apache.org/job/POI-DSL-OpenJDK/ws/build/distsourcebuild/poi-5.0.0-SNAPSHOT/build/examples-classes>
    [javac] Support for javac --release has been added in Java9 ignoring it
    [javac] Note: Some input files use or override a deprecated API.
    [javac] Note: Recompile with -Xlint:deprecation for details.
    [javac] Creating empty <https://builds.apache.org/job/POI-DSL-OpenJDK/ws/build/distsourcebuild/poi-5.0.0-SNAPSHOT/build/examples-classes/org/apache/poi/examples/ss/html/package-info.class>
    [mkdir] Created dir: <https://builds.apache.org/job/POI-DSL-OpenJDK/ws/build/distsourcebuild/poi-5.0.0-SNAPSHOT/build/dist/maven/poi-examples>
      [jar] Building jar: <https://builds.apache.org/job/POI-DSL-OpenJDK/ws/build/distsourcebuild/poi-5.0.0-SNAPSHOT/build/dist/maven/poi-examples/poi-examples-5.0.0-SNAPSHOT.jar>
      [jar] Building jar: <https://builds.apache.org/job/POI-DSL-OpenJDK/ws/build/distsourcebuild/poi-5.0.0-SNAPSHOT/build/dist/maven/poi-examples/poi-examples-5.0.0-SNAPSHOT-sources.jar>

compile-excelant:
    [javac] Compiling 14 source files to <https://builds.apache.org/job/POI-DSL-OpenJDK/ws/build/distsourcebuild/poi-5.0.0-SNAPSHOT/build/excelant-classes>
    [javac] Support for javac --release has been added in Java9 ignoring it
    [mkdir] Created dir: <https://builds.apache.org/job/POI-DSL-OpenJDK/ws/build/distsourcebuild/poi-5.0.0-SNAPSHOT/build/dist/maven/poi-excelant>
      [jar] Building jar: <https://builds.apache.org/job/POI-DSL-OpenJDK/ws/build/distsourcebuild/poi-5.0.0-SNAPSHOT/build/dist/maven/poi-excelant/poi-excelant-5.0.0-SNAPSHOT.jar>
    [javac] Compiling 12 source files to <https://builds.apache.org/job/POI-DSL-OpenJDK/ws/build/distsourcebuild/poi-5.0.0-SNAPSHOT/build/excelant-test-classes>
    [javac] Support for javac --release has been added in Java9 ignoring it
      [jar] Building jar: <https://builds.apache.org/job/POI-DSL-OpenJDK/ws/build/distsourcebuild/poi-5.0.0-SNAPSHOT/build/dist/maven/poi-excelant-tests/poi-excelant-5.0.0-SNAPSHOT-tests.jar>
      [jar] Building jar: <https://builds.apache.org/job/POI-DSL-OpenJDK/ws/build/distsourcebuild/poi-5.0.0-SNAPSHOT/build/dist/maven/poi-excelant/poi-excelant-5.0.0-SNAPSHOT-sources.jar>

compile:

-test-ooxml-check:

jacocotask:
     [echo] Coverage reporting: ${coverage.enabled}

test-ooxml:
    [junit] Running org.apache.poi.extractor.ooxml.TestExtractorFactory
    [junit] Tests run: 14, Failures: 0, Errors: 0, Skipped: 0, Time elapsed: 3.705 sec
    [junit] Running org.apache.poi.ooxml.TestDetectAsOOXML
    [junit] Tests run: 3, Failures: 0, Errors: 0, Skipped: 0, Time elapsed: 0.016 sec
    [junit] Running org.apache.poi.ooxml.TestEmbedded
    [junit] Tests run: 3, Failures: 0, Errors: 0, Skipped: 0, Time elapsed: 0.368 sec
    [junit] Running org.apache.poi.ooxml.TestPOIXMLDocument
    [junit] Tests run: 11, Failures: 0, Errors: 0, Skipped: 0, Time elapsed: 1.677 sec
    [junit] Running org.apache.poi.ooxml.TestPOIXMLProperties
    [junit] Tests run: 10, Failures: 0, Errors: 0, Skipped: 1, Time elapsed: 0.295 sec
    [junit] Running org.apache.poi.ooxml.TestXMLPropertiesTextExtractor
    [junit] Tests run: 5, Failures: 0, Errors: 0, Skipped: 0, Time elapsed: 0.114 sec
    [junit] Running org.apache.poi.openxml4j.opc.TestContentType
    [junit] Tests run: 7, Failures: 0, Errors: 0, Skipped: 0, Time elapsed: 0.03 sec
    [junit] Running org.apache.poi.openxml4j.opc.TestFileHelper
    [junit] Tests run: 1, Failures: 0, Errors: 0, Skipped: 0, Time elapsed: 0.002 sec
    [junit] Running org.apache.poi.openxml4j.opc.TestListParts
    [junit] Tests run: 1, Failures: 0, Errors: 0, Skipped: 0, Time elapsed: 0.004 sec
    [junit] Running org.apache.poi.openxml4j.opc.TestPackage
    [junit] Tests run: 46, Failures: 0, Errors: 0, Skipped: 1, Time elapsed: 1.414 sec
    [junit] Running org.apache.poi.openxml4j.opc.TestPackageCoreProperties
    [junit] Tests run: 7, Failures: 0, Errors: 0, Skipped: 0, Time elapsed: 0.079 sec
    [junit] Running org.apache.poi.openxml4j.opc.TestPackagePartName
    [junit] Tests run: 1, Failures: 0, Errors: 0, Skipped: 0, Time elapsed: 0.002 sec
    [junit] Running org.apache.poi.openxml4j.opc.TestPackageThumbnail
    [junit] Tests run: 1, Failures: 0, Errors: 0, Skipped: 0, Time elapsed: 0.013 sec
    [junit] Running org.apache.poi.openxml4j.opc.TestPackagingURIHelper
    [junit] Tests run: 5, Failures: 0, Errors: 0, Skipped: 0, Time elapsed: 0.004 sec
    [junit] Running org.apache.poi.openxml4j.opc.TestRelationships
    [junit] Tests run: 9, Failures: 0, Errors: 0, Skipped: 0, Time elapsed: 0.063 sec
    [junit] Running org.apache.poi.openxml4j.opc.compliance.TestOPCComplianceCoreProperties
    [junit] Tests run: 11, Failures: 0, Errors: 0, Skipped: 0, Time elapsed: 0.072 sec
    [junit] Running org.apache.poi.openxml4j.opc.compliance.TestOPCCompliancePackageModel
    [junit] Tests run: 5, Failures: 0, Errors: 0, Skipped: 0, Time elapsed: 0.007 sec
    [junit] Running org.apache.poi.openxml4j.opc.compliance.TestOPCCompliancePartName
    [junit] Tests run: 10, Failures: 0, Errors: 0, Skipped: 0, Time elapsed: 0.008 sec
    [junit] Running org.apache.poi.openxml4j.opc.internal.TestContentTypeManager
    [junit] Tests run: 5, Failures: 0, Errors: 0, Skipped: 1, Time elapsed: 0.223 sec
    [junit] Running org.apache.poi.openxml4j.opc.internal.marshallers.TestZipPackagePropertiesMarshaller
    [junit] Tests run: 4, Failures: 0, Errors: 0, Skipped: 0, Time elapsed: 0.006 sec
    [junit] Running org.apache.poi.openxml4j.util.TestZipSecureFile
    [junit] Tests run: 1, Failures: 0, Errors: 0, Skipped: 0, Time elapsed: 0.004 sec
    [junit] Running org.apache.poi.poifs.crypt.dsig.TestSignatureConfig
    [junit] Tests run: 2, Failures: 0, Errors: 0, Skipped: 1, Time elapsed: 0.008 sec
    [junit] Running org.apache.poi.poifs.crypt.dsig.TestSignatureInfo
    [junit] Tests run: 14, Failures: 0, Errors: 1, Skipped: 1, Time elapsed: 6.284 sec

BUILD FAILED
<https://builds.apache.org/job/POI-DSL-OpenJDK/ws/src/integrationtest/build.xml>:72: The following error occurred while executing this line:
<https://builds.apache.org/job/POI-DSL-OpenJDK/ws/build/distsourcebuild/poi-5.0.0-SNAPSHOT/build.xml>:1518: The following error occurred while executing this line:
<https://builds.apache.org/job/POI-DSL-OpenJDK/ws/build/distsourcebuild/poi-5.0.0-SNAPSHOT/build.xml>:1486: The following error occurred while executing this line:
<https://builds.apache.org/job/POI-DSL-OpenJDK/ws/build/distsourcebuild/poi-5.0.0-SNAPSHOT/build.xml>:1114: Tests failed

Total time: 2 minutes 45 seconds
Build step 'Invoke Ant' marked build as failure
Skipping publisher since build result is FAILURE
Archiving artifacts
[Fast Archiver] Compressed 227.69 MB of artifacts by 25.4% relative to #81
Skipping publisher since build result is FAILURE
Recording test results

---------------------------------------------------------------------
To unsubscribe, e-mail: [hidden email]
For additional commands, e-mail: [hidden email]

Reply | Threaded
Open this post in threaded view
|

Jenkins build is back to normal : POI-DSL-OpenJDK #87

Apache Jenkins Server
See <https://builds.apache.org/job/POI-DSL-OpenJDK/87/display/redirect?page=changes>


---------------------------------------------------------------------
To unsubscribe, e-mail: [hidden email]
For additional commands, e-mail: [hidden email]