Build failed in Jenkins: POI-DSL-OpenJDK #716

classic Classic list List threaded Threaded
2 messages Options
Reply | Threaded
Open this post in threaded view
|

Build failed in Jenkins: POI-DSL-OpenJDK #716

Apache Jenkins Server
See <https://builds.apache.org/job/POI-DSL-OpenJDK/716/display/redirect?page=changes>

Changes:

[kiwiwings] #62649 - remove documentation reference to OPOIFS

[kiwiwings] CSS/XSLT formattings for code blocks with line numbers

[fanningpj] add XPathHelper

[fanningpj] add TransformerHelper

[fanningpj] xlsx is expected to fail in integration test

[fanningpj] [bug-63768] update changes.txt

[fanningpj] [bug-63768] XSSFExportToXml should set FEATURE_SECURE_PROCESSING on SchemaFactory. Thanks to Artem Smotrakov.

[fanningpj] Bug 63768: Adjust handling of SchemaFactory

------------------------------------------
[...truncated 382.83 KB...]
-rwxr-xr-x 1 root root 6528 Jul 18 21:45 jconsole
-rwxr-xr-x 1 root root 6520 Jul 18 21:45 jdb
-rwxr-xr-x 1 root root 6504 Jul 18 21:45 jdeps
-rwxr-xr-x 1 root root 6504 Jul 18 21:45 jhat
-rwxr-xr-x 1 root root 6568 Jul 18 21:45 jinfo
lrwxrwxrwx 1 root root   14 Jul 18 21:45 jjs -> ../jre/bin/jjs
-rwxr-xr-x 1 root root 6568 Jul 18 21:45 jmap
-rwxr-xr-x 1 root root 6504 Jul 18 21:45 jps
-rwxr-xr-x 1 root root 6504 Jul 18 21:45 jrunscript
-rwxr-xr-x 1 root root 6520 Jul 18 21:45 jsadebugd
-rwxr-xr-x 1 root root 6568 Jul 18 21:45 jstack
-rwxr-xr-x 1 root root 6504 Jul 18 21:45 jstat
-rwxr-xr-x 1 root root 6504 Jul 18 21:45 jstatd
lrwxrwxrwx 1 root root   18 Jul 18 21:45 keytool -> ../jre/bin/keytool
-rwxr-xr-x 1 root root 6504 Jul 18 21:45 native2ascii
lrwxrwxrwx 1 root root   15 Jul 18 21:45 orbd -> ../jre/bin/orbd
lrwxrwxrwx 1 root root   18 Jul 18 21:45 pack200 -> ../jre/bin/pack200
lrwxrwxrwx 1 root root   21 Jul 18 21:45 policytool -> ../jre/bin/policytool
-rwxr-xr-x 1 root root 6504 Jul 18 21:45 rmic
lrwxrwxrwx 1 root root   15 Jul 18 21:45 rmid -> ../jre/bin/rmid
lrwxrwxrwx 1 root root   22 Jul 18 21:45 rmiregistry -> ../jre/bin/rmiregistry
-rwxr-xr-x 1 root root 6504 Jul 18 21:45 schemagen
-rwxr-xr-x 1 root root 6504 Jul 18 21:45 serialver
lrwxrwxrwx 1 root root   21 Jul 18 21:45 servertool -> ../jre/bin/servertool
lrwxrwxrwx 1 root root   20 Jul 18 21:45 tnameserv -> ../jre/bin/tnameserv
lrwxrwxrwx 1 root root   20 Jul 18 21:45 unpack200 -> ../jre/bin/unpack200
-rwxr-xr-x 1 root root 6504 Jul 18 21:45 wsgen
-rwxr-xr-x 1 root root 6504 Jul 18 21:45 wsimport
-rwxr-xr-x 1 root root 6504 Jul 18 21:45 xjc
+ /usr/lib/jvm/java-8-openjdk-amd64//bin/java -version
openjdk version "1.8.0_222"
OpenJDK Runtime Environment (build 1.8.0_222-8u222-b10-1ubuntu1~16.04.1-b10)
OpenJDK 64-Bit Server VM (build 25.222-b10, mixed mode)
+ echo which java
which java
+ which java
/usr/lib/jvm/java-8-openjdk-amd64//bin/java
+ java -version
openjdk version "1.8.0_222"
OpenJDK Runtime Environment (build 1.8.0_222-8u222-b10-1ubuntu1~16.04.1-b10)
OpenJDK 64-Bit Server VM (build 25.222-b10, mixed mode)
+ echo which javac
which javac
+ which javac
/usr/lib/jvm/java-8-openjdk-amd64//bin/javac
+ javac -version
javac 1.8.0_222
+ echo Ant-Home:
Ant-Home:
+ ls -al
total 496
drwxr-xr-x  15 jenkins jenkins   4096 Sep 25 00:41 .
drwxr-xr-x 656 jenkins jenkins  49152 Sep 25 00:40 ..
-rw-r--r--   1 jenkins jenkins  11321 Sep 25 00:40 build.gradle
-rw-r--r--   1 jenkins jenkins 142309 Sep 25 00:40 build.xml
-rw-r--r--   1 jenkins jenkins   3279 Sep 25 00:40 .classpath
drwxr-xr-x   2 jenkins jenkins   4096 Sep 25 00:40 compile-lib
-rw-r--r--   1 jenkins jenkins   5814 Sep 25 00:40 doap_POI.rdf
-rw-r--r--   1 jenkins jenkins   2596 Sep 25 00:41 file-leak-detector.exclude
-rw-r--r--   1 jenkins jenkins   6229 Sep 25 00:41 forrest.properties
-rw-r--r--   1 jenkins jenkins     53 Sep 25 00:40 .gitattributes
-rw-r--r--   1 jenkins jenkins    493 Sep 25 00:40 .gitignore
drwxr-xr-x   3 jenkins jenkins   4096 Sep 25 00:40 gradle
-rwxr-xr-x   1 jenkins jenkins   5299 Sep 25 00:40 gradlew
-rw-r--r--   1 jenkins jenkins   2260 Sep 25 00:41 gradlew.bat
drwxr-xr-x   2 jenkins jenkins   4096 Sep 25 00:40 jenkins
-rw-r--r--   1 jenkins jenkins 166411 Sep 25 00:40 KEYS
drwxr-xr-x   2 jenkins jenkins   4096 Sep 25 00:40 legal
drwxr-xr-x   2 jenkins jenkins   4096 Sep 25 00:40 lib
drwxr-xr-x   2 jenkins jenkins   4096 Sep 25 00:40 maven
drwxr-xr-x   2 jenkins jenkins   4096 Sep 25 00:40 ooxml-lib
drwxr-xr-x   4 jenkins jenkins   4096 Sep 25 00:40 osgi
-rw-r--r--   1 jenkins jenkins   4813 Sep 25 00:40 patch.xml
-rw-r--r--   1 jenkins jenkins    426 Sep 25 00:40 .project
-rw-r--r--   1 jenkins jenkins   4280 Sep 25 00:40 README.rst
drwxr-xr-x   2 jenkins jenkins   4096 Sep 25 00:40 .settings
-rw-r--r--   1 jenkins jenkins    556 Sep 25 00:40 settings.gradle
drwxr-xr-x  10 jenkins jenkins   4096 Sep 25 00:40 sonar
drwxr-xr-x  15 jenkins jenkins   4096 Sep 25 00:41 src
drwxr-xr-x   4 jenkins jenkins   4096 Sep 25 00:41 .svn
drwxr-xr-x  14 jenkins jenkins   4096 Sep 25 00:40 test-data
-rw-r--r--   1 jenkins jenkins    136 Sep 25 00:40 .travis.yml
+ echo which ant
which ant
+ which ant
/usr/bin/ant
+ ant -version
Apache Ant(TM) version 1.9.6 compiled on July 20 2018
+ echo '<project default="test"><target name="test"><echo>Java ${ant.java.version}/${java.version}</echo><exec executable="javac"><arg value="-version"/></exec></target></project>'
+ ant -f build.javacheck.xml -v
Apache Ant(TM) version 1.9.6 compiled on July 20 2018
Buildfile: <https://builds.apache.org/job/POI-DSL-OpenJDK/ws/build.javacheck.xml>
Detected Java version: 1.8 in: /usr/lib/jvm/java-8-openjdk-amd64/jre
Detected OS: Linux
parsing buildfile <https://builds.apache.org/job/POI-DSL-OpenJDK/ws/build.javacheck.xml> with URI = <https://builds.apache.org/job/POI-DSL-OpenJDK/ws/build.javacheck.xml>
Project base dir set to: <https://builds.apache.org/job/POI-DSL-OpenJDK/ws/>
Build sequence for target(s) `test' is [test]
Complete build sequence is [test, ]

test:
parsing buildfile jar:file:/usr/share/ant/lib/ant.jar!/org/apache/tools/ant/antlib.xml with URI = jar:file:/usr/share/ant/lib/ant.jar!/org/apache/tools/ant/antlib.xml from a zip file
     [echo] Java 1.8/1.8.0_222
     [exec] Current OS is Linux
     [exec] Executing 'javac' with arguments:
     [exec] '-version'
     [exec]
     [exec] The ' characters around the executable and arguments are
     [exec] not part of the command.
     [exec] Error occurred during initialization of VM
     [exec] java.lang.OutOfMemoryError: unable to create new native thread
     [exec] Result: 1

BUILD SUCCESSFUL
Total time: 1 second
+ exit 0
[POI-DSL-OpenJDK] $ /home/jenkins/tools/ant/latest1.9/bin/ant -Dcoverage.enabled=true clean jenkins
Buildfile: <https://builds.apache.org/job/POI-DSL-OpenJDK/ws/build.xml>

clean:

replaceVersion:

check-jars:
    [mkdir] Created dir: <https://builds.apache.org/job/POI-DSL-OpenJDK/ws/ooxml-testlib>

fetch-jars:
      [get] Getting: https://repo1.maven.org/maven2/commons-logging/commons-logging/1.2/commons-logging-1.2.jar
      [get] To: <https://builds.apache.org/job/POI-DSL-OpenJDK/ws/lib/commons-logging-1.2.jar>
      [get] Getting: https://repo1.maven.org/maven2/commons-codec/commons-codec/1.13/commons-codec-1.13.jar
      [get] To: <https://builds.apache.org/job/POI-DSL-OpenJDK/ws/lib/commons-codec-1.13.jar>
      [get] Getting: https://repo1.maven.org/maven2/log4j/log4j/1.2.17/log4j-1.2.17.jar
      [get] To: <https://builds.apache.org/job/POI-DSL-OpenJDK/ws/lib/log4j-1.2.17.jar>
      [get] Getting: https://repo1.maven.org/maven2/junit/junit/4.12/junit-4.12.jar
      [get] To: <https://builds.apache.org/job/POI-DSL-OpenJDK/ws/lib/junit-4.12.jar>
      [get] Getting: https://repo1.maven.org/maven2/org/openjdk/jmh/jmh-core/1.19/jmh-core-1.19.jar
      [get] To: <https://builds.apache.org/job/POI-DSL-OpenJDK/ws/lib/jmh-core-1.19.jar>
      [get] Getting: https://repo1.maven.org/maven2/org/openjdk/jmh/jmh-generator-annprocess/1.19/jmh-generator-annprocess-1.19.jar
      [get] To: <https://builds.apache.org/job/POI-DSL-OpenJDK/ws/lib/jmh-generator-annprocess-1.19.jar>
      [get] Getting: https://repo1.maven.org/maven2/org/hamcrest/hamcrest-core/1.3/hamcrest-core-1.3.jar
      [get] To: <https://builds.apache.org/job/POI-DSL-OpenJDK/ws/lib/hamcrest-core-1.3.jar>
      [get] Getting: https://repo1.maven.org/maven2/org/xmlunit/xmlunit-core/2.5.1/xmlunit-core-2.5.1.jar
      [get] To: <https://builds.apache.org/job/POI-DSL-OpenJDK/ws/lib/xmlunit-core-2.5.1.jar>
      [get] Getting: https://repo1.maven.org/maven2/org/mockito/mockito-core/3.0.0/mockito-core-3.0.0.jar
      [get] To: <https://builds.apache.org/job/POI-DSL-OpenJDK/ws/lib/mockito-core-3.0.0.jar>
      [get] Getting: https://repo1.maven.org/maven2/net/bytebuddy/byte-buddy/1.10.1/byte-buddy-1.10.1.jar
      [get] To: <https://builds.apache.org/job/POI-DSL-OpenJDK/ws/lib/byte-buddy-1.10.1.jar>
      [get] Getting: https://repo1.maven.org/maven2/net/bytebuddy/byte-buddy-agent/1.10.1/byte-buddy-agent-1.10.1.jar
      [get] To: <https://builds.apache.org/job/POI-DSL-OpenJDK/ws/lib/byte-buddy-agent-1.10.1.jar>
      [get] Getting: https://repo1.maven.org/maven2/org/objenesis/objenesis/2.6/objenesis-2.6.jar
      [get] To: <https://builds.apache.org/job/POI-DSL-OpenJDK/ws/lib/objenesis-2.6.jar>
      [get] Getting: https://repo1.maven.org/maven2/org/apache/ant/ant/1.10.1/ant-1.10.1.jar
      [get] To: <https://builds.apache.org/job/POI-DSL-OpenJDK/ws/lib/ant-1.10.1.jar>
      [get] Getting: https://repo1.maven.org/maven2/org/apache/ant/ant-launcher/1.10.1/ant-launcher-1.10.1.jar
      [get] To: <https://builds.apache.org/job/POI-DSL-OpenJDK/ws/lib/ant-launcher-1.10.1.jar>
      [get] Getting: https://repo1.maven.org/maven2/org/ow2/asm/asm/7.0/asm-7.0.jar
      [get] To: <https://builds.apache.org/job/POI-DSL-OpenJDK/ws/lib/asm-7.0.jar>
      [get] Getting: https://repo1.maven.org/maven2/org/ow2/asm/asm-commons/7.0/asm-commons-7.0.jar
      [get] To: <https://builds.apache.org/job/POI-DSL-OpenJDK/ws/lib/asm-commons-7.0.jar>
      [get] Getting: https://repo1.maven.org/maven2/org/ow2/asm/asm-tree/7.0/asm-tree-7.0.jar
      [get] To: <https://builds.apache.org/job/POI-DSL-OpenJDK/ws/lib/asm-tree-7.0.jar>
      [get] Getting: https://repo1.maven.org/maven2/org/jacoco/jacoco/0.8.3/jacoco-0.8.3.zip
      [get] To: <https://builds.apache.org/job/POI-DSL-OpenJDK/ws/lib/jacoco-0.8.3.zip>
      [get] Getting: https://repo1.maven.org/maven2/org/apache/commons/commons-collections4/4.4/commons-collections4-4.4.jar
      [get] To: <https://builds.apache.org/job/POI-DSL-OpenJDK/ws/lib/commons-collections4-4.4.jar>
      [get] Getting: https://repo1.maven.org/maven2/org/apache/commons/commons-math3/3.6.1/commons-math3-3.6.1.jar
      [get] To: <https://builds.apache.org/job/POI-DSL-OpenJDK/ws/lib/commons-math3-3.6.1.jar>
      [get] Getting: https://repo1.maven.org/maven2/javax/xml/bind/jaxb-api/2.3.1/jaxb-api-2.3.1.jar
      [get] To: <https://builds.apache.org/job/POI-DSL-OpenJDK/ws/lib/jaxb-api-2.3.1.jar>
      [get] Getting: https://repo1.maven.org/maven2/com/sun/xml/bind/jaxb-impl/2.3.2/jaxb-impl-2.3.2.jar
      [get] To: <https://builds.apache.org/job/POI-DSL-OpenJDK/ws/lib/jaxb-impl-2.3.2.jar>
      [get] Getting: https://repo1.maven.org/maven2/com/sun/xml/bind/jaxb-core/2.3.0.1/jaxb-core-2.3.0.1.jar
      [get] To: <https://builds.apache.org/job/POI-DSL-OpenJDK/ws/lib/jaxb-core-2.3.0.1.jar>
      [get] Getting: https://repo1.maven.org/maven2/javax/activation/activation/1.1.1/activation-1.1.1.jar
      [get] To: <https://builds.apache.org/job/POI-DSL-OpenJDK/ws/lib/activation-1.1.1.jar>
    [unzip] Expanding: <https://builds.apache.org/job/POI-DSL-OpenJDK/ws/lib/jacoco-0.8.3.zip> into <https://builds.apache.org/job/POI-DSL-OpenJDK/ws/>
      [get] Getting: https://repo1.maven.org/maven2/org/apache/rat/apache-rat/0.12/apache-rat-0.12.jar
      [get] To: <https://builds.apache.org/job/POI-DSL-OpenJDK/ws/lib/apache-rat-0.12.jar>
      [get] Getting: https://repo1.maven.org/maven2/de/thetaphi/forbiddenapis/2.6/forbiddenapis-2.6.jar
      [get] To: <https://builds.apache.org/job/POI-DSL-OpenJDK/ws/lib/forbiddenapis-2.6.jar>
      [get] Getting: https://repo1.maven.org/maven2/org/bouncycastle/bcprov-ext-jdk15on/1.62/bcprov-ext-jdk15on-1.62.jar
      [get] To: <https://builds.apache.org/job/POI-DSL-OpenJDK/ws/compile-lib/bcprov-ext-jdk15on-1.62.jar>
      [get] Getting: https://repo1.maven.org/maven2/org/bouncycastle/bcpkix-jdk15on/1.62/bcpkix-jdk15on-1.62.jar
      [get] To: <https://builds.apache.org/job/POI-DSL-OpenJDK/ws/compile-lib/bcpkix-jdk15on-1.62.jar>
      [get] Getting: https://repo1.maven.org/maven2/org/apache/santuario/xmlsec/2.1.2/xmlsec-2.1.2.jar
      [get] To: <https://builds.apache.org/job/POI-DSL-OpenJDK/ws/compile-lib/xmlsec-2.1.2.jar>
      [get] Getting: https://repo1.maven.org/maven2/org/slf4j/slf4j-api/1.7.26/slf4j-api-1.7.26.jar
      [get] To: <https://builds.apache.org/job/POI-DSL-OpenJDK/ws/compile-lib/slf4j-api-1.7.26.jar>

check-ooxml-jars:

fetch-ooxml-jars:
      [get] Getting: https://repo1.maven.org/maven2/com/github/virtuald/curvesapi/1.06/curvesapi-1.06.jar
      [get] To: <https://builds.apache.org/job/POI-DSL-OpenJDK/716/artifact/ooxml-lib/curvesapi-1.06.jar>
      [get] Getting: https://repository.apache.org/content/repositories/releases/org/apache/xmlbeans/xmlbeans/3.1.0/xmlbeans-3.1.0.jar
      [get] To: <https://builds.apache.org/job/POI-DSL-OpenJDK/716/artifact/ooxml-lib/xmlbeans-3.1.0.jar>
      [get] Getting: https://repo1.maven.org/maven2/org/apache/commons/commons-compress/1.19/commons-compress-1.19.jar
      [get] To: <https://builds.apache.org/job/POI-DSL-OpenJDK/ws/lib/commons-compress-1.19.jar>
      [get] Getting: https://repo1.maven.org/maven2/org/reflections/reflections/0.9.11/reflections-0.9.11.jar
      [get] To: <https://builds.apache.org/job/POI-DSL-OpenJDK/ws/ooxml-testlib/reflections.jar>
      [get] Getting: https://repo1.maven.org/maven2/com/google/guava/guava/20.0/guava-20.0.jar
      [get] To: <https://builds.apache.org/job/POI-DSL-OpenJDK/ws/ooxml-testlib/guava.jar>
      [get] Getting: https://repo1.maven.org/maven2/org/javassist/javassist/3.21.0-GA/javassist-3.21.0-GA.jar
      [get] To: <https://builds.apache.org/job/POI-DSL-OpenJDK/ws/ooxml-testlib/javassist.jar>
      [get] Getting: https://repo1.maven.org/maven2/org/apache/xmlgraphics/batik-all/1.11/batik-all-1.11.jar
      [get] To: <https://builds.apache.org/job/POI-DSL-OpenJDK/ws/compile-lib/batik-all-1.11.jar>
      [get] Getting: https://repo1.maven.org/maven2/xml-apis/xml-apis-ext/1.3.04/xml-apis-ext-1.3.04.jar
      [get] To: <https://builds.apache.org/job/POI-DSL-OpenJDK/ws/compile-lib/xml-apis-ext-1.3.04.jar>
      [get] Getting: https://repo1.maven.org/maven2/org/apache/xmlgraphics/xmlgraphics-commons/2.3/xmlgraphics-commons-2.3.jar
      [get] To: <https://builds.apache.org/job/POI-DSL-OpenJDK/ws/compile-lib/xmlgraphics-commons-2.3.jar>

init:
    [mkdir] Created dir: <https://builds.apache.org/job/POI-DSL-OpenJDK/ws/build>
    [mkdir] Created dir: <https://builds.apache.org/job/POI-DSL-OpenJDK/ws/build/classes>
    [mkdir] Created dir: <https://builds.apache.org/job/POI-DSL-OpenJDK/ws/build/test-classes>
    [mkdir] Created dir: <https://builds.apache.org/job/POI-DSL-OpenJDK/ws/build/test-results>
    [mkdir] Created dir: <https://builds.apache.org/job/POI-DSL-OpenJDK/ws/build/scratchpad-classes>
    [mkdir] Created dir: <https://builds.apache.org/job/POI-DSL-OpenJDK/ws/build/scratchpad-test-classes>
    [mkdir] Created dir: <https://builds.apache.org/job/POI-DSL-OpenJDK/ws/build/scratchpad-test-results>
    [mkdir] Created dir: <https://builds.apache.org/job/POI-DSL-OpenJDK/ws/build/geometry-java>
    [mkdir] Created dir: <https://builds.apache.org/job/POI-DSL-OpenJDK/ws/build/ooxml-classes>
    [mkdir] Created dir: <https://builds.apache.org/job/POI-DSL-OpenJDK/ws/build/ooxml-test-classes>
    [mkdir] Created dir: <https://builds.apache.org/job/POI-DSL-OpenJDK/ws/build/ooxml-test-results>
    [mkdir] Created dir: <https://builds.apache.org/job/POI-DSL-OpenJDK/ws/build/excelant-classes>
    [mkdir] Created dir: <https://builds.apache.org/job/POI-DSL-OpenJDK/ws/build/excelant-test-classes>
    [mkdir] Created dir: <https://builds.apache.org/job/POI-DSL-OpenJDK/ws/build/excelant-test-results>
    [mkdir] Created dir: <https://builds.apache.org/job/POI-DSL-OpenJDK/ws/build/examples-classes>
    [mkdir] Created dir: <https://builds.apache.org/job/POI-DSL-OpenJDK/ws/build/integration-test-classes>
    [mkdir] Created dir: <https://builds.apache.org/job/POI-DSL-OpenJDK/716/artifact/build/integration-test-results>
    [mkdir] Created dir: <https://builds.apache.org/job/POI-DSL-OpenJDK/ws/build/dist>
    [mkdir] Created dir: <https://builds.apache.org/job/POI-DSL-OpenJDK/ws/build/site>
     [echo] Using Ant: Apache Ant(TM) version 1.9.13 compiled on July 10 2018 from /home/jenkins/tools/ant/latest1.9, Ant detected Java 1.8 (may be different than actual Java sometimes...)
     [echo] Using Java: 1.8.0_222/1.8.0_222-8u222-b10-1ubuntu1~16.04.1-b10/25.222-b10/OpenJDK 64-Bit Server VM from Private Build on Linux: 4.4.0-139-generic

compile-main:
    [javac] Compiling 1220 source files to <https://builds.apache.org/job/POI-DSL-OpenJDK/ws/build/classes>
    [javac] Error occurred during initialization of VM
    [javac] java.lang.OutOfMemoryError: unable to create new native thread

BUILD FAILED
<https://builds.apache.org/job/POI-DSL-OpenJDK/ws/build.xml>:1056: Compile failed; see the compiler error output for details.

Total time: 5 seconds
Build step 'Invoke Ant' marked build as failure
Skipping publisher since build result is FAILURE
Archiving artifacts
[Fast Archiver] Compressed 2.57 MB of artifacts by 97.4% relative to #715
Skipping publisher since build result is FAILURE
Recording test results
ERROR: Step ?Publish JUnit test result report? failed: No test report files were found. Configuration error?

---------------------------------------------------------------------
To unsubscribe, e-mail: [hidden email]
For additional commands, e-mail: [hidden email]

Reply | Threaded
Open this post in threaded view
|

Jenkins build is back to normal : POI-DSL-OpenJDK #717

Apache Jenkins Server
See <https://builds.apache.org/job/POI-DSL-OpenJDK/717/display/redirect?page=changes>


---------------------------------------------------------------------
To unsubscribe, e-mail: [hidden email]
For additional commands, e-mail: [hidden email]