Build failed in Jenkins: POI-DSL-OpenJDK #705

classic Classic list List threaded Threaded
2 messages Options
Reply | Threaded
Open this post in threaded view
|

Build failed in Jenkins: POI-DSL-OpenJDK #705

Apache Jenkins Server
See <https://builds.apache.org/job/POI-DSL-OpenJDK/705/display/redirect?page=changes>

Changes:

[centic] Adjust reproducer test-case for bug 59322 to not print to stdout and close resources

[centic] Fix bug 59322: NullPointerException when converting a certain Word document to HTML

------------------------------------------
[...truncated 4.61 KB...]
-rwxr-xr-x 1 root root 6504 Jul 18 21:45 javap
-rwxr-xr-x 1 root root 2806 Jul 18 20:28 java-rmi.cgi
-rwxr-xr-x 1 root root 6504 Jul 18 21:45 jcmd
-rwxr-xr-x 1 root root 6528 Jul 18 21:45 jconsole
-rwxr-xr-x 1 root root 6520 Jul 18 21:45 jdb
-rwxr-xr-x 1 root root 6504 Jul 18 21:45 jdeps
-rwxr-xr-x 1 root root 6504 Jul 18 21:45 jhat
-rwxr-xr-x 1 root root 6568 Jul 18 21:45 jinfo
lrwxrwxrwx 1 root root   14 Jul 18 21:45 jjs -> ../jre/bin/jjs
-rwxr-xr-x 1 root root 6568 Jul 18 21:45 jmap
-rwxr-xr-x 1 root root 6504 Jul 18 21:45 jps
-rwxr-xr-x 1 root root 6504 Jul 18 21:45 jrunscript
-rwxr-xr-x 1 root root 6520 Jul 18 21:45 jsadebugd
-rwxr-xr-x 1 root root 6568 Jul 18 21:45 jstack
-rwxr-xr-x 1 root root 6504 Jul 18 21:45 jstat
-rwxr-xr-x 1 root root 6504 Jul 18 21:45 jstatd
lrwxrwxrwx 1 root root   18 Jul 18 21:45 keytool -> ../jre/bin/keytool
-rwxr-xr-x 1 root root 6504 Jul 18 21:45 native2ascii
lrwxrwxrwx 1 root root   15 Jul 18 21:45 orbd -> ../jre/bin/orbd
lrwxrwxrwx 1 root root   18 Jul 18 21:45 pack200 -> ../jre/bin/pack200
lrwxrwxrwx 1 root root   21 Jul 18 21:45 policytool -> ../jre/bin/policytool
-rwxr-xr-x 1 root root 6504 Jul 18 21:45 rmic
lrwxrwxrwx 1 root root   15 Jul 18 21:45 rmid -> ../jre/bin/rmid
lrwxrwxrwx 1 root root   22 Jul 18 21:45 rmiregistry -> ../jre/bin/rmiregistry
-rwxr-xr-x 1 root root 6504 Jul 18 21:45 schemagen
-rwxr-xr-x 1 root root 6504 Jul 18 21:45 serialver
lrwxrwxrwx 1 root root   21 Jul 18 21:45 servertool -> ../jre/bin/servertool
lrwxrwxrwx 1 root root   20 Jul 18 21:45 tnameserv -> ../jre/bin/tnameserv
lrwxrwxrwx 1 root root   20 Jul 18 21:45 unpack200 -> ../jre/bin/unpack200
-rwxr-xr-x 1 root root 6504 Jul 18 21:45 wsgen
-rwxr-xr-x 1 root root 6504 Jul 18 21:45 wsimport
-rwxr-xr-x 1 root root 6504 Jul 18 21:45 xjc
+ /usr/lib/jvm/java-8-openjdk-amd64//bin/java -version
openjdk version "1.8.0_222"
OpenJDK Runtime Environment (build 1.8.0_222-8u222-b10-1ubuntu1~16.04.1-b10)
OpenJDK 64-Bit Server VM (build 25.222-b10, mixed mode)
+ echo which java
which java
+ which java
/usr/lib/jvm/java-8-openjdk-amd64//bin/java
+ java -version
openjdk version "1.8.0_222"
OpenJDK Runtime Environment (build 1.8.0_222-8u222-b10-1ubuntu1~16.04.1-b10)
OpenJDK 64-Bit Server VM (build 25.222-b10, mixed mode)
+ echo which javac
which javac
+ which javac
/usr/lib/jvm/java-8-openjdk-amd64//bin/javac
+ javac -version
javac 1.8.0_222
+ echo Ant-Home:
Ant-Home:
+ ls -al
total 520
drwxr-xr-x  17 jenkins jenkins   4096 Aug 15 13:02 .
drwxr-xr-x 738 jenkins jenkins  61440 Aug 31 12:39 ..
drwxr-xr-x  26 jenkins jenkins   4096 Aug 15 13:12 build
-rw-r--r--   1 jenkins jenkins  11321 Aug 31 12:40 build.gradle
-rw-r--r--   1 jenkins jenkins    172 Aug 15 12:41 build.javacheck.xml
-rw-r--r--   1 jenkins jenkins 142200 Aug 31 12:40 build.xml
-rw-r--r--   1 jenkins jenkins   3279 Aug 31 12:40 .classpath
drwxr-xr-x   3 jenkins jenkins   4096 Jul 21 13:09 compile-lib
-rw-r--r--   1 jenkins jenkins   5814 Jul 21 12:44 doap_POI.rdf
-rw-r--r--   1 jenkins jenkins   2596 Jul 21 12:44 file-leak-detector.exclude
-rw-r--r--   1 jenkins jenkins   6229 Jul 21 12:44 forrest.properties
-rw-r--r--   1 jenkins jenkins     53 Jul 21 12:40 .gitattributes
-rw-r--r--   1 jenkins jenkins    493 Jul 21 12:44 .gitignore
drwxr-xr-x   3 jenkins jenkins   4096 Jul 21 12:44 gradle
-rwxr-xr-x   1 jenkins jenkins   5299 Jul 21 12:40 gradlew
-rw-r--r--   1 jenkins jenkins   2260 Jul 21 12:44 gradlew.bat
drwxr-xr-x   2 jenkins jenkins   4096 Jul 21 12:44 jenkins
-rw-r--r--   1 jenkins jenkins 166411 Jul 21 12:40 KEYS
drwxr-xr-x   2 jenkins jenkins   4096 Jul 21 12:40 legal
drwxr-xr-x   2 jenkins jenkins   4096 Jul 21 13:07 lib
drwxr-xr-x   2 jenkins jenkins   4096 Aug 31 12:40 maven
drwxr-xr-x   2 jenkins jenkins   4096 Aug 31 12:40 ooxml-lib
drwxr-xr-x   2 jenkins jenkins   4096 Jul 21 12:44 ooxml-testlib
drwxr-xr-x   4 jenkins jenkins   4096 Jul 21 12:44 osgi
-rw-r--r--   1 jenkins jenkins   4813 Jul 21 12:44 patch.xml
-rw-r--r--   1 jenkins jenkins    426 Jul 21 12:40 .project
-rw-r--r--   1 jenkins jenkins   4280 Jul 21 12:44 README.rst
drwxr-xr-x   2 jenkins jenkins   4096 Jul 21 12:40 .settings
-rw-r--r--   1 jenkins jenkins    556 Jul 21 12:44 settings.gradle
drwxr-xr-x  10 jenkins jenkins   4096 Jul 21 12:40 sonar
drwxr-xr-x  15 jenkins jenkins   4096 Jul 21 12:44 src
drwxr-xr-x   4 jenkins jenkins   4096 Aug 31 12:40 .svn
drwxr-xr-x  14 jenkins jenkins   4096 Jul 21 12:43 test-data
-rw-r--r--   1 jenkins jenkins    136 Jul 21 12:40 .travis.yml
+ echo which ant
which ant
+ which ant
/usr/bin/ant
+ ant -version
Apache Ant(TM) version 1.9.6 compiled on July 20 2018
+ echo '<project default="test"><target name="test"><echo>Java ${ant.java.version}/${java.version}</echo><exec executable="javac"><arg value="-version"/></exec></target></project>'
+ ant -f build.javacheck.xml -v
Apache Ant(TM) version 1.9.6 compiled on July 20 2018
Buildfile: <https://builds.apache.org/job/POI-DSL-OpenJDK/ws/build.javacheck.xml>
Detected Java version: 1.8 in: /usr/lib/jvm/java-8-openjdk-amd64/jre
Detected OS: Linux
parsing buildfile <https://builds.apache.org/job/POI-DSL-OpenJDK/ws/build.javacheck.xml> with URI = <https://builds.apache.org/job/POI-DSL-OpenJDK/ws/build.javacheck.xml>
Project base dir set to: <https://builds.apache.org/job/POI-DSL-OpenJDK/ws/>
Build sequence for target(s) `test' is [test]
Complete build sequence is [test, ]

test:
parsing buildfile jar:file:/usr/share/ant/lib/ant.jar!/org/apache/tools/ant/antlib.xml with URI = jar:file:/usr/share/ant/lib/ant.jar!/org/apache/tools/ant/antlib.xml from a zip file
     [echo] Java 1.8/1.8.0_222
     [exec] Current OS is Linux
     [exec] Executing 'javac' with arguments:
     [exec] '-version'
     [exec]
     [exec] The ' characters around the executable and arguments are
     [exec] not part of the command.
     [exec] javac 1.8.0_222

BUILD SUCCESSFUL
Total time: 0 seconds
+ exit 0
[POI-DSL-OpenJDK] $ /home/jenkins/tools/ant/latest1.9/bin/ant -Dcoverage.enabled=true clean jenkins
Buildfile: <https://builds.apache.org/job/POI-DSL-OpenJDK/ws/build.xml>

clean:
   [delete] Deleting directory <https://builds.apache.org/job/POI-DSL-OpenJDK/ws/build>

replaceVersion:

check-jars:
   [delete] Deleting <https://builds.apache.org/job/POI-DSL-OpenJDK/ws/lib/byte-buddy-1.9.3.jar>
   [delete] Deleting <https://builds.apache.org/job/POI-DSL-OpenJDK/ws/lib/byte-buddy-agent-1.9.3.jar>
   [delete] Deleting <https://builds.apache.org/job/POI-DSL-OpenJDK/ws/lib/commons-codec-1.12.jar>
   [delete] Deleting <https://builds.apache.org/job/POI-DSL-OpenJDK/ws/lib/mockito-core-2.23.4.jar>
   [delete] Deleting <https://builds.apache.org/job/POI-DSL-OpenJDK/ws/compile-lib/bcpkix-jdk15on-1.61.jar>
   [delete] Deleting <https://builds.apache.org/job/POI-DSL-OpenJDK/ws/compile-lib/bcprov-ext-jdk15on-1.61.jar>

fetch-jars:
      [get] Destination already exists (skipping): <https://builds.apache.org/job/POI-DSL-OpenJDK/ws/lib/commons-logging-1.2.jar>
      [get] Getting: https://repo1.maven.org/maven2/commons-codec/commons-codec/1.13/commons-codec-1.13.jar
      [get] To: <https://builds.apache.org/job/POI-DSL-OpenJDK/ws/lib/commons-codec-1.13.jar>
      [get] Destination already exists (skipping): <https://builds.apache.org/job/POI-DSL-OpenJDK/ws/lib/log4j-1.2.17.jar>
      [get] Destination already exists (skipping): <https://builds.apache.org/job/POI-DSL-OpenJDK/ws/lib/junit-4.12.jar>
      [get] Destination already exists (skipping): <https://builds.apache.org/job/POI-DSL-OpenJDK/ws/lib/jmh-core-1.19.jar>
      [get] Destination already exists (skipping): <https://builds.apache.org/job/POI-DSL-OpenJDK/ws/lib/jmh-generator-annprocess-1.19.jar>
      [get] Destination already exists (skipping): <https://builds.apache.org/job/POI-DSL-OpenJDK/ws/lib/hamcrest-core-1.3.jar>
      [get] Destination already exists (skipping): <https://builds.apache.org/job/POI-DSL-OpenJDK/ws/lib/xmlunit-core-2.5.1.jar>
      [get] Getting: https://repo1.maven.org/maven2/org/mockito/mockito-core/3.0.0/mockito-core-3.0.0.jar
      [get] To: <https://builds.apache.org/job/POI-DSL-OpenJDK/ws/lib/mockito-core-3.0.0.jar>
      [get] Getting: https://repo1.maven.org/maven2/net/bytebuddy/byte-buddy/1.10.1/byte-buddy-1.10.1.jar
      [get] To: <https://builds.apache.org/job/POI-DSL-OpenJDK/ws/lib/byte-buddy-1.10.1.jar>
      [get] Getting: https://repo1.maven.org/maven2/net/bytebuddy/byte-buddy-agent/1.10.1/byte-buddy-agent-1.10.1.jar
      [get] To: <https://builds.apache.org/job/POI-DSL-OpenJDK/ws/lib/byte-buddy-agent-1.10.1.jar>
      [get] Destination already exists (skipping): <https://builds.apache.org/job/POI-DSL-OpenJDK/ws/lib/objenesis-2.6.jar>
      [get] Destination already exists (skipping): <https://builds.apache.org/job/POI-DSL-OpenJDK/ws/lib/ant-1.10.1.jar>
      [get] Destination already exists (skipping): <https://builds.apache.org/job/POI-DSL-OpenJDK/ws/lib/ant-launcher-1.10.1.jar>
      [get] Destination already exists (skipping): <https://builds.apache.org/job/POI-DSL-OpenJDK/ws/lib/asm-7.0.jar>
      [get] Destination already exists (skipping): <https://builds.apache.org/job/POI-DSL-OpenJDK/ws/lib/asm-commons-7.0.jar>
      [get] Destination already exists (skipping): <https://builds.apache.org/job/POI-DSL-OpenJDK/ws/lib/asm-tree-7.0.jar>
      [get] Destination already exists (skipping): <https://builds.apache.org/job/POI-DSL-OpenJDK/ws/lib/jacoco-0.8.3.zip>
      [get] Destination already exists (skipping): <https://builds.apache.org/job/POI-DSL-OpenJDK/ws/lib/commons-collections4-4.3.jar>
      [get] Destination already exists (skipping): <https://builds.apache.org/job/POI-DSL-OpenJDK/ws/lib/commons-math3-3.6.1.jar>
      [get] Destination already exists (skipping): <https://builds.apache.org/job/POI-DSL-OpenJDK/ws/lib/jaxb-api-2.3.1.jar>
      [get] Destination already exists (skipping): <https://builds.apache.org/job/POI-DSL-OpenJDK/ws/lib/jaxb-impl-2.3.2.jar>
      [get] Destination already exists (skipping): <https://builds.apache.org/job/POI-DSL-OpenJDK/ws/lib/jaxb-core-2.3.0.1.jar>
      [get] Destination already exists (skipping): <https://builds.apache.org/job/POI-DSL-OpenJDK/ws/lib/activation-1.1.1.jar>
    [unzip] Expanding: <https://builds.apache.org/job/POI-DSL-OpenJDK/ws/lib/jacoco-0.8.3.zip> into <https://builds.apache.org/job/POI-DSL-OpenJDK/ws/>
      [get] Destination already exists (skipping): <https://builds.apache.org/job/POI-DSL-OpenJDK/ws/lib/apache-rat-0.12.jar>
      [get] Destination already exists (skipping): <https://builds.apache.org/job/POI-DSL-OpenJDK/ws/lib/forbiddenapis-2.6.jar>
      [get] Getting: https://repo1.maven.org/maven2/org/bouncycastle/bcprov-ext-jdk15on/1.62/bcprov-ext-jdk15on-1.62.jar
      [get] To: <https://builds.apache.org/job/POI-DSL-OpenJDK/ws/compile-lib/bcprov-ext-jdk15on-1.62.jar>
      [get] Getting: https://repo1.maven.org/maven2/org/bouncycastle/bcpkix-jdk15on/1.62/bcpkix-jdk15on-1.62.jar
      [get] To: <https://builds.apache.org/job/POI-DSL-OpenJDK/ws/compile-lib/bcpkix-jdk15on-1.62.jar>
      [get] Destination already exists (skipping): <https://builds.apache.org/job/POI-DSL-OpenJDK/ws/compile-lib/xmlsec-2.1.2.jar>
      [get] Destination already exists (skipping): <https://builds.apache.org/job/POI-DSL-OpenJDK/ws/compile-lib/slf4j-api-1.7.26.jar>

check-ooxml-jars:

fetch-ooxml-jars:

init:
    [mkdir] Created dir: <https://builds.apache.org/job/POI-DSL-OpenJDK/ws/build>
    [mkdir] Created dir: <https://builds.apache.org/job/POI-DSL-OpenJDK/ws/build/classes>
    [mkdir] Created dir: <https://builds.apache.org/job/POI-DSL-OpenJDK/ws/build/test-classes>
    [mkdir] Created dir: <https://builds.apache.org/job/POI-DSL-OpenJDK/ws/build/test-results>
    [mkdir] Created dir: <https://builds.apache.org/job/POI-DSL-OpenJDK/ws/build/scratchpad-classes>
    [mkdir] Created dir: <https://builds.apache.org/job/POI-DSL-OpenJDK/ws/build/scratchpad-test-classes>
    [mkdir] Created dir: <https://builds.apache.org/job/POI-DSL-OpenJDK/ws/build/scratchpad-test-results>
    [mkdir] Created dir: <https://builds.apache.org/job/POI-DSL-OpenJDK/ws/build/geometry-java>
    [mkdir] Created dir: <https://builds.apache.org/job/POI-DSL-OpenJDK/ws/build/ooxml-classes>
    [mkdir] Created dir: <https://builds.apache.org/job/POI-DSL-OpenJDK/ws/build/ooxml-test-classes>
    [mkdir] Created dir: <https://builds.apache.org/job/POI-DSL-OpenJDK/ws/build/ooxml-test-results>
    [mkdir] Created dir: <https://builds.apache.org/job/POI-DSL-OpenJDK/ws/build/excelant-classes>
    [mkdir] Created dir: <https://builds.apache.org/job/POI-DSL-OpenJDK/ws/build/excelant-test-classes>
    [mkdir] Created dir: <https://builds.apache.org/job/POI-DSL-OpenJDK/ws/build/excelant-test-results>
    [mkdir] Created dir: <https://builds.apache.org/job/POI-DSL-OpenJDK/ws/build/examples-classes>
    [mkdir] Created dir: <https://builds.apache.org/job/POI-DSL-OpenJDK/ws/build/integration-test-classes>
    [mkdir] Created dir: <https://builds.apache.org/job/POI-DSL-OpenJDK/705/artifact/build/integration-test-results>
    [mkdir] Created dir: <https://builds.apache.org/job/POI-DSL-OpenJDK/ws/build/dist>
    [mkdir] Created dir: <https://builds.apache.org/job/POI-DSL-OpenJDK/ws/build/site>
     [echo] Using Ant: Apache Ant(TM) version 1.9.13 compiled on July 10 2018 from /home/jenkins/tools/ant/latest1.9, Ant detected Java 1.8 (may be different than actual Java sometimes...)
     [echo] Using Java: 1.8.0_222/1.8.0_222-8u222-b10-1ubuntu1~16.04.1-b10/25.222-b10/OpenJDK 64-Bit Server VM from Private Build on Linux: 4.4.0-139-generic

compile-main:
    [javac] Compiling 1217 source files to <https://builds.apache.org/job/POI-DSL-OpenJDK/ws/build/classes>
    [javac] Note: Some input files use or override a deprecated API.
    [javac] Note: Recompile with -Xlint:deprecation for details.
    [javac] Note: Some input files use unchecked or unsafe operations.
    [javac] Note: Recompile with -Xlint:unchecked for details.
    [javac] Creating empty <https://builds.apache.org/job/POI-DSL-OpenJDK/ws/build/classes/org/apache/poi/poifs/dev/package-info.class>
    [javac] Creating empty <https://builds.apache.org/job/POI-DSL-OpenJDK/ws/build/classes/org/apache/poi/poifs/common/package-info.class>
    [javac] Creating empty <https://builds.apache.org/job/POI-DSL-OpenJDK/ws/build/classes/org/apache/poi/poifs/filesystem/package-info.class>
    [javac] Creating empty <https://builds.apache.org/job/POI-DSL-OpenJDK/ws/build/classes/org/apache/poi/poifs/storage/package-info.class>
    [javac] Creating empty <https://builds.apache.org/job/POI-DSL-OpenJDK/ws/build/classes/org/apache/poi/poifs/package-info.class>
    [javac] Creating empty <https://builds.apache.org/job/POI-DSL-OpenJDK/ws/build/classes/org/apache/poi/poifs/crypt/package-info.class>
    [javac] Creating empty <https://builds.apache.org/job/POI-DSL-OpenJDK/ws/build/classes/org/apache/poi/poifs/eventfilesystem/package-info.class>
    [javac] Creating empty <https://builds.apache.org/job/POI-DSL-OpenJDK/ws/build/classes/org/apache/poi/poifs/property/package-info.class>
    [javac] Compiling 548 source files to <https://builds.apache.org/job/POI-DSL-OpenJDK/ws/build/test-classes>
    [javac] Note: Some input files use or override a deprecated API.
    [javac] Note: Recompile with -Xlint:deprecation for details.
     [copy] Copying 5 files to <https://builds.apache.org/job/POI-DSL-OpenJDK/ws/build/classes>

check-ooxml-xsds:

fetch-ooxml-xsds:

generate-geometry:

compile-scratchpad:
    [javac] Compiling 510 source files to <https://builds.apache.org/job/POI-DSL-OpenJDK/ws/build/scratchpad-classes>
    [javac] Note: Some input files use or override a deprecated API.
    [javac] Note: Recompile with -Xlint:deprecation for details.
    [javac] Note: Some input files use unchecked or unsafe operations.
    [javac] Note: Recompile with -Xlint:unchecked for details.
    [javac] Compiling 204 source files to <https://builds.apache.org/job/POI-DSL-OpenJDK/ws/build/scratchpad-test-classes>
    [javac] <https://builds.apache.org/job/POI-DSL-OpenJDK/ws/src/scratchpad/testcases/org/apache/poi/hwpf/usermodel/TestBugs.java>:49: error: package org.apache.poi.ooxml.util does not exist
    [javac] import org.apache.poi.ooxml.util.DocumentHelper;
    [javac]                                 ^
    [javac] 1 error

BUILD FAILED
<https://builds.apache.org/job/POI-DSL-OpenJDK/ws/build.xml>:1130: Compile failed; see the compiler error output for details.

Total time: 40 seconds
Build step 'Invoke Ant' marked build as failure
Skipping publisher since build result is FAILURE
Archiving artifacts
[Fast Archiver] Compressed 35.68 MB of artifacts by 99.8% relative to #704
Skipping publisher since build result is FAILURE
Recording test results
ERROR: Step ?Publish JUnit test result report? failed: No test report files were found. Configuration error?

---------------------------------------------------------------------
To unsubscribe, e-mail: [hidden email]
For additional commands, e-mail: [hidden email]

Reply | Threaded
Open this post in threaded view
|

Jenkins build is back to normal : POI-DSL-OpenJDK #706

Apache Jenkins Server
See <https://builds.apache.org/job/POI-DSL-OpenJDK/706/display/redirect?page=changes>


---------------------------------------------------------------------
To unsubscribe, e-mail: [hidden email]
For additional commands, e-mail: [hidden email]