Build failed in Jenkins: POI-DSL-OpenJDK #529

classic Classic list List threaded Threaded
2 messages Options
Reply | Threaded
Open this post in threaded view
|

Build failed in Jenkins: POI-DSL-OpenJDK #529

Apache Jenkins Server
See <https://builds.apache.org/job/POI-DSL-OpenJDK/529/display/redirect>

------------------------------------------
Started by an SCM change
[EnvInject] - Loading node environment variables.
[EnvInject] - Preparing an environment for the build.
[EnvInject] - Keeping Jenkins system variables.
[EnvInject] - Keeping Jenkins build variables.
[EnvInject] - Injecting as environment variables the properties content
LANG=en_US.UTF-8
FORREST_HOME=/home/jenkins/tools/forrest/latest

[EnvInject] - Variables injected successfully.
[EnvInject] - Injecting contributions.
Building remotely on beam15 (beam) in workspace <https://builds.apache.org/job/POI-DSL-OpenJDK/ws/>
[WS-CLEANUP] Deleting project workspace...
[WS-CLEANUP] Done
Updating https://svn.apache.org/repos/asf/poi/trunk at revision '2018-10-10T12:40:17.938 +0000'
U         src/java/org/apache/poi/util/StaxHelper.java
U         src/resources/devtools/forbidden-signatures.txt
U         src/ooxml/java/org/apache/poi/xslf/usermodel/XSLFTableCell.java
U         build.xml
 U        .

<-- Got one external: forrest.properties, svn url: https://svn.apache.org/repos/asf/poi/site/forrest.properties -->
Fetching 'https://svn.apache.org/repos/asf/poi/site/forrest.properties' at -1 into '<https://builds.apache.org/job/POI-DSL-OpenJDK/ws/forrest.properties'>
At revision 1843439


<-- Got one external: documentation, svn url: https://svn.apache.org/repos/asf/poi/site/src/documentation -->
Fetching 'https://svn.apache.org/repos/asf/poi/site/src/documentation' at -1 into '<https://builds.apache.org/job/POI-DSL-OpenJDK/ws/src/documentation'>
U         src/documentation/content/xdocs/encryption.xml
U         src/documentation/content/xdocs/changes.xml
At revision 1843439

At revision 1843439

No changes for https://svn.apache.org/repos/asf/poi/trunk since the previous build
No changes for https://svn.apache.org/repos/asf/poi/site/forrest.properties since the previous build
org.tmatesoft.svn.core.SVNException: svn: E130003: Parser configuration problem: namespace reporting is not enabled
        at org.tmatesoft.svn.core.internal.wc.SVNErrorManager.error(SVNErrorManager.java:70)
        at org.tmatesoft.svn.core.internal.wc.SVNErrorManager.error(SVNErrorManager.java:57)
        at org.tmatesoft.svn.core.internal.io.dav.http.HTTPConnection.request(HTTPConnection.java:760)
        at org.tmatesoft.svn.core.internal.io.dav.http.HTTPConnection.request(HTTPConnection.java:352)
        at org.tmatesoft.svn.core.internal.io.dav.http.HTTPConnection.request(HTTPConnection.java:340)
        at org.tmatesoft.svn.core.internal.io.dav.DAVConnection.performHttpRequest(DAVConnection.java:897)
        at org.tmatesoft.svn.core.internal.io.dav.DAVConnection.doReport(DAVConnection.java:363)
        at org.tmatesoft.svn.core.internal.io.dav.DAVConnection.doReport(DAVConnection.java:353)
        at org.tmatesoft.svn.core.internal.io.dav.DAVRepository.logImpl(DAVRepository.java:1003)
        at org.tmatesoft.svn.core.io.SVNRepository.log(SVNRepository.java:1041)
        at org.tmatesoft.svn.core.internal.wc2.remote.SvnRemoteLog.run(SvnRemoteLog.java:181)
        at org.tmatesoft.svn.core.internal.wc2.remote.SvnRemoteLog.run(SvnRemoteLog.java:35)
        at org.tmatesoft.svn.core.internal.wc2.SvnOperationRunner.run(SvnOperationRunner.java:21)
        at org.tmatesoft.svn.core.wc2.SvnOperationFactory.run(SvnOperationFactory.java:1239)
        at org.tmatesoft.svn.core.wc2.SvnOperation.run(SvnOperation.java:294)
        at org.tmatesoft.svn.core.wc.SVNLogClient.doLog(SVNLogClient.java:968)
        at org.tmatesoft.svn.core.wc.SVNLogClient.doLog(SVNLogClient.java:873)
        at hudson.scm.SubversionChangeLogBuilder.buildModule(SubversionChangeLogBuilder.java:190)
Caused: hudson.util.IOException2: revision check failed on https://svn.apache.org/repos/asf/poi/site/src/documentation
        at hudson.scm.SubversionChangeLogBuilder.buildModule(SubversionChangeLogBuilder.java:204)
        at hudson.scm.SubversionChangeLogBuilder.run(SubversionChangeLogBuilder.java:132)
        at hudson.scm.SubversionSCM.calcChangeLog(SubversionSCM.java:757)
        at hudson.scm.SubversionSCM.checkout(SubversionSCM.java:898)
        at hudson.scm.SCM.checkout(SCM.java:504)
        at hudson.model.AbstractProject.checkout(AbstractProject.java:1208)
        at hudson.model.AbstractBuild$AbstractBuildExecution.defaultCheckout(AbstractBuild.java:574)
        at jenkins.scm.SCMCheckoutStrategy.checkout(SCMCheckoutStrategy.java:86)
        at hudson.model.AbstractBuild$AbstractBuildExecution.run(AbstractBuild.java:499)
        at hudson.model.Run.execute(Run.java:1794)
        at hudson.model.FreeStyleBuild.run(FreeStyleBuild.java:43)
        at hudson.model.ResourceController.execute(ResourceController.java:97)
        at hudson.model.Executor.run(Executor.java:429)
Retrying after 10 seconds
Updating https://svn.apache.org/repos/asf/poi/trunk at revision '2018-10-10T12:40:17.938 +0000'

<-- Got one external: forrest.properties, svn url: https://svn.apache.org/repos/asf/poi/site/forrest.properties -->
Fetching 'https://svn.apache.org/repos/asf/poi/site/forrest.properties' at -1 into '<https://builds.apache.org/job/POI-DSL-OpenJDK/ws/forrest.properties'>
At revision 1843439


<-- Got one external: documentation, svn url: https://svn.apache.org/repos/asf/poi/site/src/documentation -->
Fetching 'https://svn.apache.org/repos/asf/poi/site/src/documentation' at -1 into '<https://builds.apache.org/job/POI-DSL-OpenJDK/ws/src/documentation'>
At revision 1843439

At revision 1843439

No changes for https://svn.apache.org/repos/asf/poi/trunk since the previous build
No changes for https://svn.apache.org/repos/asf/poi/site/forrest.properties since the previous build
org.tmatesoft.svn.core.SVNException: svn: E130003: Parser configuration problem: namespace reporting is not enabled
        at org.tmatesoft.svn.core.internal.wc.SVNErrorManager.error(SVNErrorManager.java:70)
        at org.tmatesoft.svn.core.internal.wc.SVNErrorManager.error(SVNErrorManager.java:57)
        at org.tmatesoft.svn.core.internal.io.dav.http.HTTPConnection.request(HTTPConnection.java:760)
        at org.tmatesoft.svn.core.internal.io.dav.http.HTTPConnection.request(HTTPConnection.java:352)
        at org.tmatesoft.svn.core.internal.io.dav.http.HTTPConnection.request(HTTPConnection.java:340)
        at org.tmatesoft.svn.core.internal.io.dav.DAVConnection.performHttpRequest(DAVConnection.java:897)
        at org.tmatesoft.svn.core.internal.io.dav.DAVConnection.doReport(DAVConnection.java:363)
        at org.tmatesoft.svn.core.internal.io.dav.DAVConnection.doReport(DAVConnection.java:353)
        at org.tmatesoft.svn.core.internal.io.dav.DAVRepository.logImpl(DAVRepository.java:1003)
        at org.tmatesoft.svn.core.io.SVNRepository.log(SVNRepository.java:1041)
        at org.tmatesoft.svn.core.internal.wc2.remote.SvnRemoteLog.run(SvnRemoteLog.java:181)
        at org.tmatesoft.svn.core.internal.wc2.remote.SvnRemoteLog.run(SvnRemoteLog.java:35)
        at org.tmatesoft.svn.core.internal.wc2.SvnOperationRunner.run(SvnOperationRunner.java:21)
        at org.tmatesoft.svn.core.wc2.SvnOperationFactory.run(SvnOperationFactory.java:1239)
        at org.tmatesoft.svn.core.wc2.SvnOperation.run(SvnOperation.java:294)
        at org.tmatesoft.svn.core.wc.SVNLogClient.doLog(SVNLogClient.java:968)
        at org.tmatesoft.svn.core.wc.SVNLogClient.doLog(SVNLogClient.java:873)
        at hudson.scm.SubversionChangeLogBuilder.buildModule(SubversionChangeLogBuilder.java:190)
Caused: hudson.util.IOException2: revision check failed on https://svn.apache.org/repos/asf/poi/site/src/documentation
        at hudson.scm.SubversionChangeLogBuilder.buildModule(SubversionChangeLogBuilder.java:204)
        at hudson.scm.SubversionChangeLogBuilder.run(SubversionChangeLogBuilder.java:132)
        at hudson.scm.SubversionSCM.calcChangeLog(SubversionSCM.java:757)
        at hudson.scm.SubversionSCM.checkout(SubversionSCM.java:898)
        at hudson.scm.SCM.checkout(SCM.java:504)
        at hudson.model.AbstractProject.checkout(AbstractProject.java:1208)
        at hudson.model.AbstractBuild$AbstractBuildExecution.defaultCheckout(AbstractBuild.java:574)
        at jenkins.scm.SCMCheckoutStrategy.checkout(SCMCheckoutStrategy.java:86)
        at hudson.model.AbstractBuild$AbstractBuildExecution.run(AbstractBuild.java:499)
        at hudson.model.Run.execute(Run.java:1794)
        at hudson.model.FreeStyleBuild.run(FreeStyleBuild.java:43)
        at hudson.model.ResourceController.execute(ResourceController.java:97)
        at hudson.model.Executor.run(Executor.java:429)
Retrying after 10 seconds
Updating https://svn.apache.org/repos/asf/poi/trunk at revision '2018-10-10T12:40:17.938 +0000'

<-- Got one external: forrest.properties, svn url: https://svn.apache.org/repos/asf/poi/site/forrest.properties -->
Fetching 'https://svn.apache.org/repos/asf/poi/site/forrest.properties' at -1 into '<https://builds.apache.org/job/POI-DSL-OpenJDK/ws/forrest.properties'>
At revision 1843439


<-- Got one external: documentation, svn url: https://svn.apache.org/repos/asf/poi/site/src/documentation -->
Fetching 'https://svn.apache.org/repos/asf/poi/site/src/documentation' at -1 into '<https://builds.apache.org/job/POI-DSL-OpenJDK/ws/src/documentation'>
At revision 1843439

At revision 1843439

No changes for https://svn.apache.org/repos/asf/poi/trunk since the previous build
No changes for https://svn.apache.org/repos/asf/poi/site/forrest.properties since the previous build
org.tmatesoft.svn.core.SVNException: svn: E130003: Parser configuration problem: namespace reporting is not enabled
        at org.tmatesoft.svn.core.internal.wc.SVNErrorManager.error(SVNErrorManager.java:70)
        at org.tmatesoft.svn.core.internal.wc.SVNErrorManager.error(SVNErrorManager.java:57)
        at org.tmatesoft.svn.core.internal.io.dav.http.HTTPConnection.request(HTTPConnection.java:760)
        at org.tmatesoft.svn.core.internal.io.dav.http.HTTPConnection.request(HTTPConnection.java:352)
        at org.tmatesoft.svn.core.internal.io.dav.http.HTTPConnection.request(HTTPConnection.java:340)
        at org.tmatesoft.svn.core.internal.io.dav.DAVConnection.performHttpRequest(DAVConnection.java:897)
        at org.tmatesoft.svn.core.internal.io.dav.DAVConnection.doReport(DAVConnection.java:363)
        at org.tmatesoft.svn.core.internal.io.dav.DAVConnection.doReport(DAVConnection.java:353)
        at org.tmatesoft.svn.core.internal.io.dav.DAVRepository.logImpl(DAVRepository.java:1003)
        at org.tmatesoft.svn.core.io.SVNRepository.log(SVNRepository.java:1041)
        at org.tmatesoft.svn.core.internal.wc2.remote.SvnRemoteLog.run(SvnRemoteLog.java:181)
        at org.tmatesoft.svn.core.internal.wc2.remote.SvnRemoteLog.run(SvnRemoteLog.java:35)
        at org.tmatesoft.svn.core.internal.wc2.SvnOperationRunner.run(SvnOperationRunner.java:21)
        at org.tmatesoft.svn.core.wc2.SvnOperationFactory.run(SvnOperationFactory.java:1239)
        at org.tmatesoft.svn.core.wc2.SvnOperation.run(SvnOperation.java:294)
        at org.tmatesoft.svn.core.wc.SVNLogClient.doLog(SVNLogClient.java:968)
        at org.tmatesoft.svn.core.wc.SVNLogClient.doLog(SVNLogClient.java:873)
        at hudson.scm.SubversionChangeLogBuilder.buildModule(SubversionChangeLogBuilder.java:190)
Caused: hudson.util.IOException2: revision check failed on https://svn.apache.org/repos/asf/poi/site/src/documentation
        at hudson.scm.SubversionChangeLogBuilder.buildModule(SubversionChangeLogBuilder.java:204)
        at hudson.scm.SubversionChangeLogBuilder.run(SubversionChangeLogBuilder.java:132)
        at hudson.scm.SubversionSCM.calcChangeLog(SubversionSCM.java:757)
        at hudson.scm.SubversionSCM.checkout(SubversionSCM.java:898)
        at hudson.scm.SCM.checkout(SCM.java:504)
        at hudson.model.AbstractProject.checkout(AbstractProject.java:1208)
        at hudson.model.AbstractBuild$AbstractBuildExecution.defaultCheckout(AbstractBuild.java:574)
        at jenkins.scm.SCMCheckoutStrategy.checkout(SCMCheckoutStrategy.java:86)
        at hudson.model.AbstractBuild$AbstractBuildExecution.run(AbstractBuild.java:499)
        at hudson.model.Run.execute(Run.java:1794)
        at hudson.model.FreeStyleBuild.run(FreeStyleBuild.java:43)
        at hudson.model.ResourceController.execute(ResourceController.java:97)
        at hudson.model.Executor.run(Executor.java:429)
Retrying after 10 seconds
Updating https://svn.apache.org/repos/asf/poi/trunk at revision '2018-10-10T12:40:17.938 +0000'

<-- Got one external: forrest.properties, svn url: https://svn.apache.org/repos/asf/poi/site/forrest.properties -->
Fetching 'https://svn.apache.org/repos/asf/poi/site/forrest.properties' at -1 into '<https://builds.apache.org/job/POI-DSL-OpenJDK/ws/forrest.properties'>
At revision 1843439


<-- Got one external: documentation, svn url: https://svn.apache.org/repos/asf/poi/site/src/documentation -->
Fetching 'https://svn.apache.org/repos/asf/poi/site/src/documentation' at -1 into '<https://builds.apache.org/job/POI-DSL-OpenJDK/ws/src/documentation'>
At revision 1843439

At revision 1843439

No changes for https://svn.apache.org/repos/asf/poi/trunk since the previous build
No changes for https://svn.apache.org/repos/asf/poi/site/forrest.properties since the previous build
org.tmatesoft.svn.core.SVNException: svn: E130003: Parser configuration problem: namespace reporting is not enabled
        at org.tmatesoft.svn.core.internal.wc.SVNErrorManager.error(SVNErrorManager.java:70)
        at org.tmatesoft.svn.core.internal.wc.SVNErrorManager.error(SVNErrorManager.java:57)
        at org.tmatesoft.svn.core.internal.io.dav.http.HTTPConnection.request(HTTPConnection.java:760)
        at org.tmatesoft.svn.core.internal.io.dav.http.HTTPConnection.request(HTTPConnection.java:352)
        at org.tmatesoft.svn.core.internal.io.dav.http.HTTPConnection.request(HTTPConnection.java:340)
        at org.tmatesoft.svn.core.internal.io.dav.DAVConnection.performHttpRequest(DAVConnection.java:897)
        at org.tmatesoft.svn.core.internal.io.dav.DAVConnection.doReport(DAVConnection.java:363)
        at org.tmatesoft.svn.core.internal.io.dav.DAVConnection.doReport(DAVConnection.java:353)
        at org.tmatesoft.svn.core.internal.io.dav.DAVRepository.logImpl(DAVRepository.java:1003)
        at org.tmatesoft.svn.core.io.SVNRepository.log(SVNRepository.java:1041)
        at org.tmatesoft.svn.core.internal.wc2.remote.SvnRemoteLog.run(SvnRemoteLog.java:181)
        at org.tmatesoft.svn.core.internal.wc2.remote.SvnRemoteLog.run(SvnRemoteLog.java:35)
        at org.tmatesoft.svn.core.internal.wc2.SvnOperationRunner.run(SvnOperationRunner.java:21)
        at org.tmatesoft.svn.core.wc2.SvnOperationFactory.run(SvnOperationFactory.java:1239)
        at org.tmatesoft.svn.core.wc2.SvnOperation.run(SvnOperation.java:294)
        at org.tmatesoft.svn.core.wc.SVNLogClient.doLog(SVNLogClient.java:968)
        at org.tmatesoft.svn.core.wc.SVNLogClient.doLog(SVNLogClient.java:873)
        at hudson.scm.SubversionChangeLogBuilder.buildModule(SubversionChangeLogBuilder.java:190)
Caused: hudson.util.IOException2: revision check failed on https://svn.apache.org/repos/asf/poi/site/src/documentation
        at hudson.scm.SubversionChangeLogBuilder.buildModule(SubversionChangeLogBuilder.java:204)
        at hudson.scm.SubversionChangeLogBuilder.run(SubversionChangeLogBuilder.java:132)
        at hudson.scm.SubversionSCM.calcChangeLog(SubversionSCM.java:757)
        at hudson.scm.SubversionSCM.checkout(SubversionSCM.java:898)
        at hudson.scm.SCM.checkout(SCM.java:504)
        at hudson.model.AbstractProject.checkout(AbstractProject.java:1208)
        at hudson.model.AbstractBuild$AbstractBuildExecution.defaultCheckout(AbstractBuild.java:574)
        at jenkins.scm.SCMCheckoutStrategy.checkout(SCMCheckoutStrategy.java:86)
        at hudson.model.AbstractBuild$AbstractBuildExecution.run(AbstractBuild.java:499)
        at hudson.model.Run.execute(Run.java:1794)
        at hudson.model.FreeStyleBuild.run(FreeStyleBuild.java:43)
        at hudson.model.ResourceController.execute(ResourceController.java:97)
        at hudson.model.Executor.run(Executor.java:429)
Skipping publisher since build result is FAILURE
Archiving artifacts
[Fast Archiver] Compressed 216.65 MB of artifacts by 43.9% relative to #528
Skipping publisher since build result is FAILURE
Recording test results
ERROR: Step ‘Publish JUnit test result report’ failed: Test reports were found but none of them are new. Did leafNodes run?
For example, <https://builds.apache.org/job/POI-DSL-OpenJDK/ws/build/excelant-test-results/TEST-org.apache.poi.ss.examples.formula.TestExcelAntUserDefinedFunction.xml> is 4 days 11 hr old


---------------------------------------------------------------------
To unsubscribe, e-mail: [hidden email]
For additional commands, e-mail: [hidden email]

Reply | Threaded
Open this post in threaded view
|

Jenkins build is back to normal : POI-DSL-OpenJDK #530

Apache Jenkins Server
See <https://builds.apache.org/job/POI-DSL-OpenJDK/530/display/redirect>


---------------------------------------------------------------------
To unsubscribe, e-mail: [hidden email]
For additional commands, e-mail: [hidden email]