Build failed in Jenkins: POI-DSL-OpenJDK #524

classic Classic list List threaded Threaded
2 messages Options
Reply | Threaded
Open this post in threaded view
|

Build failed in Jenkins: POI-DSL-OpenJDK #524

Apache Jenkins Server
See <https://builds.apache.org/job/POI-DSL-OpenJDK/524/display/redirect?page=changes>

Changes:

[abearez] more XDDF improvements based on SO examples

------------------------------------------
[...truncated 3.50 KB...]
+ echo Java-Home: /usr/lib/jvm/java-8-openjdk-amd64/
Java-Home: /usr/lib/jvm/java-8-openjdk-amd64/
+ ls -al /usr/lib/jvm/java-8-openjdk-amd64//
total 28
drwxr-xr-x 7 root root 4096 Aug 10 06:34 .
drwxr-xr-x 4 root root 4096 Aug 10 06:34 ..
lrwxrwxrwx 1 root root   22 Jul 30 22:28 ASSEMBLY_EXCEPTION -> jre/ASSEMBLY_EXCEPTION
drwxr-xr-x 2 root root 4096 Aug 10 06:34 bin
lrwxrwxrwx 1 root root   41 Mar 14  2018 docs -> ../../../share/doc/openjdk-8-jre-headless
drwxr-xr-x 3 root root 4096 Aug 10 06:34 include
drwxr-xr-x 5 root root 4096 Aug 10 06:34 jre
drwxr-xr-x 3 root root 4096 Aug 10 06:34 lib
drwxr-xr-x 4 root root 4096 Apr 24 05:26 man
lrwxrwxrwx 1 root root   20 Jul 30 22:28 src.zip -> ../openjdk-8/src.zip
lrwxrwxrwx 1 root root   22 Jul 30 22:28 THIRD_PARTY_README -> jre/THIRD_PARTY_README
+ ls -al /usr/lib/jvm/java-8-openjdk-amd64//bin
total 244
drwxr-xr-x 2 root root 4096 Aug 10 06:34 .
drwxr-xr-x 7 root root 4096 Aug 10 06:34 ..
-rwxr-xr-x 1 root root 6504 Jul 30 22:29 appletviewer
-rwxr-xr-x 1 root root 6504 Jul 30 22:29 extcheck
-rwxr-xr-x 1 root root 6504 Jul 30 22:29 idlj
-rwxr-xr-x 1 root root 6504 Jul 30 22:29 jar
-rwxr-xr-x 1 root root 6504 Jul 30 22:29 jarsigner
lrwxrwxrwx 1 root root   15 Jul 30 22:28 java -> ../jre/bin/java
-rwxr-xr-x 1 root root 6504 Jul 30 22:29 javac
-rwxr-xr-x 1 root root 6504 Jul 30 22:29 javadoc
-rwxr-xr-x 1 root root 6504 Jul 30 22:29 javah
-rwxr-xr-x 1 root root 6504 Jul 30 22:29 javap
-rwxr-xr-x 1 root root 2806 Jul 30 21:14 java-rmi.cgi
-rwxr-xr-x 1 root root 6504 Jul 30 22:29 jcmd
-rwxr-xr-x 1 root root 6528 Jul 30 22:29 jconsole
-rwxr-xr-x 1 root root 6520 Jul 30 22:29 jdb
-rwxr-xr-x 1 root root 6504 Jul 30 22:29 jdeps
-rwxr-xr-x 1 root root 6504 Jul 30 22:29 jhat
-rwxr-xr-x 1 root root 6568 Jul 30 22:29 jinfo
lrwxrwxrwx 1 root root   14 Jul 30 22:28 jjs -> ../jre/bin/jjs
-rwxr-xr-x 1 root root 6568 Jul 30 22:29 jmap
-rwxr-xr-x 1 root root 6504 Jul 30 22:29 jps
-rwxr-xr-x 1 root root 6504 Jul 30 22:29 jrunscript
-rwxr-xr-x 1 root root 6520 Jul 30 22:29 jsadebugd
-rwxr-xr-x 1 root root 6568 Jul 30 22:29 jstack
-rwxr-xr-x 1 root root 6504 Jul 30 22:29 jstat
-rwxr-xr-x 1 root root 6504 Jul 30 22:29 jstatd
lrwxrwxrwx 1 root root   18 Jul 30 22:28 keytool -> ../jre/bin/keytool
-rwxr-xr-x 1 root root 6504 Jul 30 22:29 native2ascii
lrwxrwxrwx 1 root root   15 Jul 30 22:28 orbd -> ../jre/bin/orbd
lrwxrwxrwx 1 root root   18 Jul 30 22:28 pack200 -> ../jre/bin/pack200
lrwxrwxrwx 1 root root   21 Jul 30 22:28 policytool -> ../jre/bin/policytool
-rwxr-xr-x 1 root root 6504 Jul 30 22:29 rmic
lrwxrwxrwx 1 root root   15 Jul 30 22:28 rmid -> ../jre/bin/rmid
lrwxrwxrwx 1 root root   22 Jul 30 22:28 rmiregistry -> ../jre/bin/rmiregistry
-rwxr-xr-x 1 root root 6504 Jul 30 22:29 schemagen
-rwxr-xr-x 1 root root 6504 Jul 30 22:29 serialver
lrwxrwxrwx 1 root root   21 Jul 30 22:28 servertool -> ../jre/bin/servertool
lrwxrwxrwx 1 root root   20 Jul 30 22:28 tnameserv -> ../jre/bin/tnameserv
lrwxrwxrwx 1 root root   20 Jul 30 22:28 unpack200 -> ../jre/bin/unpack200
-rwxr-xr-x 1 root root 6504 Jul 30 22:29 wsgen
-rwxr-xr-x 1 root root 6504 Jul 30 22:29 wsimport
-rwxr-xr-x 1 root root 6504 Jul 30 22:29 xjc
+ /usr/lib/jvm/java-8-openjdk-amd64//bin/java -version
openjdk version "1.8.0_181"
OpenJDK Runtime Environment (build 1.8.0_181-8u181-b13-0ubuntu0.16.04.1-b13)
OpenJDK 64-Bit Server VM (build 25.181-b13, mixed mode)
+ echo which java
which java
+ which java
/usr/lib/jvm/java-8-openjdk-amd64//bin/java
+ java -version
openjdk version "1.8.0_181"
OpenJDK Runtime Environment (build 1.8.0_181-8u181-b13-0ubuntu0.16.04.1-b13)
OpenJDK 64-Bit Server VM (build 25.181-b13, mixed mode)
+ echo which javac
which javac
+ which javac
/usr/lib/jvm/java-8-openjdk-amd64//bin/javac
+ javac -version
javac 1.8.0_181
+ echo '<project default="test"><target name="test"><echo>Java ${ant.java.version}/${java.version}</echo><exec executable="javac"><arg value="-version"/></exec></target></project>'
+ ant -f build.javacheck.xml -v
Apache Ant(TM) version 1.9.6 compiled on July 20 2018
Buildfile: <https://builds.apache.org/job/POI-DSL-OpenJDK/ws/build.javacheck.xml>
Detected Java version: 1.8 in: /usr/lib/jvm/java-8-openjdk-amd64/jre
Detected OS: Linux
parsing buildfile <https://builds.apache.org/job/POI-DSL-OpenJDK/ws/build.javacheck.xml> with URI = <https://builds.apache.org/job/POI-DSL-OpenJDK/ws/build.javacheck.xml>
Project base dir set to: <https://builds.apache.org/job/POI-DSL-OpenJDK/ws/>
Build sequence for target(s) `test' is [test]
Complete build sequence is [test, ]

test:
parsing buildfile jar:file:/usr/share/ant/lib/ant.jar!/org/apache/tools/ant/antlib.xml with URI = jar:file:/usr/share/ant/lib/ant.jar!/org/apache/tools/ant/antlib.xml from a zip file
     [echo] Java 1.8/1.8.0_181
     [exec] Current OS is Linux
     [exec] Executing 'javac' with arguments:
     [exec] '-version'
     [exec]
     [exec] The ' characters around the executable and arguments are
     [exec] not part of the command.
     [exec] javac 1.8.0_181

BUILD SUCCESSFUL
Total time: 0 seconds
+ exit 0
[POI-DSL-OpenJDK] $ /home/jenkins/tools/ant/apache-ant-1.9.9/bin/ant -Dcoverage.enabled=true clean jenkins
Buildfile: <https://builds.apache.org/job/POI-DSL-OpenJDK/ws/build.xml>

clean:
   [delete] Deleting directory <https://builds.apache.org/job/POI-DSL-OpenJDK/ws/build>

check-jars:

fetch-jars:

check-ooxml-jars:

fetch-ooxml-jars:

init:
    [mkdir] Created dir: <https://builds.apache.org/job/POI-DSL-OpenJDK/ws/build>
    [mkdir] Created dir: <https://builds.apache.org/job/POI-DSL-OpenJDK/ws/build/classes>
    [mkdir] Created dir: <https://builds.apache.org/job/POI-DSL-OpenJDK/ws/build/test-classes>
    [mkdir] Created dir: <https://builds.apache.org/job/POI-DSL-OpenJDK/ws/build/test-results>
    [mkdir] Created dir: <https://builds.apache.org/job/POI-DSL-OpenJDK/ws/build/scratchpad-classes>
    [mkdir] Created dir: <https://builds.apache.org/job/POI-DSL-OpenJDK/ws/build/scratchpad-test-classes>
    [mkdir] Created dir: <https://builds.apache.org/job/POI-DSL-OpenJDK/ws/build/scratchpad-test-results>
    [mkdir] Created dir: <https://builds.apache.org/job/POI-DSL-OpenJDK/ws/build/geometry-java>
    [mkdir] Created dir: <https://builds.apache.org/job/POI-DSL-OpenJDK/ws/build/ooxml-classes>
    [mkdir] Created dir: <https://builds.apache.org/job/POI-DSL-OpenJDK/ws/build/ooxml-test-classes>
    [mkdir] Created dir: <https://builds.apache.org/job/POI-DSL-OpenJDK/ws/build/ooxml-test-results>
    [mkdir] Created dir: <https://builds.apache.org/job/POI-DSL-OpenJDK/ws/build/excelant-classes>
    [mkdir] Created dir: <https://builds.apache.org/job/POI-DSL-OpenJDK/ws/build/excelant-test-classes>
    [mkdir] Created dir: <https://builds.apache.org/job/POI-DSL-OpenJDK/ws/build/excelant-test-results>
    [mkdir] Created dir: <https://builds.apache.org/job/POI-DSL-OpenJDK/ws/build/examples-classes>
    [mkdir] Created dir: <https://builds.apache.org/job/POI-DSL-OpenJDK/ws/build/integration-test-classes>
    [mkdir] Created dir: <https://builds.apache.org/job/POI-DSL-OpenJDK/524/artifact/build/integration-test-results>
    [mkdir] Created dir: <https://builds.apache.org/job/POI-DSL-OpenJDK/ws/build/dist>
    [mkdir] Created dir: <https://builds.apache.org/job/POI-DSL-OpenJDK/ws/build/site>
     [echo] Using Ant: Apache Ant(TM) version 1.9.9 compiled on February 2 2017 from /home/jenkins/tools/ant/apache-ant-1.9.9, Ant detected Java 1.8 (may be different than actual Java sometimes...)
     [echo] Using Java: 1.8.0_181/1.8.0_181-8u181-b13-0ubuntu0.16.04.1-b13/25.181-b13/OpenJDK 64-Bit Server VM from Oracle Corporation on Linux: 4.13.0-1012-gcp

compile-main:
    [javac] Compiling 1209 source files to <https://builds.apache.org/job/POI-DSL-OpenJDK/ws/build/classes>
    [javac] Note: Some input files use or override a deprecated API.
    [javac] Note: Recompile with -Xlint:deprecation for details.
    [javac] Note: Some input files use unchecked or unsafe operations.
    [javac] Note: Recompile with -Xlint:unchecked for details.
    [javac] Creating empty <https://builds.apache.org/job/POI-DSL-OpenJDK/ws/build/classes/org/apache/poi/poifs/dev/package-info.class>
    [javac] Creating empty <https://builds.apache.org/job/POI-DSL-OpenJDK/ws/build/classes/org/apache/poi/poifs/common/package-info.class>
    [javac] Creating empty <https://builds.apache.org/job/POI-DSL-OpenJDK/ws/build/classes/org/apache/poi/poifs/filesystem/package-info.class>
    [javac] Creating empty <https://builds.apache.org/job/POI-DSL-OpenJDK/ws/build/classes/org/apache/poi/poifs/storage/package-info.class>
    [javac] Creating empty <https://builds.apache.org/job/POI-DSL-OpenJDK/ws/build/classes/org/apache/poi/poifs/package-info.class>
    [javac] Creating empty <https://builds.apache.org/job/POI-DSL-OpenJDK/ws/build/classes/org/apache/poi/poifs/crypt/package-info.class>
    [javac] Creating empty <https://builds.apache.org/job/POI-DSL-OpenJDK/ws/build/classes/org/apache/poi/poifs/eventfilesystem/package-info.class>
    [javac] Creating empty <https://builds.apache.org/job/POI-DSL-OpenJDK/ws/build/classes/org/apache/poi/poifs/property/package-info.class>
    [javac] Compiling 533 source files to <https://builds.apache.org/job/POI-DSL-OpenJDK/ws/build/test-classes>
    [javac] Note: Some input files use or override a deprecated API.
    [javac] Note: Recompile with -Xlint:deprecation for details.
    [javac] Note: <https://builds.apache.org/job/POI-DSL-OpenJDK/ws/src/testcases/org/apache/poi/sl/usermodel/BaseTestSlideShow.java> uses unchecked or unsafe operations.
    [javac] Note: Recompile with -Xlint:unchecked for details.
     [copy] Copying 4 files to <https://builds.apache.org/job/POI-DSL-OpenJDK/ws/build/classes>

check-ooxml-xsds:

fetch-ooxml-xsds:

generate-geometry:

compile-scratchpad:
    [javac] Compiling 488 source files to <https://builds.apache.org/job/POI-DSL-OpenJDK/ws/build/scratchpad-classes>
    [javac] Note: Some input files use or override a deprecated API.
    [javac] Note: Recompile with -Xlint:deprecation for details.
    [javac] Note: <https://builds.apache.org/job/POI-DSL-OpenJDK/ws/src/scratchpad/src/org/apache/poi/extractor/ole2/OLE2ScratchpadExtractorFactory.java> uses unchecked or unsafe operations.
    [javac] Note: Recompile with -Xlint:unchecked for details.
    [javac] Compiling 191 source files to <https://builds.apache.org/job/POI-DSL-OpenJDK/ws/build/scratchpad-test-classes>
    [javac] Note: Some input files use or override a deprecated API.
    [javac] Note: Recompile with -Xlint:deprecation for details.
    [javac] Note: <https://builds.apache.org/job/POI-DSL-OpenJDK/ws/src/scratchpad/testcases/org/apache/poi/hslf/usermodel/TestBugs.java> uses unchecked or unsafe operations.
    [javac] Note: Recompile with -Xlint:unchecked for details.
     [copy] Copying 2 files to <https://builds.apache.org/job/POI-DSL-OpenJDK/ws/build/scratchpad-classes>

check-compiled-ooxml-xsds:

compile-ooxml-xsds:
    [mkdir] Created dir: <https://builds.apache.org/job/POI-DSL-OpenJDK/ws/build/xmlbean-xsds>
    [mkdir] Created dir: <https://builds.apache.org/job/POI-DSL-OpenJDK/ws/build/xmlbean-sources>
    [mkdir] Created dir: <https://builds.apache.org/job/POI-DSL-OpenJDK/ws/build/xmlbean-classes>
     [copy] Copying 3 files to <https://builds.apache.org/job/POI-DSL-OpenJDK/ws/build/xmlbean-xsds>
     [copy] Copying 87 resources to <https://builds.apache.org/job/POI-DSL-OpenJDK/ws/build/xmlbean-xsds>
  [xmlbean] Time to build schema type system: 1.554 seconds
  [xmlbean] Time to generate code: 3.614 seconds
     [echo] Forking javac with max heap size 1536m
    [javac] Compiling 4576 source files to <https://builds.apache.org/job/POI-DSL-OpenJDK/ws/build/xmlbean-classes>
    [javac] Note: Some input files use unchecked or unsafe operations.
    [javac] Note: Recompile with -Xlint:unchecked for details.
      [jar] Building jar: <https://builds.apache.org/job/POI-DSL-OpenJDK/524/artifact/ooxml-lib/ooxml-schemas-1.4.jar>
      [jar] Building jar: <https://builds.apache.org/job/POI-DSL-OpenJDK/524/artifact/ooxml-lib/ooxml-schemas-1.4-sources.jar>
   [delete] Deleting directory <https://builds.apache.org/job/POI-DSL-OpenJDK/ws/build/xmlbean-xsds>
   [delete] Deleting directory <https://builds.apache.org/job/POI-DSL-OpenJDK/ws/build/xmlbean-sources>
   [delete] Deleting directory <https://builds.apache.org/job/POI-DSL-OpenJDK/ws/build/xmlbean-classes>
    [mkdir] Created dir: <https://builds.apache.org/job/POI-DSL-OpenJDK/ws/build/xmlbean-xsds>
    [mkdir] Created dir: <https://builds.apache.org/job/POI-DSL-OpenJDK/ws/build/xmlbean-sources>
    [mkdir] Created dir: <https://builds.apache.org/job/POI-DSL-OpenJDK/ws/build/xmlbean-classes>
     [copy] Copying 10 files to <https://builds.apache.org/job/POI-DSL-OpenJDK/ws/build/xmlbean-xsds>
     [copy] Copying 2 resources to <https://builds.apache.org/job/POI-DSL-OpenJDK/ws/build/xmlbean-xsds>
  [xmlbean] Time to build schema type system: 0.561 seconds
  [xmlbean] Time to generate code: 0.23 seconds
     [echo] Forking javac with max heap size 1536m
    [javac] Compiling 372 source files to <https://builds.apache.org/job/POI-DSL-OpenJDK/ws/build/xmlbean-classes>
    [javac] Note: Some input files use unchecked or unsafe operations.
    [javac] Note: Recompile with -Xlint:unchecked for details.
      [jar] Building jar: <https://builds.apache.org/job/POI-DSL-OpenJDK/524/artifact/ooxml-lib/ooxml-security-1.1.jar>
      [jar] Building jar: <https://builds.apache.org/job/POI-DSL-OpenJDK/524/artifact/ooxml-lib/ooxml-security-1.1-sources.jar>
   [delete] Deleting directory <https://builds.apache.org/job/POI-DSL-OpenJDK/ws/build/xmlbean-xsds>
   [delete] Deleting directory <https://builds.apache.org/job/POI-DSL-OpenJDK/ws/build/xmlbean-sources>
   [delete] Deleting directory <https://builds.apache.org/job/POI-DSL-OpenJDK/ws/build/xmlbean-classes>

compile-ooxml:
    [javac] Compiling 589 source files to <https://builds.apache.org/job/POI-DSL-OpenJDK/ws/build/ooxml-classes>
    [javac] <https://builds.apache.org/job/POI-DSL-OpenJDK/ws/src/ooxml/java/org/apache/poi/xssf/usermodel/XSSFChart.java>:272: error: getTitle() in XSSFChart cannot override getTitle() in XDDFChart
    [javac]     public XSSFRichTextString getTitle() {
    [javac]                               ^
    [javac]   return type XSSFRichTextString is not compatible with XDDFTitle
    [javac] <https://builds.apache.org/job/POI-DSL-OpenJDK/ws/src/ooxml/java/org/apache/poi/xddf/usermodel/chart/XDDFDateAxis.java>:40: error: XDDFDateAxis is not abstract and does not override abstract method setTitle(String) in XDDFChartAxis
    [javac] public class XDDFDateAxis extends XDDFChartAxis {
    [javac]        ^
    [javac] <https://builds.apache.org/job/POI-DSL-OpenJDK/ws/src/ooxml/java/org/apache/poi/xddf/usermodel/chart/XDDFSeriesAxis.java>:36: error: XDDFSeriesAxis is not abstract and does not override abstract method setTitle(String) in XDDFChartAxis
    [javac] public class XDDFSeriesAxis extends XDDFChartAxis {
    [javac]        ^
    [javac] <https://builds.apache.org/job/POI-DSL-OpenJDK/ws/src/ooxml/java/org/apache/poi/xslf/usermodel/XSLFChart.java>:72: error: getTitle() in XSLFChart cannot override getTitle() in XDDFChart
    [javac]     public XSLFTextShape getTitle() {
    [javac]                          ^
    [javac]   return type XSLFTextShape is not compatible with XDDFTitle
    [javac] Note: Some input files use or override a deprecated API.
    [javac] Note: Recompile with -Xlint:deprecation for details.
    [javac] Note: <https://builds.apache.org/job/POI-DSL-OpenJDK/ws/src/ooxml/java/org/apache/poi/poifs/crypt/dsig/SignaturePart.java> uses unchecked or unsafe operations.
    [javac] Note: Recompile with -Xlint:unchecked for details.
    [javac] 4 errors

BUILD FAILED
<https://builds.apache.org/job/POI-DSL-OpenJDK/ws/build.xml>:1146: Compile failed; see the compiler error output for details.

Total time: 1 minute 31 seconds
Build step 'Invoke Ant' marked build as failure
Skipping publisher since build result is FAILURE
Archiving artifacts
[Fast Archiver] Compressed 59.98 MB of artifacts by 59.5% relative to #523
Skipping publisher since build result is FAILURE
Recording test results
ERROR: Step ‘Publish JUnit test result report’ failed: No test report files were found. Configuration error?

---------------------------------------------------------------------
To unsubscribe, e-mail: [hidden email]
For additional commands, e-mail: [hidden email]

Reply | Threaded
Open this post in threaded view
|

Jenkins build is back to normal : POI-DSL-OpenJDK #525

Apache Jenkins Server
See <https://builds.apache.org/job/POI-DSL-OpenJDK/525/display/redirect?page=changes>


---------------------------------------------------------------------
To unsubscribe, e-mail: [hidden email]
For additional commands, e-mail: [hidden email]