Build failed in Jenkins: POI-DSL-OpenJDK #357

classic Classic list List threaded Threaded
3 messages Options
Reply | Threaded
Open this post in threaded view
|

Build failed in Jenkins: POI-DSL-OpenJDK #357

Apache Jenkins Server
See <https://builds.apache.org/job/POI-DSL-OpenJDK/357/display/redirect>

------------------------------------------
[...truncated 20.58 KB...]
        at org.tmatesoft.svn.core.internal.wc17.db.SVNWCDb.obtainWCLock(SVNWCDb.java:5867)
        at org.tmatesoft.svn.core.internal.wc17.SVNWCContext.acquireWriteLock(SVNWCContext.java:1646)
        at org.tmatesoft.svn.core.internal.wc2.ng.SvnNgAbstractUpdate.update(SvnNgAbstractUpdate.java:106)
        at org.tmatesoft.svn.core.internal.wc2.ng.SvnNgUpdate.run(SvnNgUpdate.java:40)
        at org.tmatesoft.svn.core.internal.wc2.ng.SvnNgUpdate.run(SvnNgUpdate.java:18)
        at org.tmatesoft.svn.core.internal.wc2.ng.SvnNgOperationRunner.run(SvnNgOperationRunner.java:20)
        at org.tmatesoft.svn.core.internal.wc2.SvnOperationRunner.run(SvnOperationRunner.java:21)
        at org.tmatesoft.svn.core.wc2.SvnOperationFactory.run(SvnOperationFactory.java:1235)
        at org.tmatesoft.svn.core.wc2.SvnOperation.run(SvnOperation.java:294)
        at org.tmatesoft.svn.core.wc.SVNUpdateClient.doUpdate(SVNUpdateClient.java:311)
        at org.tmatesoft.svn.core.wc.SVNUpdateClient.doUpdate(SVNUpdateClient.java:291)
        at org.tmatesoft.svn.core.wc.SVNUpdateClient.doUpdate(SVNUpdateClient.java:387)
        at hudson.scm.subversion.UpdateUpdater$TaskImpl.perform(UpdateUpdater.java:160)
        at hudson.scm.subversion.WorkspaceUpdater$UpdateTask.delegateTo(WorkspaceUpdater.java:168)
        at hudson.scm.SubversionSCM$CheckOutTask.perform(SubversionSCM.java:1030)
        at hudson.scm.SubversionSCM$CheckOutTask.invoke(SubversionSCM.java:1006)
        at hudson.scm.SubversionSCM$CheckOutTask.invoke(SubversionSCM.java:979)
        at hudson.FilePath$FileCallableWrapper.call(FilePath.java:2760)
        at hudson.remoting.UserRequest.perform(UserRequest.java:207)
        at hudson.remoting.UserRequest.perform(UserRequest.java:53)
        at hudson.remoting.Request$2.run(Request.java:358)
        at hudson.remoting.InterceptingExecutorService$1.call(InterceptingExecutorService.java:72)
        at java.util.concurrent.FutureTask.run(FutureTask.java:266)
        at java.util.concurrent.ThreadPoolExecutor.runWorker(ThreadPoolExecutor.java:1142)
        at java.util.concurrent.ThreadPoolExecutor$Worker.run(ThreadPoolExecutor.java:617)
        at java.lang.Thread.run(Thread.java:748)
Caused by: org.tmatesoft.sqljet.core.SqlJetException: FULL: error code is FULL
        at org.tmatesoft.sqljet.core.internal.pager.SqlJetPager.openJournal(SqlJetPager.java:3051)
        at org.tmatesoft.sqljet.core.internal.pager.SqlJetPager.begin(SqlJetPager.java:2782)
        at org.tmatesoft.sqljet.core.internal.btree.SqlJetBtree.beginTrans(SqlJetBtree.java:931)
        at org.tmatesoft.sqljet.core.table.engine.SqlJetEngine.doBeginTransaction(SqlJetEngine.java:561)
        at org.tmatesoft.sqljet.core.table.engine.SqlJetEngine.access$100(SqlJetEngine.java:55)
        at org.tmatesoft.sqljet.core.table.engine.SqlJetEngine$9.runSynchronized(SqlJetEngine.java:475)
        at org.tmatesoft.sqljet.core.table.engine.SqlJetEngine.runSynchronized(SqlJetEngine.java:217)
        at org.tmatesoft.sqljet.core.table.engine.SqlJetEngine.beginTransaction(SqlJetEngine.java:471)
        at org.tmatesoft.svn.core.internal.db.SVNSqlJetDb.beginTransaction(SVNSqlJetDb.java:206)
        ... 28 more
ERROR: Subversion update failed
org.tmatesoft.sqljet.core.SqlJetException: FULL: error code is FULL
        at org.tmatesoft.sqljet.core.internal.pager.SqlJetPager.openJournal(SqlJetPager.java:3051)
        at org.tmatesoft.sqljet.core.internal.pager.SqlJetPager.begin(SqlJetPager.java:2782)
        at org.tmatesoft.sqljet.core.internal.btree.SqlJetBtree.beginTrans(SqlJetBtree.java:931)
        at org.tmatesoft.sqljet.core.table.engine.SqlJetEngine.doBeginTransaction(SqlJetEngine.java:561)
        at org.tmatesoft.sqljet.core.table.engine.SqlJetEngine.access$100(SqlJetEngine.java:55)
        at org.tmatesoft.sqljet.core.table.engine.SqlJetEngine$9.runSynchronized(SqlJetEngine.java:475)
        at org.tmatesoft.sqljet.core.table.engine.SqlJetEngine.runSynchronized(SqlJetEngine.java:217)
        at org.tmatesoft.sqljet.core.table.engine.SqlJetEngine.beginTransaction(SqlJetEngine.java:471)
        at org.tmatesoft.svn.core.internal.db.SVNSqlJetDb.beginTransaction(SVNSqlJetDb.java:206)
Caused: org.tmatesoft.svn.core.SVNException: svn: E200030: FULL
        at org.tmatesoft.svn.core.internal.wc.SVNErrorManager.error(SVNErrorManager.java:70)
        at org.tmatesoft.svn.core.internal.wc.SVNErrorManager.error(SVNErrorManager.java:57)
        at org.tmatesoft.svn.core.internal.db.SVNSqlJetDb.createSqlJetError(SVNSqlJetDb.java:195)
        at org.tmatesoft.svn.core.internal.db.SVNSqlJetDb.beginTransaction(SVNSqlJetDb.java:211)
        at org.tmatesoft.svn.core.internal.db.SVNSqlJetDb.runTransaction(SVNSqlJetDb.java:257)
        at org.tmatesoft.svn.core.internal.db.SVNSqlJetDb.runTransaction(SVNSqlJetDb.java:252)
        at org.tmatesoft.svn.core.internal.wc17.db.SVNWCDb.obtainWCLock(SVNWCDb.java:5867)
        at org.tmatesoft.svn.core.internal.wc17.SVNWCContext.acquireWriteLock(SVNWCContext.java:1646)
        at org.tmatesoft.svn.core.internal.wc2.ng.SvnNgAbstractUpdate.update(SvnNgAbstractUpdate.java:106)
        at org.tmatesoft.svn.core.internal.wc2.ng.SvnNgUpdate.run(SvnNgUpdate.java:40)
        at org.tmatesoft.svn.core.internal.wc2.ng.SvnNgUpdate.run(SvnNgUpdate.java:18)
        at org.tmatesoft.svn.core.internal.wc2.ng.SvnNgOperationRunner.run(SvnNgOperationRunner.java:20)
        at org.tmatesoft.svn.core.internal.wc2.SvnOperationRunner.run(SvnOperationRunner.java:21)
        at org.tmatesoft.svn.core.wc2.SvnOperationFactory.run(SvnOperationFactory.java:1235)
        at org.tmatesoft.svn.core.wc2.SvnOperation.run(SvnOperation.java:294)
        at org.tmatesoft.svn.core.wc.SVNUpdateClient.doUpdate(SVNUpdateClient.java:311)
        at org.tmatesoft.svn.core.wc.SVNUpdateClient.doUpdate(SVNUpdateClient.java:291)
        at org.tmatesoft.svn.core.wc.SVNUpdateClient.doUpdate(SVNUpdateClient.java:387)
        at hudson.scm.subversion.UpdateUpdater$TaskImpl.perform(UpdateUpdater.java:160)
Caused: hudson.scm.subversion.UpdaterException: failed to perform svn update
Also:   hudson.remoting.Channel$CallSiteStackTrace: Remote call to H23
                at hudson.remoting.Channel.attachCallSiteStackTrace(Channel.java:1693)
                at hudson.remoting.UserResponse.retrieve(UserRequest.java:310)
                at hudson.remoting.Channel.call(Channel.java:908)
                at hudson.FilePath.act(FilePath.java:986)
                at hudson.FilePath.act(FilePath.java:975)
                at hudson.scm.SubversionSCM.checkout(SubversionSCM.java:928)
                at hudson.scm.SubversionSCM.checkout(SubversionSCM.java:864)
                at hudson.scm.SCM.checkout(SCM.java:495)
                at hudson.model.AbstractProject.checkout(AbstractProject.java:1202)
                at hudson.model.AbstractBuild$AbstractBuildExecution.defaultCheckout(AbstractBuild.java:574)
                at jenkins.scm.SCMCheckoutStrategy.checkout(SCMCheckoutStrategy.java:86)
                at hudson.model.AbstractBuild$AbstractBuildExecution.run(AbstractBuild.java:499)
                at hudson.model.Run.execute(Run.java:1724)
                at hudson.model.FreeStyleBuild.run(FreeStyleBuild.java:43)
                at hudson.model.ResourceController.execute(ResourceController.java:97)
                at hudson.model.Executor.run(Executor.java:421)
Caused: java.io.IOException
        at hudson.scm.subversion.UpdateUpdater$TaskImpl.perform(UpdateUpdater.java:215)
        at hudson.scm.subversion.WorkspaceUpdater$UpdateTask.delegateTo(WorkspaceUpdater.java:168)
        at hudson.scm.SubversionSCM$CheckOutTask.perform(SubversionSCM.java:1030)
        at hudson.scm.SubversionSCM$CheckOutTask.invoke(SubversionSCM.java:1006)
        at hudson.scm.SubversionSCM$CheckOutTask.invoke(SubversionSCM.java:979)
        at hudson.FilePath$FileCallableWrapper.call(FilePath.java:2760)
        at hudson.remoting.UserRequest.perform(UserRequest.java:207)
        at hudson.remoting.UserRequest.perform(UserRequest.java:53)
        at hudson.remoting.Request$2.run(Request.java:358)
        at hudson.remoting.InterceptingExecutorService$1.call(InterceptingExecutorService.java:72)
        at java.util.concurrent.FutureTask.run(FutureTask.java:266)
        at java.util.concurrent.ThreadPoolExecutor.runWorker(ThreadPoolExecutor.java:1142)
        at java.util.concurrent.ThreadPoolExecutor$Worker.run(ThreadPoolExecutor.java:617)
        at java.lang.Thread.run(Thread.java:748)
Caused: java.io.IOException: remote file operation failed: <https://builds.apache.org/job/POI-DSL-OpenJDK/ws/> at hudson.remoting.Channel@172a4f92:H23
        at hudson.FilePath.act(FilePath.java:993)
        at hudson.FilePath.act(FilePath.java:975)
        at hudson.scm.SubversionSCM.checkout(SubversionSCM.java:928)
        at hudson.scm.SubversionSCM.checkout(SubversionSCM.java:864)
        at hudson.scm.SCM.checkout(SCM.java:495)
        at hudson.model.AbstractProject.checkout(AbstractProject.java:1202)
        at hudson.model.AbstractBuild$AbstractBuildExecution.defaultCheckout(AbstractBuild.java:574)
        at jenkins.scm.SCMCheckoutStrategy.checkout(SCMCheckoutStrategy.java:86)
        at hudson.model.AbstractBuild$AbstractBuildExecution.run(AbstractBuild.java:499)
        at hudson.model.Run.execute(Run.java:1724)
        at hudson.model.FreeStyleBuild.run(FreeStyleBuild.java:43)
        at hudson.model.ResourceController.execute(ResourceController.java:97)
        at hudson.model.Executor.run(Executor.java:421)
Retrying after 10 seconds
Updating https://svn.apache.org/repos/asf/poi/trunk at revision '2018-01-30T03:49:08.459 +0000'
ERROR: Failed to update https://svn.apache.org/repos/asf/poi/trunk
org.tmatesoft.svn.core.SVNException: svn: E200030: FULL
        at org.tmatesoft.svn.core.internal.wc.SVNErrorManager.error(SVNErrorManager.java:70)
        at org.tmatesoft.svn.core.internal.wc.SVNErrorManager.error(SVNErrorManager.java:57)
        at org.tmatesoft.svn.core.internal.db.SVNSqlJetDb.createSqlJetError(SVNSqlJetDb.java:195)
        at org.tmatesoft.svn.core.internal.db.SVNSqlJetDb.beginTransaction(SVNSqlJetDb.java:211)
        at org.tmatesoft.svn.core.internal.db.SVNSqlJetDb.runTransaction(SVNSqlJetDb.java:257)
        at org.tmatesoft.svn.core.internal.db.SVNSqlJetDb.runTransaction(SVNSqlJetDb.java:252)
        at org.tmatesoft.svn.core.internal.wc17.db.SVNWCDb.obtainWCLock(SVNWCDb.java:5867)
        at org.tmatesoft.svn.core.internal.wc17.SVNWCContext.acquireWriteLock(SVNWCContext.java:1646)
        at org.tmatesoft.svn.core.internal.wc2.ng.SvnNgAbstractUpdate.update(SvnNgAbstractUpdate.java:106)
        at org.tmatesoft.svn.core.internal.wc2.ng.SvnNgUpdate.run(SvnNgUpdate.java:40)
        at org.tmatesoft.svn.core.internal.wc2.ng.SvnNgUpdate.run(SvnNgUpdate.java:18)
        at org.tmatesoft.svn.core.internal.wc2.ng.SvnNgOperationRunner.run(SvnNgOperationRunner.java:20)
        at org.tmatesoft.svn.core.internal.wc2.SvnOperationRunner.run(SvnOperationRunner.java:21)
        at org.tmatesoft.svn.core.wc2.SvnOperationFactory.run(SvnOperationFactory.java:1235)
        at org.tmatesoft.svn.core.wc2.SvnOperation.run(SvnOperation.java:294)
        at org.tmatesoft.svn.core.wc.SVNUpdateClient.doUpdate(SVNUpdateClient.java:311)
        at org.tmatesoft.svn.core.wc.SVNUpdateClient.doUpdate(SVNUpdateClient.java:291)
        at org.tmatesoft.svn.core.wc.SVNUpdateClient.doUpdate(SVNUpdateClient.java:387)
        at hudson.scm.subversion.UpdateUpdater$TaskImpl.perform(UpdateUpdater.java:160)
        at hudson.scm.subversion.WorkspaceUpdater$UpdateTask.delegateTo(WorkspaceUpdater.java:168)
        at hudson.scm.SubversionSCM$CheckOutTask.perform(SubversionSCM.java:1030)
        at hudson.scm.SubversionSCM$CheckOutTask.invoke(SubversionSCM.java:1006)
        at hudson.scm.SubversionSCM$CheckOutTask.invoke(SubversionSCM.java:979)
        at hudson.FilePath$FileCallableWrapper.call(FilePath.java:2760)
        at hudson.remoting.UserRequest.perform(UserRequest.java:207)
        at hudson.remoting.UserRequest.perform(UserRequest.java:53)
        at hudson.remoting.Request$2.run(Request.java:358)
        at hudson.remoting.InterceptingExecutorService$1.call(InterceptingExecutorService.java:72)
        at java.util.concurrent.FutureTask.run(FutureTask.java:266)
        at java.util.concurrent.ThreadPoolExecutor.runWorker(ThreadPoolExecutor.java:1142)
        at java.util.concurrent.ThreadPoolExecutor$Worker.run(ThreadPoolExecutor.java:617)
        at java.lang.Thread.run(Thread.java:748)
Caused by: org.tmatesoft.sqljet.core.SqlJetException: FULL: error code is FULL
        at org.tmatesoft.sqljet.core.internal.pager.SqlJetPager.openJournal(SqlJetPager.java:3051)
        at org.tmatesoft.sqljet.core.internal.pager.SqlJetPager.begin(SqlJetPager.java:2782)
        at org.tmatesoft.sqljet.core.internal.btree.SqlJetBtree.beginTrans(SqlJetBtree.java:931)
        at org.tmatesoft.sqljet.core.table.engine.SqlJetEngine.doBeginTransaction(SqlJetEngine.java:561)
        at org.tmatesoft.sqljet.core.table.engine.SqlJetEngine.access$100(SqlJetEngine.java:55)
        at org.tmatesoft.sqljet.core.table.engine.SqlJetEngine$9.runSynchronized(SqlJetEngine.java:475)
        at org.tmatesoft.sqljet.core.table.engine.SqlJetEngine.runSynchronized(SqlJetEngine.java:217)
        at org.tmatesoft.sqljet.core.table.engine.SqlJetEngine.beginTransaction(SqlJetEngine.java:471)
        at org.tmatesoft.svn.core.internal.db.SVNSqlJetDb.beginTransaction(SVNSqlJetDb.java:206)
        ... 28 more
ERROR: Subversion update failed
org.tmatesoft.sqljet.core.SqlJetException: FULL: error code is FULL
        at org.tmatesoft.sqljet.core.internal.pager.SqlJetPager.openJournal(SqlJetPager.java:3051)
        at org.tmatesoft.sqljet.core.internal.pager.SqlJetPager.begin(SqlJetPager.java:2782)
        at org.tmatesoft.sqljet.core.internal.btree.SqlJetBtree.beginTrans(SqlJetBtree.java:931)
        at org.tmatesoft.sqljet.core.table.engine.SqlJetEngine.doBeginTransaction(SqlJetEngine.java:561)
        at org.tmatesoft.sqljet.core.table.engine.SqlJetEngine.access$100(SqlJetEngine.java:55)
        at org.tmatesoft.sqljet.core.table.engine.SqlJetEngine$9.runSynchronized(SqlJetEngine.java:475)
        at org.tmatesoft.sqljet.core.table.engine.SqlJetEngine.runSynchronized(SqlJetEngine.java:217)
        at org.tmatesoft.sqljet.core.table.engine.SqlJetEngine.beginTransaction(SqlJetEngine.java:471)
        at org.tmatesoft.svn.core.internal.db.SVNSqlJetDb.beginTransaction(SVNSqlJetDb.java:206)
Caused: org.tmatesoft.svn.core.SVNException: svn: E200030: FULL
        at org.tmatesoft.svn.core.internal.wc.SVNErrorManager.error(SVNErrorManager.java:70)
        at org.tmatesoft.svn.core.internal.wc.SVNErrorManager.error(SVNErrorManager.java:57)
        at org.tmatesoft.svn.core.internal.db.SVNSqlJetDb.createSqlJetError(SVNSqlJetDb.java:195)
        at org.tmatesoft.svn.core.internal.db.SVNSqlJetDb.beginTransaction(SVNSqlJetDb.java:211)
        at org.tmatesoft.svn.core.internal.db.SVNSqlJetDb.runTransaction(SVNSqlJetDb.java:257)
        at org.tmatesoft.svn.core.internal.db.SVNSqlJetDb.runTransaction(SVNSqlJetDb.java:252)
        at org.tmatesoft.svn.core.internal.wc17.db.SVNWCDb.obtainWCLock(SVNWCDb.java:5867)
        at org.tmatesoft.svn.core.internal.wc17.SVNWCContext.acquireWriteLock(SVNWCContext.java:1646)
        at org.tmatesoft.svn.core.internal.wc2.ng.SvnNgAbstractUpdate.update(SvnNgAbstractUpdate.java:106)
        at org.tmatesoft.svn.core.internal.wc2.ng.SvnNgUpdate.run(SvnNgUpdate.java:40)
        at org.tmatesoft.svn.core.internal.wc2.ng.SvnNgUpdate.run(SvnNgUpdate.java:18)
        at org.tmatesoft.svn.core.internal.wc2.ng.SvnNgOperationRunner.run(SvnNgOperationRunner.java:20)
        at org.tmatesoft.svn.core.internal.wc2.SvnOperationRunner.run(SvnOperationRunner.java:21)
        at org.tmatesoft.svn.core.wc2.SvnOperationFactory.run(SvnOperationFactory.java:1235)
        at org.tmatesoft.svn.core.wc2.SvnOperation.run(SvnOperation.java:294)
        at org.tmatesoft.svn.core.wc.SVNUpdateClient.doUpdate(SVNUpdateClient.java:311)
        at org.tmatesoft.svn.core.wc.SVNUpdateClient.doUpdate(SVNUpdateClient.java:291)
        at org.tmatesoft.svn.core.wc.SVNUpdateClient.doUpdate(SVNUpdateClient.java:387)
        at hudson.scm.subversion.UpdateUpdater$TaskImpl.perform(UpdateUpdater.java:160)
Caused: hudson.scm.subversion.UpdaterException: failed to perform svn update
Also:   hudson.remoting.Channel$CallSiteStackTrace: Remote call to H23
                at hudson.remoting.Channel.attachCallSiteStackTrace(Channel.java:1693)
                at hudson.remoting.UserResponse.retrieve(UserRequest.java:310)
                at hudson.remoting.Channel.call(Channel.java:908)
                at hudson.FilePath.act(FilePath.java:986)
                at hudson.FilePath.act(FilePath.java:975)
                at hudson.scm.SubversionSCM.checkout(SubversionSCM.java:928)
                at hudson.scm.SubversionSCM.checkout(SubversionSCM.java:864)
                at hudson.scm.SCM.checkout(SCM.java:495)
                at hudson.model.AbstractProject.checkout(AbstractProject.java:1202)
                at hudson.model.AbstractBuild$AbstractBuildExecution.defaultCheckout(AbstractBuild.java:574)
                at jenkins.scm.SCMCheckoutStrategy.checkout(SCMCheckoutStrategy.java:86)
                at hudson.model.AbstractBuild$AbstractBuildExecution.run(AbstractBuild.java:499)
                at hudson.model.Run.execute(Run.java:1724)
                at hudson.model.FreeStyleBuild.run(FreeStyleBuild.java:43)
                at hudson.model.ResourceController.execute(ResourceController.java:97)
                at hudson.model.Executor.run(Executor.java:421)
Caused: java.io.IOException
        at hudson.scm.subversion.UpdateUpdater$TaskImpl.perform(UpdateUpdater.java:215)
        at hudson.scm.subversion.WorkspaceUpdater$UpdateTask.delegateTo(WorkspaceUpdater.java:168)
        at hudson.scm.SubversionSCM$CheckOutTask.perform(SubversionSCM.java:1030)
        at hudson.scm.SubversionSCM$CheckOutTask.invoke(SubversionSCM.java:1006)
        at hudson.scm.SubversionSCM$CheckOutTask.invoke(SubversionSCM.java:979)
        at hudson.FilePath$FileCallableWrapper.call(FilePath.java:2760)
        at hudson.remoting.UserRequest.perform(UserRequest.java:207)
        at hudson.remoting.UserRequest.perform(UserRequest.java:53)
        at hudson.remoting.Request$2.run(Request.java:358)
        at hudson.remoting.InterceptingExecutorService$1.call(InterceptingExecutorService.java:72)
        at java.util.concurrent.FutureTask.run(FutureTask.java:266)
        at java.util.concurrent.ThreadPoolExecutor.runWorker(ThreadPoolExecutor.java:1142)
        at java.util.concurrent.ThreadPoolExecutor$Worker.run(ThreadPoolExecutor.java:617)
        at java.lang.Thread.run(Thread.java:748)
Caused: java.io.IOException: remote file operation failed: <https://builds.apache.org/job/POI-DSL-OpenJDK/ws/> at hudson.remoting.Channel@172a4f92:H23
        at hudson.FilePath.act(FilePath.java:993)
        at hudson.FilePath.act(FilePath.java:975)
        at hudson.scm.SubversionSCM.checkout(SubversionSCM.java:928)
        at hudson.scm.SubversionSCM.checkout(SubversionSCM.java:864)
        at hudson.scm.SCM.checkout(SCM.java:495)
        at hudson.model.AbstractProject.checkout(AbstractProject.java:1202)
        at hudson.model.AbstractBuild$AbstractBuildExecution.defaultCheckout(AbstractBuild.java:574)
        at jenkins.scm.SCMCheckoutStrategy.checkout(SCMCheckoutStrategy.java:86)
        at hudson.model.AbstractBuild$AbstractBuildExecution.run(AbstractBuild.java:499)
        at hudson.model.Run.execute(Run.java:1724)
        at hudson.model.FreeStyleBuild.run(FreeStyleBuild.java:43)
        at hudson.model.ResourceController.execute(ResourceController.java:97)
        at hudson.model.Executor.run(Executor.java:421)
Skipping publisher since build result is FAILURE
Archiving artifacts
[Fast Archiver] Compressed 235.22 MB of artifacts by 100.0% relative to #356
Skipping publisher since build result is FAILURE
Recording test results
ERROR: Step ?Publish JUnit test result report? failed: Test reports were found but none of them are new. Did leafNodes run?
For example, <https://builds.apache.org/job/POI-DSL-OpenJDK/ws/build/excelant-test-results/TEST-org.apache.poi.ss.examples.formula.TestExcelAntUserDefinedFunction.xml> is 2 days 3 hr old



---------------------------------------------------------------------
To unsubscribe, e-mail: [hidden email]
For additional commands, e-mail: [hidden email]

Reply | Threaded
Open this post in threaded view
|

Build failed in Jenkins: POI-DSL-OpenJDK #358

Apache Jenkins Server
See <https://builds.apache.org/job/POI-DSL-OpenJDK/358/display/redirect>

------------------------------------------
[...truncated 743.10 KB...]
  [javadoc] Loading source files for package org.apache.poi.ss.util...
  [javadoc] Loading source files for package org.apache.poi.ss.util.cellwalk...
  [javadoc] Loading source files for package org.apache.poi.util...
  [javadoc] Loading source files for package org.apache.poi.wp.usermodel...
  [javadoc] Loading source files for package org.apache.poi.hdgf...
  [javadoc] Loading source files for package org.apache.poi.hdgf.chunks...
  [javadoc] Loading source files for package org.apache.poi.hdgf.dev...
  [javadoc] Loading source files for package org.apache.poi.hdgf.exceptions...
  [javadoc] Loading source files for package org.apache.poi.hdgf.extractor...
  [javadoc] Loading source files for package org.apache.poi.hdgf.pointers...
  [javadoc] Loading source files for package org.apache.poi.hdgf.streams...
  [javadoc] Loading source files for package org.apache.poi.hemf.extractor...
  [javadoc] Loading source files for package org.apache.poi.hemf.hemfplus.record...
  [javadoc] Loading source files for package org.apache.poi.hemf.record...
  [javadoc] Loading source files for package org.apache.poi.hmef...
  [javadoc] Loading source files for package org.apache.poi.hmef.attribute...
  [javadoc] Loading source files for package org.apache.poi.hmef.dev...
  [javadoc] Loading source files for package org.apache.poi.hmef.extractor...
  [javadoc] Loading source files for package org.apache.poi.hpbf...
  [javadoc] Loading source files for package org.apache.poi.hpbf.dev...
  [javadoc] Loading source files for package org.apache.poi.hpbf.extractor...
  [javadoc] Loading source files for package org.apache.poi.hpbf.model...
  [javadoc] Loading source files for package org.apache.poi.hpbf.model.qcbits...
  [javadoc] Loading source files for package org.apache.poi.hslf.blip...
  [javadoc] Loading source files for package org.apache.poi.hslf.dev...
  [javadoc] Loading source files for package org.apache.poi.hslf.exceptions...
  [javadoc] Loading source files for package org.apache.poi.hslf.extractor...
  [javadoc] Loading source files for package org.apache.poi.hslf.model...
  [javadoc] Loading source files for package org.apache.poi.hslf.model.textproperties...
  [javadoc] Loading source files for package org.apache.poi.hslf.record...
  [javadoc] Loading source files for package org.apache.poi.hslf.usermodel...
  [javadoc] Loading source files for package org.apache.poi.hslf.util...
  [javadoc] Loading source files for package org.apache.poi.hsmf...
  [javadoc] Loading source files for package org.apache.poi.hsmf.datatypes...
  [javadoc] Loading source files for package org.apache.poi.hsmf.dev...
  [javadoc] Loading source files for package org.apache.poi.hsmf.exceptions...
  [javadoc] Loading source files for package org.apache.poi.hsmf.extractor...
  [javadoc] Loading source files for package org.apache.poi.hsmf.parsers...
  [javadoc] Loading source files for package org.apache.poi.hssf.converter...
  [javadoc] Loading source files for package org.apache.poi.hwmf.draw...
  [javadoc] Loading source files for package org.apache.poi.hwmf.record...
  [javadoc] Loading source files for package org.apache.poi.hwmf.usermodel...
  [javadoc] Loading source files for package org.apache.poi.hwpf...
  [javadoc] Loading source files for package org.apache.poi.hwpf.converter...
  [javadoc] Loading source files for package org.apache.poi.hwpf.dev...
  [javadoc] Loading source files for package org.apache.poi.hwpf.extractor...
  [javadoc] Loading source files for package org.apache.poi.hwpf.model...
  [javadoc] Loading source files for package org.apache.poi.hwpf.model.io...
  [javadoc] Loading source files for package org.apache.poi.hwpf.model.types...
  [javadoc] Loading source files for package org.apache.poi.hwpf.sprm...
  [javadoc] Loading source files for package org.apache.poi.hwpf.usermodel...
  [javadoc] Loading source files for package org.apache.poi.openxml4j.exceptions...
  [javadoc] Loading source files for package org.apache.poi.openxml4j.opc...
  [javadoc] Loading source files for package org.apache.poi.openxml4j.opc.internal...
  [javadoc] Loading source files for package org.apache.poi.openxml4j.opc.internal.marshallers...
  [javadoc] Loading source files for package org.apache.poi.openxml4j.opc.internal.unmarshallers...
  [javadoc] Loading source files for package org.apache.poi.openxml4j.util...
  [javadoc] Loading source files for package org.apache.poi.poifs.crypt.agile...
  [javadoc] Loading source files for package org.apache.poi.poifs.crypt.dsig...
  [javadoc] Loading source files for package org.apache.poi.poifs.crypt.dsig.facets...
  [javadoc] Loading source files for package org.apache.poi.poifs.crypt.dsig.services...
  [javadoc] Loading source files for package org.apache.poi.poifs.crypt.temp...
  [javadoc] Loading source files for package org.apache.poi.xddf.usermodel...
  [javadoc] Loading source files for package org.apache.poi.xddf.usermodel.chart...
  [javadoc] Loading source files for package org.apache.poi.xddf.usermodel.text...
  [javadoc] Loading source files for package org.apache.poi.xdgf.exceptions...
  [javadoc] Loading source files for package org.apache.poi.xdgf.extractor...
  [javadoc] Loading source files for package org.apache.poi.xdgf.geom...
  [javadoc] Loading source files for package org.apache.poi.xdgf.usermodel...
  [javadoc] Loading source files for package org.apache.poi.xdgf.usermodel.section...
  [javadoc] Loading source files for package org.apache.poi.xdgf.usermodel.section.geometry...
  [javadoc] Loading source files for package org.apache.poi.xdgf.usermodel.shape...
  [javadoc] Loading source files for package org.apache.poi.xdgf.usermodel.shape.exceptions...
  [javadoc] Loading source files for package org.apache.poi.xdgf.util...
  [javadoc] Loading source files for package org.apache.poi.xdgf.xml...
  [javadoc] Loading source files for package org.apache.poi.xslf.extractor...
  [javadoc] Loading source files for package org.apache.poi.xslf.model...
  [javadoc] Loading source files for package org.apache.poi.xslf.usermodel...
  [javadoc] Loading source files for package org.apache.poi.xslf.util...
  [javadoc] Loading source files for package org.apache.poi.xssf...
  [javadoc] Loading source files for package org.apache.poi.xssf.binary...
  [javadoc] Loading source files for package org.apache.poi.xssf.dev...
  [javadoc] Loading source files for package org.apache.poi.xssf.eventusermodel...
  [javadoc] Loading source files for package org.apache.poi.xssf.extractor...
  [javadoc] Loading source files for package org.apache.poi.xssf.model...
  [javadoc] Loading source files for package org.apache.poi.xssf.streaming...
  [javadoc] Loading source files for package org.apache.poi.xssf.usermodel...
  [javadoc] Loading source files for package org.apache.poi.xssf.usermodel.charts...
  [javadoc] Loading source files for package org.apache.poi.xssf.usermodel.extensions...
  [javadoc] Loading source files for package org.apache.poi.xssf.usermodel.helpers...
  [javadoc] Loading source files for package org.apache.poi.xssf.util...
  [javadoc] Loading source files for package org.apache.poi.xwpf.extractor...
  [javadoc] Loading source files for package org.apache.poi.xwpf.model...
  [javadoc] Loading source files for package org.apache.poi.xwpf.usermodel...
  [javadoc] Constructing Javadoc information...
  [javadoc] Creating destination directory: "<https://builds.apache.org/job/POI-DSL-OpenJDK/ws/build/tmp/site/build/site/apidocs/">
  [javadoc] Standard Doclet version 1.8.0_151
  [javadoc] Building tree for all the packages and classes...
  [javadoc] <https://builds.apache.org/job/POI-DSL-OpenJDK/ws/src/java/org/apache/poi/hssf/usermodel/HSSFRow.java>:728: warning - @param argument "startColumn" is not a parameter name.
  [javadoc] <https://builds.apache.org/job/POI-DSL-OpenJDK/ws/src/java/org/apache/poi/hssf/usermodel/HSSFRow.java>:728: warning - @param argument "endColumn" is not a parameter name.
  [javadoc] <https://builds.apache.org/job/POI-DSL-OpenJDK/ws/src/java/org/apache/poi/hssf/usermodel/HSSFRow.java>:756: warning - @param argument "startColumn" is not a parameter name.
  [javadoc] <https://builds.apache.org/job/POI-DSL-OpenJDK/ws/src/java/org/apache/poi/hssf/usermodel/HSSFRow.java>:756: warning - @param argument "endColumn" is not a parameter name.
  [javadoc] <https://builds.apache.org/job/POI-DSL-OpenJDK/ws/src/java/org/apache/poi/hssf/usermodel/HSSFSheet.java>:1758: warning - @param argument "startRow" is not a parameter name.
  [javadoc] <https://builds.apache.org/job/POI-DSL-OpenJDK/ws/src/java/org/apache/poi/hssf/usermodel/HSSFSheet.java>:1758: warning - @param argument "endRow" is not a parameter name.
  [javadoc] <https://builds.apache.org/job/POI-DSL-OpenJDK/ws/src/ooxml/java/org/apache/poi/xddf/usermodel/chart/XDDFChart.java>:519: warning - @return tag has no arguments.
  [javadoc] <https://builds.apache.org/job/POI-DSL-OpenJDK/ws/src/ooxml/java/org/apache/poi/xssf/usermodel/XSSFRow.java>:649: warning - @param argument "startColumn" is not a parameter name.
  [javadoc] <https://builds.apache.org/job/POI-DSL-OpenJDK/ws/src/ooxml/java/org/apache/poi/xssf/usermodel/XSSFRow.java>:649: warning - @param argument "endColumn" is not a parameter name.
  [javadoc] <https://builds.apache.org/job/POI-DSL-OpenJDK/ws/src/ooxml/java/org/apache/poi/xssf/usermodel/XSSFRow.java>:672: warning - @param argument "startColumn" is not a parameter name.
  [javadoc] <https://builds.apache.org/job/POI-DSL-OpenJDK/ws/src/ooxml/java/org/apache/poi/xssf/usermodel/XSSFRow.java>:672: warning - @param argument "endColumn" is not a parameter name.
  [javadoc] Building index for all the packages and classes...
  [javadoc] Building index for all classes...
  [javadoc] Generating <https://builds.apache.org/job/POI-DSL-OpenJDK/ws/build/tmp/site/build/site/apidocs/help-doc.html...>
  [javadoc] 11 warnings

jar-src:
      [jar] Building jar: <https://builds.apache.org/job/POI-DSL-OpenJDK/ws/build/dist/maven/poi/poi-4.0.0-SNAPSHOT-sources.jar>
      [jar] Building jar: <https://builds.apache.org/job/POI-DSL-OpenJDK/ws/build/dist/maven/poi-scratchpad/poi-scratchpad-4.0.0-SNAPSHOT-sources.jar>
      [jar] Building jar: <https://builds.apache.org/job/POI-DSL-OpenJDK/ws/build/dist/maven/poi-ooxml/poi-ooxml-4.0.0-SNAPSHOT-sources.jar>
      [jar] Building jar: <https://builds.apache.org/job/POI-DSL-OpenJDK/ws/build/dist/maven/poi-examples/poi-examples-4.0.0-SNAPSHOT-sources.jar>
      [jar] Building jar: <https://builds.apache.org/job/POI-DSL-OpenJDK/ws/build/dist/maven/poi-excelant/poi-excelant-4.0.0-SNAPSHOT-sources.jar>

-do-jar-check-javadocs-package-list:

-do-jar-create-javadocs-package-list:

jar-javadocs:
     [echo] Building poi javadocs from <https://builds.apache.org/job/POI-DSL-OpenJDK/ws/src/java>
    [mkdir] Created dir: <https://builds.apache.org/job/POI-DSL-OpenJDK/ws/build/tmp/maven-javadocs>
  [javadoc] Generating Javadoc
  [javadoc] Javadoc execution
  [javadoc] <https://builds.apache.org/job/POI-DSL-OpenJDK/ws/src/java/org/apache/poi/hssf/usermodel/HSSFRow.java>:728: warning - @param argument "startColumn" is not a parameter name.
  [javadoc] <https://builds.apache.org/job/POI-DSL-OpenJDK/ws/src/java/org/apache/poi/hssf/usermodel/HSSFRow.java>:728: warning - @param argument "endColumn" is not a parameter name.
  [javadoc] <https://builds.apache.org/job/POI-DSL-OpenJDK/ws/src/java/org/apache/poi/hssf/usermodel/HSSFRow.java>:756: warning - @param argument "startColumn" is not a parameter name.
  [javadoc] <https://builds.apache.org/job/POI-DSL-OpenJDK/ws/src/java/org/apache/poi/hssf/usermodel/HSSFRow.java>:756: warning - @param argument "endColumn" is not a parameter name.
  [javadoc] <https://builds.apache.org/job/POI-DSL-OpenJDK/ws/src/java/org/apache/poi/hssf/usermodel/HSSFSheet.java>:1758: warning - @param argument "startRow" is not a parameter name.
  [javadoc] <https://builds.apache.org/job/POI-DSL-OpenJDK/ws/src/java/org/apache/poi/hssf/usermodel/HSSFSheet.java>:1758: warning - @param argument "endRow" is not a parameter name.
  [javadoc] 6 warnings
      [jar] Building jar: <https://builds.apache.org/job/POI-DSL-OpenJDK/ws/build/dist/maven/poi/poi-4.0.0-SNAPSHOT-javadoc.jar>
     [echo] Building poi-scratchpad javadocs from <https://builds.apache.org/job/POI-DSL-OpenJDK/ws/src/scratchpad/src>
   [delete] Deleting directory <https://builds.apache.org/job/POI-DSL-OpenJDK/ws/build/tmp/maven-javadocs>
    [mkdir] Created dir: <https://builds.apache.org/job/POI-DSL-OpenJDK/ws/build/tmp/maven-javadocs>
  [javadoc] Generating Javadoc
  [javadoc] Javadoc execution
      [jar] Building jar: <https://builds.apache.org/job/POI-DSL-OpenJDK/ws/build/dist/maven/poi-scratchpad/poi-scratchpad-4.0.0-SNAPSHOT-javadoc.jar>
     [echo] Building poi-ooxml javadocs from <https://builds.apache.org/job/POI-DSL-OpenJDK/ws/src/ooxml/java>
   [delete] Deleting directory <https://builds.apache.org/job/POI-DSL-OpenJDK/ws/build/tmp/maven-javadocs>
    [mkdir] Created dir: <https://builds.apache.org/job/POI-DSL-OpenJDK/ws/build/tmp/maven-javadocs>
  [javadoc] Generating Javadoc
  [javadoc] Javadoc execution
  [javadoc] <https://builds.apache.org/job/POI-DSL-OpenJDK/ws/src/ooxml/java/org/apache/poi/xddf/usermodel/chart/XDDFChart.java>:519: warning - @return tag has no arguments.
  [javadoc] <https://builds.apache.org/job/POI-DSL-OpenJDK/ws/src/ooxml/java/org/apache/poi/xssf/usermodel/XSSFRow.java>:649: warning - @param argument "startColumn" is not a parameter name.
  [javadoc] <https://builds.apache.org/job/POI-DSL-OpenJDK/ws/src/ooxml/java/org/apache/poi/xssf/usermodel/XSSFRow.java>:649: warning - @param argument "endColumn" is not a parameter name.
  [javadoc] <https://builds.apache.org/job/POI-DSL-OpenJDK/ws/src/ooxml/java/org/apache/poi/xssf/usermodel/XSSFRow.java>:672: warning - @param argument "startColumn" is not a parameter name.
  [javadoc] <https://builds.apache.org/job/POI-DSL-OpenJDK/ws/src/ooxml/java/org/apache/poi/xssf/usermodel/XSSFRow.java>:672: warning - @param argument "endColumn" is not a parameter name.
  [javadoc] 5 warnings
      [jar] Building jar: <https://builds.apache.org/job/POI-DSL-OpenJDK/ws/build/dist/maven/poi-ooxml/poi-ooxml-4.0.0-SNAPSHOT-javadoc.jar>

assemble:
      [zip] Building zip: <https://builds.apache.org/job/POI-DSL-OpenJDK/ws/build/dist/poi-bin-4.0.0-SNAPSHOT-20180131.zip>
      [tar] Building tar: <https://builds.apache.org/job/POI-DSL-OpenJDK/358/artifact/build/dist/poi-bin-4.0.0-SNAPSHOT-20180131.tar.gz>
      [zip] Building zip: <https://builds.apache.org/job/POI-DSL-OpenJDK/ws/build/dist/poi-src-4.0.0-SNAPSHOT-20180131.zip>
      [tar] Building tar: <https://builds.apache.org/job/POI-DSL-OpenJDK/358/artifact/build/dist/poi-src-4.0.0-SNAPSHOT-20180131.tar.gz>
     [echo] Creating Maven POMs

maven-poms:
     [copy] Copying 6 files to <https://builds.apache.org/job/POI-DSL-OpenJDK/ws/build/dist/maven>
     [echo] Maven POMs are located in <https://builds.apache.org/job/POI-DSL-OpenJDK/ws/build/dist>
     [echo] Use ant dist-nexus to deploy the artifacts in the remote repository
     [echo] Distribution located in <https://builds.apache.org/job/POI-DSL-OpenJDK/ws/build/dist>
     [echo] Use "ant dist-checksum" to create md5/sha1/sha512 checksums and GPG signatures

findbugs:
      [get] Getting: http://downloads.sourceforge.net/project/findbugs/findbugs/3.0.1/findbugs-noUpdateChecks-3.0.1.zip?download=
      [get] To: <https://builds.apache.org/job/POI-DSL-OpenJDK/ws/lib/findbugs-noUpdateChecks-3.0.1.zip>
      [get] http://downloads.sourceforge.net/project/findbugs/findbugs/3.0.1/findbugs-noUpdateChecks-3.0.1.zip?download= moved to https://astuteinternet.dl.sourceforge.net/project/findbugs/findbugs/3.0.1/findbugs-noUpdateChecks-3.0.1.zip
    [unzip] Expanding: <https://builds.apache.org/job/POI-DSL-OpenJDK/ws/lib/findbugs-noUpdateChecks-3.0.1.zip> into <https://builds.apache.org/job/POI-DSL-OpenJDK/ws/build/findbugs>
 [findbugs] Executing findbugs FindBugsTask from ant task
 [findbugs] Running FindBugs...
 [findbugs] Warnings generated: 55
 [findbugs] Calculating exit code...
 [findbugs] Setting 'bugs found' flag (1)
 [findbugs] Exit code set to: 1
 [findbugs] Java Result: 1
 [findbugs] Output saved to build/findbugs.xml
     [xslt] Transforming into <https://builds.apache.org/job/POI-DSL-OpenJDK/ws/build>
     [xslt] Processing <https://builds.apache.org/job/POI-DSL-OpenJDK/ws/build/findbugs.xml> to <https://builds.apache.org/job/POI-DSL-OpenJDK/358/artifact/build/findbugs.html>
     [xslt] Loading stylesheet jar:<https://builds.apache.org/job/POI-DSL-OpenJDK/ws/build/findbugs/lib/findbugs.jar!/fancy-hist.xsl>

release-notes:
     [copy] Copying 1 file to <https://builds.apache.org/job/POI-DSL-OpenJDK/ws/build/dist>

rat-check:
    [mkdir] Created dir: <https://builds.apache.org/job/POI-DSL-OpenJDK/ws/build/rat>
     [echo]
     [echo] *****************************************************
     [echo] Summary
     [echo] -------
     [echo] Generated at: 2018-01-31T02:47:17+00:00
     [echo]
     [echo] Notes: 1
     [echo] Binaries: 120
     [echo] Archives: 0
     [echo] Standards: 3745
     [echo]
     [echo] Apache Licensed: 3745
     [echo] Generated Documents: 0
     [echo]
     [echo] JavaDocs are generated, thus a license header is optional.
     [echo] Generated files do not require license headers.
     [echo]
     [echo] 0 Unknown Licenses
     [echo]
     [echo] *****************************************************
     [echo]   Files with Apache License headers will be marked AL
     [echo]   Binary files (which do not require any license headers) will be marked B
     [echo]   Compressed archives will be marked A
     [echo]   Notices, licenses etc. will be marked N
     [echo]  
     [echo] *****************************************************

forbidden-apis-check:
[forbiddenapis] Reading bundled API signatures: jdk-unsafe-1.8
[forbiddenapis] Reading bundled API signatures: jdk-deprecated-1.8
[forbiddenapis] Reading bundled API signatures: jdk-internal-1.8
[forbiddenapis] Reading bundled API signatures: jdk-non-portable
[forbiddenapis] Reading bundled API signatures: jdk-reflection
[forbiddenapis] Reading API signatures: <https://builds.apache.org/job/POI-DSL-OpenJDK/ws/src/resources/devtools/forbidden-signatures.txt>
[forbiddenapis] Loading classes to check...
[forbiddenapis] Scanning classes for violations...
[forbiddenapis] Forbidden method invocation: java.lang.String#format(java.lang.String,java.lang.Object[]) [Uses default locale]
[forbiddenapis]   in org.apache.poi.hssf.usermodel.HSSFRow (HSSFRow.java:732)
[forbiddenapis] Forbidden method invocation: java.lang.String#format(java.lang.String,java.lang.Object[]) [Uses default locale]
[forbiddenapis]   in org.apache.poi.hssf.usermodel.HSSFRow (HSSFRow.java:760)
[forbiddenapis] Forbidden method invocation: java.lang.String#format(java.lang.String,java.lang.Object[]) [Uses default locale]
[forbiddenapis]   in org.apache.poi.xssf.usermodel.XSSFRow (XSSFRow.java:653)
[forbiddenapis] Forbidden method invocation: java.lang.String#format(java.lang.String,java.lang.Object[]) [Uses default locale]
[forbiddenapis]   in org.apache.poi.xssf.usermodel.XSSFRow (XSSFRow.java:676)
[forbiddenapis] Scanned 4154 (and 1932 related) class file(s) for forbidden API invocations (in 13.99s), 4 error(s).

BUILD FAILED
<https://builds.apache.org/job/POI-DSL-OpenJDK/ws/build.xml>:2104: Check for forbidden API calls failed, see log.

Total time: 27 minutes 19 seconds
Build step 'Invoke Ant' marked build as failure
Skipping publisher since build result is FAILURE
Archiving artifacts
[Fast Archiver] Compressed 233.21 MB of artifacts by 40.0% relative to #356
Skipping publisher since build result is FAILURE
Recording test results

---------------------------------------------------------------------
To unsubscribe, e-mail: [hidden email]
For additional commands, e-mail: [hidden email]

Reply | Threaded
Open this post in threaded view
|

Jenkins build is back to normal : POI-DSL-OpenJDK #359

Apache Jenkins Server
See <https://builds.apache.org/job/POI-DSL-OpenJDK/359/display/redirect?page=changes>


---------------------------------------------------------------------
To unsubscribe, e-mail: [hidden email]
For additional commands, e-mail: [hidden email]