Build failed in Jenkins: POI-DSL-OpenJDK #314

classic Classic list List threaded Threaded
5 messages Options
Reply | Threaded
Open this post in threaded view
|

Build failed in Jenkins: POI-DSL-OpenJDK #314

Apache Jenkins Server
See <https://builds.apache.org/job/POI-DSL-OpenJDK/314/display/redirect?page=changes>

Changes:

[onealj] +svn:eol-style native *.java

[onealj] github #81: sheet names are case insensitive

[onealj] XWPFTable#getRows() should return an unmodifiable list unless the method can correctly update xmlbeans in response to modifying the list

[onealj] make tableRows final; initialize where defined rather than in constructor.

[onealj] deprecate XWPFTable#addNewRowBetween(int,int), which has not been implemented since 2008 when this class was first authored. (Unrelated: This closes #82 on github).

------------------------------------------
[...truncated 7.15 KB...]
total 28
drwxr-xr-x 7 root root 4096 Nov  8 08:41 .
drwxr-xr-x 4 root root 4096 Nov  8 08:41 ..
lrwxrwxrwx 1 root root   22 Oct 27 22:51 ASSEMBLY_EXCEPTION -> jre/ASSEMBLY_EXCEPTION
drwxr-xr-x 2 root root 4096 Nov  8 08:41 bin
lrwxrwxrwx 1 root root   41 Jan 23  2017 docs -> ../../../share/doc/openjdk-8-jre-headless
drwxr-xr-x 3 root root 4096 Nov  8 08:41 include
drwxr-xr-x 5 root root 4096 Nov  8 08:41 jre
drwxr-xr-x 3 root root 4096 Nov  8 08:41 lib
drwxr-xr-x 4 root root 4096 Feb 11  2017 man
lrwxrwxrwx 1 root root   20 Oct 27 22:51 src.zip -> ../openjdk-8/src.zip
lrwxrwxrwx 1 root root   22 Oct 27 22:51 THIRD_PARTY_README -> jre/THIRD_PARTY_README
+ ls -al /usr/lib/jvm/java-8-openjdk-amd64//bin
total 244
drwxr-xr-x 2 root root 4096 Nov  8 08:41 .
drwxr-xr-x 7 root root 4096 Nov  8 08:41 ..
-rwxr-xr-x 1 root root 6504 Oct 27 22:51 appletviewer
-rwxr-xr-x 1 root root 6504 Oct 27 22:51 extcheck
-rwxr-xr-x 1 root root 6504 Oct 27 22:51 idlj
-rwxr-xr-x 1 root root 6504 Oct 27 22:51 jar
-rwxr-xr-x 1 root root 6504 Oct 27 22:51 jarsigner
lrwxrwxrwx 1 root root   15 Oct 27 22:51 java -> ../jre/bin/java
-rwxr-xr-x 1 root root 6504 Oct 27 22:51 javac
-rwxr-xr-x 1 root root 6504 Oct 27 22:51 javadoc
-rwxr-xr-x 1 root root 6504 Oct 27 22:51 javah
-rwxr-xr-x 1 root root 6504 Oct 27 22:51 javap
-rwxr-xr-x 1 root root 2806 Oct 27 22:04 java-rmi.cgi
-rwxr-xr-x 1 root root 6504 Oct 27 22:51 jcmd
-rwxr-xr-x 1 root root 6528 Oct 27 22:51 jconsole
-rwxr-xr-x 1 root root 6520 Oct 27 22:51 jdb
-rwxr-xr-x 1 root root 6504 Oct 27 22:51 jdeps
-rwxr-xr-x 1 root root 6504 Oct 27 22:51 jhat
-rwxr-xr-x 1 root root 6568 Oct 27 22:51 jinfo
lrwxrwxrwx 1 root root   14 Oct 27 22:51 jjs -> ../jre/bin/jjs
-rwxr-xr-x 1 root root 6568 Oct 27 22:51 jmap
-rwxr-xr-x 1 root root 6504 Oct 27 22:51 jps
-rwxr-xr-x 1 root root 6504 Oct 27 22:51 jrunscript
-rwxr-xr-x 1 root root 6520 Oct 27 22:51 jsadebugd
-rwxr-xr-x 1 root root 6568 Oct 27 22:51 jstack
-rwxr-xr-x 1 root root 6504 Oct 27 22:51 jstat
-rwxr-xr-x 1 root root 6504 Oct 27 22:51 jstatd
lrwxrwxrwx 1 root root   18 Oct 27 22:51 keytool -> ../jre/bin/keytool
-rwxr-xr-x 1 root root 6504 Oct 27 22:51 native2ascii
lrwxrwxrwx 1 root root   15 Oct 27 22:51 orbd -> ../jre/bin/orbd
lrwxrwxrwx 1 root root   18 Oct 27 22:51 pack200 -> ../jre/bin/pack200
lrwxrwxrwx 1 root root   21 Oct 27 22:51 policytool -> ../jre/bin/policytool
-rwxr-xr-x 1 root root 6504 Oct 27 22:51 rmic
lrwxrwxrwx 1 root root   15 Oct 27 22:51 rmid -> ../jre/bin/rmid
lrwxrwxrwx 1 root root   22 Oct 27 22:51 rmiregistry -> ../jre/bin/rmiregistry
-rwxr-xr-x 1 root root 6504 Oct 27 22:51 schemagen
-rwxr-xr-x 1 root root 6504 Oct 27 22:51 serialver
lrwxrwxrwx 1 root root   21 Oct 27 22:51 servertool -> ../jre/bin/servertool
lrwxrwxrwx 1 root root   20 Oct 27 22:51 tnameserv -> ../jre/bin/tnameserv
lrwxrwxrwx 1 root root   20 Oct 27 22:51 unpack200 -> ../jre/bin/unpack200
-rwxr-xr-x 1 root root 6504 Oct 27 22:51 wsgen
-rwxr-xr-x 1 root root 6504 Oct 27 22:51 wsimport
-rwxr-xr-x 1 root root 6504 Oct 27 22:51 xjc
+ /usr/lib/jvm/java-8-openjdk-amd64//bin/java -version
openjdk version "1.8.0_151"
OpenJDK Runtime Environment (build 1.8.0_151-8u151-b12-0ubuntu0.16.04.2-b12)
OpenJDK 64-Bit Server VM (build 25.151-b12, mixed mode)
+ echo which java
which java
+ which java
/usr/lib/jvm/java-8-openjdk-amd64//bin/java
+ java -version
openjdk version "1.8.0_151"
OpenJDK Runtime Environment (build 1.8.0_151-8u151-b12-0ubuntu0.16.04.2-b12)
OpenJDK 64-Bit Server VM (build 25.151-b12, mixed mode)
+ echo which javac
which javac
+ which javac
/usr/lib/jvm/java-8-openjdk-amd64//bin/javac
+ javac -version
javac 1.8.0_151
+ echo '<project default="test"><target name="test"><echo>Java ${ant.java.version}/${java.version}</echo><exec executable="javac"><arg value="-version"/></exec></target></project>'
+ ant -f build.javacheck.xml -v
Apache Ant(TM) version 1.9.6 compiled on July 8 2015
Buildfile: <https://builds.apache.org/job/POI-DSL-OpenJDK/ws/build.javacheck.xml>
Detected Java version: 1.8 in: /usr/lib/jvm/java-8-openjdk-amd64/jre
Detected OS: Linux
parsing buildfile <https://builds.apache.org/job/POI-DSL-OpenJDK/ws/build.javacheck.xml> with URI = <https://builds.apache.org/job/POI-DSL-OpenJDK/ws/build.javacheck.xml>
Project base dir set to: <https://builds.apache.org/job/POI-DSL-OpenJDK/ws/>
Build sequence for target(s) `test' is [test]
Complete build sequence is [test, ]

test:
parsing buildfile jar:file:/usr/share/ant/lib/ant.jar!/org/apache/tools/ant/antlib.xml with URI = jar:file:/usr/share/ant/lib/ant.jar!/org/apache/tools/ant/antlib.xml from a zip file
     [echo] Java 1.8/1.8.0_151
     [exec] Current OS is Linux
     [exec] Executing 'javac' with arguments:
     [exec] '-version'
     [exec]
     [exec] The ' characters around the executable and arguments are
     [exec] not part of the command.
     [exec] javac 1.8.0_151

BUILD SUCCESSFUL
Total time: 0 seconds
+ exit 0
[POI-DSL-OpenJDK] $ /home/jenkins/tools/ant/apache-ant-1.9.9/bin/ant -Dcoverage.enabled=true clean jenkins
Buildfile: <https://builds.apache.org/job/POI-DSL-OpenJDK/ws/build.xml>

clean:
   [delete] Deleting directory <https://builds.apache.org/job/POI-DSL-OpenJDK/ws/build>

check-jars:

fetch-jars:

check-ooxml-jars:

fetch-ooxml-jars:

init:
    [mkdir] Created dir: <https://builds.apache.org/job/POI-DSL-OpenJDK/ws/build>
    [mkdir] Created dir: <https://builds.apache.org/job/POI-DSL-OpenJDK/ws/build/classes>
    [mkdir] Created dir: <https://builds.apache.org/job/POI-DSL-OpenJDK/ws/build/test-classes>
    [mkdir] Created dir: <https://builds.apache.org/job/POI-DSL-OpenJDK/ws/build/test-results>
    [mkdir] Created dir: <https://builds.apache.org/job/POI-DSL-OpenJDK/ws/build/scratchpad-classes>
    [mkdir] Created dir: <https://builds.apache.org/job/POI-DSL-OpenJDK/ws/build/scratchpad-test-classes>
    [mkdir] Created dir: <https://builds.apache.org/job/POI-DSL-OpenJDK/ws/build/scratchpad-test-results>
    [mkdir] Created dir: <https://builds.apache.org/job/POI-DSL-OpenJDK/ws/build/geometry-java>
    [mkdir] Created dir: <https://builds.apache.org/job/POI-DSL-OpenJDK/ws/build/ooxml-classes>
    [mkdir] Created dir: <https://builds.apache.org/job/POI-DSL-OpenJDK/ws/build/ooxml-test-classes>
    [mkdir] Created dir: <https://builds.apache.org/job/POI-DSL-OpenJDK/ws/build/ooxml-test-results>
    [mkdir] Created dir: <https://builds.apache.org/job/POI-DSL-OpenJDK/ws/build/excelant-classes>
    [mkdir] Created dir: <https://builds.apache.org/job/POI-DSL-OpenJDK/ws/build/excelant-test-classes>
    [mkdir] Created dir: <https://builds.apache.org/job/POI-DSL-OpenJDK/ws/build/excelant-test-results>
    [mkdir] Created dir: <https://builds.apache.org/job/POI-DSL-OpenJDK/ws/build/examples-classes>
    [mkdir] Created dir: <https://builds.apache.org/job/POI-DSL-OpenJDK/ws/build/integration-test-classes>
    [mkdir] Created dir: <https://builds.apache.org/job/POI-DSL-OpenJDK/314/artifact/build/integration-test-results>
    [mkdir] Created dir: <https://builds.apache.org/job/POI-DSL-OpenJDK/ws/build/dist>
    [mkdir] Created dir: <https://builds.apache.org/job/POI-DSL-OpenJDK/ws/build/tmp/site/build/site>
     [echo] Using Ant: Apache Ant(TM) version 1.9.9 compiled on February 2 2017 from /home/jenkins/tools/ant/apache-ant-1.9.9, Ant detected Java 1.8 (may be different than actual Java sometimes...)
     [echo] Using Java: 1.8.0_151/1.8.0_151-8u151-b12-0ubuntu0.16.04.2-b12/25.151-b12/OpenJDK 64-Bit Server VM from Oracle Corporation on Linux: 4.4.0-87-generic

compile-main:
    [javac] Compiling 1204 source files to <https://builds.apache.org/job/POI-DSL-OpenJDK/ws/build/classes>
    [javac] Note: Some input files use or override a deprecated API.
    [javac] Note: Recompile with -Xlint:deprecation for details.
    [javac] Note: Some input files use unchecked or unsafe operations.
    [javac] Note: Recompile with -Xlint:unchecked for details.
    [javac] Compiling 538 source files to <https://builds.apache.org/job/POI-DSL-OpenJDK/ws/build/test-classes>
    [javac] Note: Some input files use or override a deprecated API.
    [javac] Note: Recompile with -Xlint:deprecation for details.
    [javac] Note: <https://builds.apache.org/job/POI-DSL-OpenJDK/ws/src/testcases/org/apache/poi/ss/util/TestCellRangeUtil.java> uses unchecked or unsafe operations.
    [javac] Note: Recompile with -Xlint:unchecked for details.
     [copy] Copying 4 files to <https://builds.apache.org/job/POI-DSL-OpenJDK/ws/build/classes>

check-ooxml-xsds:

fetch-ooxml-xsds:

generate-geometry:

compile-scratchpad:
    [javac] Compiling 488 source files to <https://builds.apache.org/job/POI-DSL-OpenJDK/ws/build/scratchpad-classes>
    [javac] Note: Some input files use or override a deprecated API.
    [javac] Note: Recompile with -Xlint:deprecation for details.
    [javac] Compiling 190 source files to <https://builds.apache.org/job/POI-DSL-OpenJDK/ws/build/scratchpad-test-classes>
    [javac] Note: Some input files use or override a deprecated API.
    [javac] Note: Recompile with -Xlint:deprecation for details.
     [copy] Copying 2 files to <https://builds.apache.org/job/POI-DSL-OpenJDK/ws/build/scratchpad-classes>

check-compiled-ooxml-xsds:

compile-ooxml-xsds:

compile-ooxml:
    [javac] Compiling 436 source files to <https://builds.apache.org/job/POI-DSL-OpenJDK/ws/build/ooxml-classes>
    [javac] Note: Some input files use or override a deprecated API.
    [javac] Note: Recompile with -Xlint:deprecation for details.
    [javac] Compiling 242 source files to <https://builds.apache.org/job/POI-DSL-OpenJDK/ws/build/ooxml-test-classes>
    [javac] Note: Some input files use or override a deprecated API.
    [javac] Note: Recompile with -Xlint:deprecation for details.
     [copy] Copying 3 files to <https://builds.apache.org/job/POI-DSL-OpenJDK/ws/build/ooxml-classes>

compile-examples:
    [javac] Compiling 149 source files to <https://builds.apache.org/job/POI-DSL-OpenJDK/ws/build/examples-classes>
     [copy] Copying 1 file to <https://builds.apache.org/job/POI-DSL-OpenJDK/ws/build/examples-classes>

compile-excelant:
    [javac] Compiling 14 source files to <https://builds.apache.org/job/POI-DSL-OpenJDK/ws/build/excelant-classes>
    [javac] Compiling 13 source files to <https://builds.apache.org/job/POI-DSL-OpenJDK/ws/build/excelant-test-classes>
     [copy] Copying 1 file to <https://builds.apache.org/job/POI-DSL-OpenJDK/ws/build/excelant-classes>

compile:

-compile-ooxml-lite-check:

compile-ooxml-lite:
     [echo] Running ooxml-lite generator
    [mkdir] Created dir: <https://builds.apache.org/job/POI-DSL-OpenJDK/ws/build/ooxml-lite-merged>
      [jar] Building jar: <https://builds.apache.org/job/POI-DSL-OpenJDK/ws/build/ooxml-lite-merged/ooxml-lite-merged.jar>
     [java] Collecting unit tests from <https://builds.apache.org/job/POI-DSL-OpenJDK/ws/build/ooxml-test-classes>
     [java] Class org.apache.poi.benchmark.generated.AddImageBench_jmhType does not derive from TestCase and does not have a @Test annotation
     [java] Inner class org.apache.poi.TestPOIXMLDocument$UncaughtHandler.class not included
     [java] Inner class org.apache.poi.TestPOIXMLDocument$1.class not included
     [java] Inner class org.apache.poi.xssf.usermodel.TestMatrixFormulasFromXMLSpreadsheet$1.class not included
     [java] Inner class org.apache.poi.xssf.usermodel.TestMatrixFormulasFromXMLSpreadsheet$Navigator.class not included
     [java] Inner class org.apache.poi.dev.TestOOXMLLister$1.class not included
     [java] Inner class org.apache.poi.dev.TestOOXMLPrettyPrint$1.class not included
     [java] Found 219 classes
     [java] SLF4J: Failed to load class "org.slf4j.impl.StaticLoggerBinder".
     [java] SLF4J: Defaulting to no-operation (NOP) logger implementation
     [java] SLF4J: See http://www.slf4j.org/codes.html#StaticLoggerBinder for further details.
     [java] ....................................I.....................................................I.........................................................................................................................................I............................................................................................................................................................................................................................I........................................................................................I..I..I.I..................................................................................................................................................................................................................................................................................................................................................III.I.I.......I.......I.....I......................................................................................................................................................................................................................I......II........I.I........................I.........I.....I...........................................................................................................I............................I....I........................................................................................................................................................................................................................................................................................................................................................................................................................................................................................................................................I............................................................................................................................................................................I...............................I............................................................................................................................................................................I...........................I..................................................................................III......
     [java] Time: 109.744
     [java]
     [java] OK (2314 tests)
     [java]
     [java] Copying classes to <https://builds.apache.org/job/POI-DSL-OpenJDK/ws/build/ooxml-lite-classes>
     [java] Copying .xsb resources

compile-all:

jacocotask:
     [echo] Coverage reporting: true
  [taskdef] Could not load definitions from resource org/jacoco/ant/antlib.xml. It could not be found.

-test-main-check:

test-main:

BUILD FAILED
<https://builds.apache.org/job/POI-DSL-OpenJDK/ws/build.xml>:1256: Problem: failed to create task or type antlib:org.jacoco.ant:coverage
Cause: The name is undefined.
Action: Check the spelling.
Action: Check that any custom tasks/types have been declared.
Action: Check that any <presetdef>/<macrodef> declarations have taken place.
No types or tasks have been defined in this namespace yet

This appears to be an antlib declaration.
Action: Check that the implementing library exists in one of:
        -/home/jenkins/tools/ant/apache-ant-1.9.9/lib
        -/home/jenkins/.ant/lib
        -a directory added on the command line with the -lib argument


Total time: 2 minutes 48 seconds
Build step 'Invoke Ant' marked build as failure
Skipping publisher since build result is FAILURE
Archiving artifacts
[Fast Archiver] Compressed 66.30 MB of artifacts by 65.4% relative to #313
Skipping publisher since build result is FAILURE
Recording test results
ERROR: Step ?Publish JUnit test result report? failed: No test report files were found. Configuration error?


---------------------------------------------------------------------
To unsubscribe, e-mail: [hidden email]
For additional commands, e-mail: [hidden email]

Reply | Threaded
Open this post in threaded view
|

Build failed in Jenkins: POI-DSL-OpenJDK #315

Apache Jenkins Server
See <https://builds.apache.org/job/POI-DSL-OpenJDK/315/display/redirect?page=changes>

Changes:

[onealj] bug 61745: add support for charts in XWPF/docx. Thanks to Sandeep Tiwari for the patch

------------------------------------------
[...truncated 424.63 KB...]
  [javadoc] Loading source files for package org.apache.poi.hssf.usermodel.helpers...
  [javadoc] Loading source files for package org.apache.poi.hssf.util...
  [javadoc] Loading source files for package org.apache.poi.poifs.common...
  [javadoc] Loading source files for package org.apache.poi.poifs.crypt...
  [javadoc] Loading source files for package org.apache.poi.poifs.crypt.binaryrc4...
  [javadoc] Loading source files for package org.apache.poi.poifs.crypt.cryptoapi...
  [javadoc] Loading source files for package org.apache.poi.poifs.crypt.standard...
  [javadoc] Loading source files for package org.apache.poi.poifs.crypt.xor...
  [javadoc] Loading source files for package org.apache.poi.poifs.dev...
  [javadoc] Loading source files for package org.apache.poi.poifs.eventfilesystem...
  [javadoc] Loading source files for package org.apache.poi.poifs.filesystem...
  [javadoc] Loading source files for package org.apache.poi.poifs.macros...
  [javadoc] Loading source files for package org.apache.poi.poifs.nio...
  [javadoc] Loading source files for package org.apache.poi.poifs.property...
  [javadoc] Loading source files for package org.apache.poi.poifs.storage...
  [javadoc] Loading source files for package org.apache.poi.sl.draw...
  [javadoc] Loading source files for package org.apache.poi.sl.draw.binding...
  [javadoc] Loading source files for package org.apache.poi.sl.draw.geom...
  [javadoc] Loading source files for package org.apache.poi.sl.image...
  [javadoc] Loading source files for package org.apache.poi.sl.usermodel...
  [javadoc] Loading source files for package org.apache.poi.ss...
  [javadoc] Loading source files for package org.apache.poi.ss.extractor...
  [javadoc] Loading source files for package org.apache.poi.ss.format...
  [javadoc] Loading source files for package org.apache.poi.ss.formula...
  [javadoc] Loading source files for package org.apache.poi.ss.formula.atp...
  [javadoc] Loading source files for package org.apache.poi.ss.formula.constant...
  [javadoc] Loading source files for package org.apache.poi.ss.formula.eval...
  [javadoc] Loading source files for package org.apache.poi.ss.formula.eval.forked...
  [javadoc] Loading source files for package org.apache.poi.ss.formula.function...
  [javadoc] Loading source files for package org.apache.poi.ss.formula.functions...
  [javadoc] Loading source files for package org.apache.poi.ss.formula.ptg...
  [javadoc] Loading source files for package org.apache.poi.ss.formula.udf...
  [javadoc] Loading source files for package org.apache.poi.ss.usermodel...
  [javadoc] Loading source files for package org.apache.poi.ss.usermodel.charts...
  [javadoc] Loading source files for package org.apache.poi.ss.usermodel.helpers...
  [javadoc] Loading source files for package org.apache.poi.ss.util...
  [javadoc] Loading source files for package org.apache.poi.ss.util.cellwalk...
  [javadoc] Loading source files for package org.apache.poi.util...
  [javadoc] Loading source files for package org.apache.poi.wp.usermodel...
  [javadoc] Loading source files for package org.apache.poi.hdgf...
  [javadoc] Loading source files for package org.apache.poi.hdgf.chunks...
  [javadoc] Loading source files for package org.apache.poi.hdgf.dev...
  [javadoc] Loading source files for package org.apache.poi.hdgf.exceptions...
  [javadoc] Loading source files for package org.apache.poi.hdgf.extractor...
  [javadoc] Loading source files for package org.apache.poi.hdgf.pointers...
  [javadoc] Loading source files for package org.apache.poi.hdgf.streams...
  [javadoc] Loading source files for package org.apache.poi.hemf.extractor...
  [javadoc] Loading source files for package org.apache.poi.hemf.hemfplus.record...
  [javadoc] Loading source files for package org.apache.poi.hemf.record...
  [javadoc] Loading source files for package org.apache.poi.hmef...
  [javadoc] Loading source files for package org.apache.poi.hmef.attribute...
  [javadoc] Loading source files for package org.apache.poi.hmef.dev...
  [javadoc] Loading source files for package org.apache.poi.hmef.extractor...
  [javadoc] Loading source files for package org.apache.poi.hpbf...
  [javadoc] Loading source files for package org.apache.poi.hpbf.dev...
  [javadoc] Loading source files for package org.apache.poi.hpbf.extractor...
  [javadoc] Loading source files for package org.apache.poi.hpbf.model...
  [javadoc] Loading source files for package org.apache.poi.hpbf.model.qcbits...
  [javadoc] Loading source files for package org.apache.poi.hslf.blip...
  [javadoc] Loading source files for package org.apache.poi.hslf.dev...
  [javadoc] Loading source files for package org.apache.poi.hslf.exceptions...
  [javadoc] Loading source files for package org.apache.poi.hslf.extractor...
  [javadoc] Loading source files for package org.apache.poi.hslf.model...
  [javadoc] Loading source files for package org.apache.poi.hslf.model.textproperties...
  [javadoc] Loading source files for package org.apache.poi.hslf.record...
  [javadoc] Loading source files for package org.apache.poi.hslf.usermodel...
  [javadoc] Loading source files for package org.apache.poi.hslf.util...
  [javadoc] Loading source files for package org.apache.poi.hsmf...
  [javadoc] Loading source files for package org.apache.poi.hsmf.datatypes...
  [javadoc] Loading source files for package org.apache.poi.hsmf.dev...
  [javadoc] Loading source files for package org.apache.poi.hsmf.exceptions...
  [javadoc] Loading source files for package org.apache.poi.hsmf.extractor...
  [javadoc] Loading source files for package org.apache.poi.hsmf.parsers...
  [javadoc] Loading source files for package org.apache.poi.hssf.converter...
  [javadoc] Loading source files for package org.apache.poi.hwmf.draw...
  [javadoc] Loading source files for package org.apache.poi.hwmf.record...
  [javadoc] Loading source files for package org.apache.poi.hwmf.usermodel...
  [javadoc] Loading source files for package org.apache.poi.hwpf...
  [javadoc] Loading source files for package org.apache.poi.hwpf.converter...
  [javadoc] Loading source files for package org.apache.poi.hwpf.dev...
  [javadoc] Loading source files for package org.apache.poi.hwpf.extractor...
  [javadoc] Loading source files for package org.apache.poi.hwpf.model...
  [javadoc] Loading source files for package org.apache.poi.hwpf.model.io...
  [javadoc] Loading source files for package org.apache.poi.hwpf.model.types...
  [javadoc] Loading source files for package org.apache.poi.hwpf.sprm...
  [javadoc] Loading source files for package org.apache.poi.hwpf.usermodel...
  [javadoc] Loading source files for package org.apache.poi.openxml4j.exceptions...
  [javadoc] Loading source files for package org.apache.poi.openxml4j.opc...
  [javadoc] Loading source files for package org.apache.poi.openxml4j.opc.internal...
  [javadoc] Loading source files for package org.apache.poi.openxml4j.opc.internal.marshallers...
  [javadoc] Loading source files for package org.apache.poi.openxml4j.opc.internal.unmarshallers...
  [javadoc] Loading source files for package org.apache.poi.openxml4j.util...
  [javadoc] Loading source files for package org.apache.poi.poifs.crypt.agile...
  [javadoc] Loading source files for package org.apache.poi.poifs.crypt.dsig...
  [javadoc] Loading source files for package org.apache.poi.poifs.crypt.dsig.facets...
  [javadoc] Loading source files for package org.apache.poi.poifs.crypt.dsig.services...
  [javadoc] Loading source files for package org.apache.poi.poifs.crypt.temp...
  [javadoc] Loading source files for package org.apache.poi.xdgf.exceptions...
  [javadoc] Loading source files for package org.apache.poi.xdgf.extractor...
  [javadoc] Loading source files for package org.apache.poi.xdgf.geom...
  [javadoc] Loading source files for package org.apache.poi.xdgf.usermodel...
  [javadoc] Loading source files for package org.apache.poi.xdgf.usermodel.section...
  [javadoc] Loading source files for package org.apache.poi.xdgf.usermodel.section.geometry...
  [javadoc] Loading source files for package org.apache.poi.xdgf.usermodel.shape...
  [javadoc] Loading source files for package org.apache.poi.xdgf.usermodel.shape.exceptions...
  [javadoc] Loading source files for package org.apache.poi.xdgf.util...
  [javadoc] Loading source files for package org.apache.poi.xdgf.xml...
  [javadoc] Loading source files for package org.apache.poi.xslf.extractor...
  [javadoc] Loading source files for package org.apache.poi.xslf.model...
  [javadoc] Loading source files for package org.apache.poi.xslf.usermodel...
  [javadoc] Loading source files for package org.apache.poi.xslf.util...
  [javadoc] Loading source files for package org.apache.poi.xssf...
  [javadoc] Loading source files for package org.apache.poi.xssf.binary...
  [javadoc] Loading source files for package org.apache.poi.xssf.dev...
  [javadoc] Loading source files for package org.apache.poi.xssf.eventusermodel...
  [javadoc] Loading source files for package org.apache.poi.xssf.extractor...
  [javadoc] Loading source files for package org.apache.poi.xssf.model...
  [javadoc] Loading source files for package org.apache.poi.xssf.streaming...
  [javadoc] Loading source files for package org.apache.poi.xssf.usermodel...
  [javadoc] Loading source files for package org.apache.poi.xssf.usermodel.charts...
  [javadoc] Loading source files for package org.apache.poi.xssf.usermodel.extensions...
  [javadoc] Loading source files for package org.apache.poi.xssf.usermodel.helpers...
  [javadoc] Loading source files for package org.apache.poi.xssf.util...
  [javadoc] Loading source files for package org.apache.poi.xwpf.extractor...
  [javadoc] Loading source files for package org.apache.poi.xwpf.model...
  [javadoc] Loading source files for package org.apache.poi.xwpf.usermodel...
  [javadoc] Constructing Javadoc information...
  [javadoc] Creating destination directory: "<https://builds.apache.org/job/POI-DSL-OpenJDK/ws/build/tmp/site/build/site/apidocs/">
  [javadoc] Standard Doclet version 1.8.0_151
  [javadoc] Building tree for all the packages and classes...
  [javadoc] Building index for all the packages and classes...
  [javadoc] Building index for all classes...

jar-src:
      [jar] Building jar: <https://builds.apache.org/job/POI-DSL-OpenJDK/ws/build/dist/maven/poi/poi-4.0.0-SNAPSHOT-sources.jar>
      [jar] Building jar: <https://builds.apache.org/job/POI-DSL-OpenJDK/ws/build/dist/maven/poi-scratchpad/poi-scratchpad-4.0.0-SNAPSHOT-sources.jar>
      [jar] Building jar: <https://builds.apache.org/job/POI-DSL-OpenJDK/ws/build/dist/maven/poi-ooxml/poi-ooxml-4.0.0-SNAPSHOT-sources.jar>
      [jar] Building jar: <https://builds.apache.org/job/POI-DSL-OpenJDK/ws/build/dist/maven/poi-examples/poi-examples-4.0.0-SNAPSHOT-sources.jar>
      [jar] Building jar: <https://builds.apache.org/job/POI-DSL-OpenJDK/ws/build/dist/maven/poi-excelant/poi-excelant-4.0.0-SNAPSHOT-sources.jar>

-do-jar-check-javadocs-package-list:

-do-jar-create-javadocs-package-list:

jar-javadocs:
     [echo] Building poi javadocs from <https://builds.apache.org/job/POI-DSL-OpenJDK/ws/src/java>
    [mkdir] Created dir: <https://builds.apache.org/job/POI-DSL-OpenJDK/ws/build/tmp/maven-javadocs>
  [javadoc] Generating Javadoc
  [javadoc] Javadoc execution
      [jar] Building jar: <https://builds.apache.org/job/POI-DSL-OpenJDK/ws/build/dist/maven/poi/poi-4.0.0-SNAPSHOT-javadoc.jar>
     [echo] Building poi-scratchpad javadocs from <https://builds.apache.org/job/POI-DSL-OpenJDK/ws/src/scratchpad/src>
   [delete] Deleting directory <https://builds.apache.org/job/POI-DSL-OpenJDK/ws/build/tmp/maven-javadocs>
    [mkdir] Created dir: <https://builds.apache.org/job/POI-DSL-OpenJDK/ws/build/tmp/maven-javadocs>
  [javadoc] Generating Javadoc
  [javadoc] Javadoc execution
      [jar] Building jar: <https://builds.apache.org/job/POI-DSL-OpenJDK/ws/build/dist/maven/poi-scratchpad/poi-scratchpad-4.0.0-SNAPSHOT-javadoc.jar>
     [echo] Building poi-ooxml javadocs from <https://builds.apache.org/job/POI-DSL-OpenJDK/ws/src/ooxml/java>
   [delete] Deleting directory <https://builds.apache.org/job/POI-DSL-OpenJDK/ws/build/tmp/maven-javadocs>
    [mkdir] Created dir: <https://builds.apache.org/job/POI-DSL-OpenJDK/ws/build/tmp/maven-javadocs>
  [javadoc] Generating Javadoc
  [javadoc] Javadoc execution
      [jar] Building jar: <https://builds.apache.org/job/POI-DSL-OpenJDK/ws/build/dist/maven/poi-ooxml/poi-ooxml-4.0.0-SNAPSHOT-javadoc.jar>

assemble:
      [zip] Building zip: <https://builds.apache.org/job/POI-DSL-OpenJDK/ws/build/dist/poi-bin-4.0.0-SNAPSHOT-20171113.zip>
      [tar] Building tar: <https://builds.apache.org/job/POI-DSL-OpenJDK/315/artifact/build/dist/poi-bin-4.0.0-SNAPSHOT-20171113.tar.gz>
      [zip] Building zip: <https://builds.apache.org/job/POI-DSL-OpenJDK/ws/build/dist/poi-src-4.0.0-SNAPSHOT-20171113.zip>
      [tar] Building tar: <https://builds.apache.org/job/POI-DSL-OpenJDK/315/artifact/build/dist/poi-src-4.0.0-SNAPSHOT-20171113.tar.gz>
     [echo] Creating Maven POMs

maven-poms:
     [copy] Copying 6 files to <https://builds.apache.org/job/POI-DSL-OpenJDK/ws/build/dist/maven>
     [echo] Maven POMs are located in <https://builds.apache.org/job/POI-DSL-OpenJDK/ws/build/dist>
     [echo] Use ant dist-nexus to deploy the artifacts in the remote repository
     [echo] Distribution located in <https://builds.apache.org/job/POI-DSL-OpenJDK/ws/build/dist>
     [echo] Use "ant dist-checksum" to create md5/sha1/sha512 checksums and GPG signatures

findbugs:
      [get] Destination already exists (skipping): <https://builds.apache.org/job/POI-DSL-OpenJDK/ws/lib/findbugs-noUpdateChecks-3.0.1.zip>
    [unzip] Expanding: <https://builds.apache.org/job/POI-DSL-OpenJDK/ws/lib/findbugs-noUpdateChecks-3.0.1.zip> into <https://builds.apache.org/job/POI-DSL-OpenJDK/ws/build/findbugs>
 [findbugs] Executing findbugs FindBugsTask from ant task
 [findbugs] Running FindBugs...
 [findbugs] Warnings generated: 39
 [findbugs] Calculating exit code...
 [findbugs] Setting 'bugs found' flag (1)
 [findbugs] Exit code set to: 1
 [findbugs] Java Result: 1
 [findbugs] Output saved to build/findbugs.xml
     [xslt] Transforming into <https://builds.apache.org/job/POI-DSL-OpenJDK/ws/build>
     [xslt] Processing <https://builds.apache.org/job/POI-DSL-OpenJDK/ws/build/findbugs.xml> to <https://builds.apache.org/job/POI-DSL-OpenJDK/315/artifact/build/findbugs.html>
     [xslt] Loading stylesheet jar:<https://builds.apache.org/job/POI-DSL-OpenJDK/ws/build/findbugs/lib/findbugs.jar!/fancy-hist.xsl>

release-notes:
     [copy] Copying 1 file to <https://builds.apache.org/job/POI-DSL-OpenJDK/ws/build/dist>

rat-check:
    [mkdir] Created dir: <https://builds.apache.org/job/POI-DSL-OpenJDK/ws/build/rat>
     [echo]
     [echo] *****************************************************
     [echo] Summary
     [echo] -------
     [echo] Generated at: 2017-11-13T00:59:41+00:00
     [echo]
     [echo] Notes: 1
     [echo] Binaries: 119
     [echo] Archives: 0
     [echo] Standards: 3619
     [echo]
     [echo] Apache Licensed: 3619
     [echo] Generated Documents: 0
     [echo]
     [echo] JavaDocs are generated, thus a license header is optional.
     [echo] Generated files do not require license headers.
     [echo]
     [echo] 0 Unknown Licenses
     [echo]
     [echo] *****************************************************
     [echo]   Files with Apache License headers will be marked AL
     [echo]   Binary files (which do not require any license headers) will be marked B
     [echo]   Compressed archives will be marked A
     [echo]   Notices, licenses etc. will be marked N
     [echo]  
     [echo] *****************************************************

forbidden-apis-check:
[forbiddenapis] Reading bundled API signatures: jdk-unsafe-1.8
[forbiddenapis] Reading bundled API signatures: jdk-deprecated-1.8
[forbiddenapis] Reading bundled API signatures: jdk-internal-1.8
[forbiddenapis] Reading bundled API signatures: jdk-non-portable
[forbiddenapis] Reading bundled API signatures: jdk-reflection
[forbiddenapis] Reading API signatures: <https://builds.apache.org/job/POI-DSL-OpenJDK/ws/src/resources/devtools/forbidden-signatures.txt>
[forbiddenapis] Loading classes to check...
[forbiddenapis] Scanning classes for violations...
[forbiddenapis] Forbidden method invocation: java.lang.String#toString() [Unnecessary, inefficient, and confusing conversion of String.toString]
[forbiddenapis]   in org.apache.poi.xwpf.usermodel.TestXWPFChart (TestXWPFChart.java:70)
[forbiddenapis] Forbidden method invocation: java.lang.String#toString() [Unnecessary, inefficient, and confusing conversion of String.toString]
[forbiddenapis]   in org.apache.poi.xwpf.usermodel.TestXWPFChart (TestXWPFChart.java:82)
[forbiddenapis] Scanned 4003 (and 1851 related) class file(s) for forbidden API invocations (in 13.55s), 2 error(s).

BUILD FAILED
<https://builds.apache.org/job/POI-DSL-OpenJDK/ws/build.xml>:2081: Check for forbidden API calls failed, see log.

Total time: 17 minutes 7 seconds
Build step 'Invoke Ant' marked build as failure
Skipping publisher since build result is FAILURE
Archiving artifacts
[Fast Archiver] Compressed 234.52 MB of artifacts by 42.5% relative to #313
Skipping publisher since build result is FAILURE
Recording test results

---------------------------------------------------------------------
To unsubscribe, e-mail: [hidden email]
For additional commands, e-mail: [hidden email]

Reply | Threaded
Open this post in threaded view
|

Build failed in Jenkins: POI-DSL-OpenJDK #316

Apache Jenkins Server
See <https://builds.apache.org/job/POI-DSL-OpenJDK/316/display/redirect?page=changes>

Changes:

[centic] Fix setting a font-color if no previous color is defined for the font
Add unit-test to verify this

[centic] Fix tests

[onealj] bug 61745: remove String#toString() usage found by forbidden apis check

------------------------------------------
[...truncated 2.50 KB...]
total 28
drwxr-xr-x 7 root root 4096 Nov  8 08:41 .
drwxr-xr-x 4 root root 4096 Nov  8 08:41 ..
lrwxrwxrwx 1 root root   22 Oct 27 22:51 ASSEMBLY_EXCEPTION -> jre/ASSEMBLY_EXCEPTION
drwxr-xr-x 2 root root 4096 Nov  8 08:41 bin
lrwxrwxrwx 1 root root   41 Jan 23  2017 docs -> ../../../share/doc/openjdk-8-jre-headless
drwxr-xr-x 3 root root 4096 Nov  8 08:41 include
drwxr-xr-x 5 root root 4096 Nov  8 08:41 jre
drwxr-xr-x 3 root root 4096 Nov  8 08:41 lib
drwxr-xr-x 4 root root 4096 Feb 11  2017 man
lrwxrwxrwx 1 root root   20 Oct 27 22:51 src.zip -> ../openjdk-8/src.zip
lrwxrwxrwx 1 root root   22 Oct 27 22:51 THIRD_PARTY_README -> jre/THIRD_PARTY_README
+ ls -al /usr/lib/jvm/java-8-openjdk-amd64//bin
total 244
drwxr-xr-x 2 root root 4096 Nov  8 08:41 .
drwxr-xr-x 7 root root 4096 Nov  8 08:41 ..
-rwxr-xr-x 1 root root 6504 Oct 27 22:51 appletviewer
-rwxr-xr-x 1 root root 6504 Oct 27 22:51 extcheck
-rwxr-xr-x 1 root root 6504 Oct 27 22:51 idlj
-rwxr-xr-x 1 root root 6504 Oct 27 22:51 jar
-rwxr-xr-x 1 root root 6504 Oct 27 22:51 jarsigner
lrwxrwxrwx 1 root root   15 Oct 27 22:51 java -> ../jre/bin/java
-rwxr-xr-x 1 root root 6504 Oct 27 22:51 javac
-rwxr-xr-x 1 root root 6504 Oct 27 22:51 javadoc
-rwxr-xr-x 1 root root 6504 Oct 27 22:51 javah
-rwxr-xr-x 1 root root 6504 Oct 27 22:51 javap
-rwxr-xr-x 1 root root 2806 Oct 27 22:04 java-rmi.cgi
-rwxr-xr-x 1 root root 6504 Oct 27 22:51 jcmd
-rwxr-xr-x 1 root root 6528 Oct 27 22:51 jconsole
-rwxr-xr-x 1 root root 6520 Oct 27 22:51 jdb
-rwxr-xr-x 1 root root 6504 Oct 27 22:51 jdeps
-rwxr-xr-x 1 root root 6504 Oct 27 22:51 jhat
-rwxr-xr-x 1 root root 6568 Oct 27 22:51 jinfo
lrwxrwxrwx 1 root root   14 Oct 27 22:51 jjs -> ../jre/bin/jjs
-rwxr-xr-x 1 root root 6568 Oct 27 22:51 jmap
-rwxr-xr-x 1 root root 6504 Oct 27 22:51 jps
-rwxr-xr-x 1 root root 6504 Oct 27 22:51 jrunscript
-rwxr-xr-x 1 root root 6520 Oct 27 22:51 jsadebugd
-rwxr-xr-x 1 root root 6568 Oct 27 22:51 jstack
-rwxr-xr-x 1 root root 6504 Oct 27 22:51 jstat
-rwxr-xr-x 1 root root 6504 Oct 27 22:51 jstatd
lrwxrwxrwx 1 root root   18 Oct 27 22:51 keytool -> ../jre/bin/keytool
-rwxr-xr-x 1 root root 6504 Oct 27 22:51 native2ascii
lrwxrwxrwx 1 root root   15 Oct 27 22:51 orbd -> ../jre/bin/orbd
lrwxrwxrwx 1 root root   18 Oct 27 22:51 pack200 -> ../jre/bin/pack200
lrwxrwxrwx 1 root root   21 Oct 27 22:51 policytool -> ../jre/bin/policytool
-rwxr-xr-x 1 root root 6504 Oct 27 22:51 rmic
lrwxrwxrwx 1 root root   15 Oct 27 22:51 rmid -> ../jre/bin/rmid
lrwxrwxrwx 1 root root   22 Oct 27 22:51 rmiregistry -> ../jre/bin/rmiregistry
-rwxr-xr-x 1 root root 6504 Oct 27 22:51 schemagen
-rwxr-xr-x 1 root root 6504 Oct 27 22:51 serialver
lrwxrwxrwx 1 root root   21 Oct 27 22:51 servertool -> ../jre/bin/servertool
lrwxrwxrwx 1 root root   20 Oct 27 22:51 tnameserv -> ../jre/bin/tnameserv
lrwxrwxrwx 1 root root   20 Oct 27 22:51 unpack200 -> ../jre/bin/unpack200
-rwxr-xr-x 1 root root 6504 Oct 27 22:51 wsgen
-rwxr-xr-x 1 root root 6504 Oct 27 22:51 wsimport
-rwxr-xr-x 1 root root 6504 Oct 27 22:51 xjc
+ /usr/lib/jvm/java-8-openjdk-amd64//bin/java -version
openjdk version "1.8.0_151"
OpenJDK Runtime Environment (build 1.8.0_151-8u151-b12-0ubuntu0.16.04.2-b12)
OpenJDK 64-Bit Server VM (build 25.151-b12, mixed mode)
+ echo which java
which java
+ which java
/usr/lib/jvm/java-8-openjdk-amd64//bin/java
+ java -version
openjdk version "1.8.0_151"
OpenJDK Runtime Environment (build 1.8.0_151-8u151-b12-0ubuntu0.16.04.2-b12)
OpenJDK 64-Bit Server VM (build 25.151-b12, mixed mode)
+ echo which javac
which javac
+ which javac
/usr/lib/jvm/java-8-openjdk-amd64//bin/javac
+ javac -version
javac 1.8.0_151
+ echo '<project default="test"><target name="test"><echo>Java ${ant.java.version}/${java.version}</echo><exec executable="javac"><arg value="-version"/></exec></target></project>'
+ ant -f build.javacheck.xml -v
Apache Ant(TM) version 1.9.6 compiled on July 8 2015
Buildfile: <https://builds.apache.org/job/POI-DSL-OpenJDK/ws/build.javacheck.xml>
Detected Java version: 1.8 in: /usr/lib/jvm/java-8-openjdk-amd64/jre
Detected OS: Linux
parsing buildfile <https://builds.apache.org/job/POI-DSL-OpenJDK/ws/build.javacheck.xml> with URI = <https://builds.apache.org/job/POI-DSL-OpenJDK/ws/build.javacheck.xml>
Project base dir set to: <https://builds.apache.org/job/POI-DSL-OpenJDK/ws/>
Build sequence for target(s) `test' is [test]
Complete build sequence is [test, ]

test:
parsing buildfile jar:file:/usr/share/ant/lib/ant.jar!/org/apache/tools/ant/antlib.xml with URI = jar:file:/usr/share/ant/lib/ant.jar!/org/apache/tools/ant/antlib.xml from a zip file
     [echo] Java 1.8/1.8.0_151
     [exec] Current OS is Linux
     [exec] Executing 'javac' with arguments:
     [exec] '-version'
     [exec]
     [exec] The ' characters around the executable and arguments are
     [exec] not part of the command.
     [exec] javac 1.8.0_151

BUILD SUCCESSFUL
Total time: 0 seconds
+ exit 0
[POI-DSL-OpenJDK] $ /home/jenkins/tools/ant/apache-ant-1.9.9/bin/ant -Dcoverage.enabled=true clean jenkins
Buildfile: <https://builds.apache.org/job/POI-DSL-OpenJDK/ws/build.xml>

clean:
   [delete] Deleting directory <https://builds.apache.org/job/POI-DSL-OpenJDK/ws/build>

check-jars:

fetch-jars:

check-ooxml-jars:

fetch-ooxml-jars:

init:
    [mkdir] Created dir: <https://builds.apache.org/job/POI-DSL-OpenJDK/ws/build>
    [mkdir] Created dir: <https://builds.apache.org/job/POI-DSL-OpenJDK/ws/build/classes>
    [mkdir] Created dir: <https://builds.apache.org/job/POI-DSL-OpenJDK/ws/build/test-classes>
    [mkdir] Created dir: <https://builds.apache.org/job/POI-DSL-OpenJDK/ws/build/test-results>
    [mkdir] Created dir: <https://builds.apache.org/job/POI-DSL-OpenJDK/ws/build/scratchpad-classes>
    [mkdir] Created dir: <https://builds.apache.org/job/POI-DSL-OpenJDK/ws/build/scratchpad-test-classes>
    [mkdir] Created dir: <https://builds.apache.org/job/POI-DSL-OpenJDK/ws/build/scratchpad-test-results>
    [mkdir] Created dir: <https://builds.apache.org/job/POI-DSL-OpenJDK/ws/build/geometry-java>
    [mkdir] Created dir: <https://builds.apache.org/job/POI-DSL-OpenJDK/ws/build/ooxml-classes>
    [mkdir] Created dir: <https://builds.apache.org/job/POI-DSL-OpenJDK/ws/build/ooxml-test-classes>
    [mkdir] Created dir: <https://builds.apache.org/job/POI-DSL-OpenJDK/ws/build/ooxml-test-results>
    [mkdir] Created dir: <https://builds.apache.org/job/POI-DSL-OpenJDK/ws/build/excelant-classes>
    [mkdir] Created dir: <https://builds.apache.org/job/POI-DSL-OpenJDK/ws/build/excelant-test-classes>
    [mkdir] Created dir: <https://builds.apache.org/job/POI-DSL-OpenJDK/ws/build/excelant-test-results>
    [mkdir] Created dir: <https://builds.apache.org/job/POI-DSL-OpenJDK/ws/build/examples-classes>
    [mkdir] Created dir: <https://builds.apache.org/job/POI-DSL-OpenJDK/ws/build/integration-test-classes>
    [mkdir] Created dir: <https://builds.apache.org/job/POI-DSL-OpenJDK/316/artifact/build/integration-test-results>
    [mkdir] Created dir: <https://builds.apache.org/job/POI-DSL-OpenJDK/ws/build/dist>
    [mkdir] Created dir: <https://builds.apache.org/job/POI-DSL-OpenJDK/ws/build/tmp/site/build/site>
     [echo] Using Ant: Apache Ant(TM) version 1.9.9 compiled on February 2 2017 from /home/jenkins/tools/ant/apache-ant-1.9.9, Ant detected Java 1.8 (may be different than actual Java sometimes...)
     [echo] Using Java: 1.8.0_151/1.8.0_151-8u151-b12-0ubuntu0.16.04.2-b12/25.151-b12/OpenJDK 64-Bit Server VM from Oracle Corporation on Linux: 4.4.0-87-generic

compile-main:
    [javac] Compiling 1204 source files to <https://builds.apache.org/job/POI-DSL-OpenJDK/ws/build/classes>
    [javac] Note: Some input files use or override a deprecated API.
    [javac] Note: Recompile with -Xlint:deprecation for details.
    [javac] Note: Some input files use unchecked or unsafe operations.
    [javac] Note: Recompile with -Xlint:unchecked for details.
    [javac] Compiling 538 source files to <https://builds.apache.org/job/POI-DSL-OpenJDK/ws/build/test-classes>
    [javac] Note: Some input files use or override a deprecated API.
    [javac] Note: Recompile with -Xlint:deprecation for details.
    [javac] Note: <https://builds.apache.org/job/POI-DSL-OpenJDK/ws/src/testcases/org/apache/poi/ss/util/TestCellRangeUtil.java> uses unchecked or unsafe operations.
    [javac] Note: Recompile with -Xlint:unchecked for details.
     [copy] Copying 4 files to <https://builds.apache.org/job/POI-DSL-OpenJDK/ws/build/classes>

check-ooxml-xsds:

fetch-ooxml-xsds:

generate-geometry:

compile-scratchpad:
    [javac] Compiling 488 source files to <https://builds.apache.org/job/POI-DSL-OpenJDK/ws/build/scratchpad-classes>
    [javac] Note: Some input files use or override a deprecated API.
    [javac] Note: Recompile with -Xlint:deprecation for details.
    [javac] Compiling 190 source files to <https://builds.apache.org/job/POI-DSL-OpenJDK/ws/build/scratchpad-test-classes>
    [javac] Note: Some input files use or override a deprecated API.
    [javac] Note: Recompile with -Xlint:deprecation for details.
     [copy] Copying 2 files to <https://builds.apache.org/job/POI-DSL-OpenJDK/ws/build/scratchpad-classes>

check-compiled-ooxml-xsds:

compile-ooxml-xsds:

compile-ooxml:
    [javac] Compiling 437 source files to <https://builds.apache.org/job/POI-DSL-OpenJDK/ws/build/ooxml-classes>
    [javac] Note: Some input files use or override a deprecated API.
    [javac] Note: Recompile with -Xlint:deprecation for details.
    [javac] Compiling 243 source files to <https://builds.apache.org/job/POI-DSL-OpenJDK/ws/build/ooxml-test-classes>
    [javac] Note: Some input files use or override a deprecated API.
    [javac] Note: Recompile with -Xlint:deprecation for details.
     [copy] Copying 3 files to <https://builds.apache.org/job/POI-DSL-OpenJDK/ws/build/ooxml-classes>

compile-examples:
    [javac] Compiling 149 source files to <https://builds.apache.org/job/POI-DSL-OpenJDK/ws/build/examples-classes>
     [copy] Copying 1 file to <https://builds.apache.org/job/POI-DSL-OpenJDK/ws/build/examples-classes>

compile-excelant:
    [javac] Compiling 14 source files to <https://builds.apache.org/job/POI-DSL-OpenJDK/ws/build/excelant-classes>
    [javac] Compiling 13 source files to <https://builds.apache.org/job/POI-DSL-OpenJDK/ws/build/excelant-test-classes>
     [copy] Copying 1 file to <https://builds.apache.org/job/POI-DSL-OpenJDK/ws/build/excelant-classes>

compile:

-compile-ooxml-lite-check:

compile-ooxml-lite:
     [echo] Running ooxml-lite generator
    [mkdir] Created dir: <https://builds.apache.org/job/POI-DSL-OpenJDK/ws/build/ooxml-lite-merged>
      [jar] Building jar: <https://builds.apache.org/job/POI-DSL-OpenJDK/ws/build/ooxml-lite-merged/ooxml-lite-merged.jar>
     [java] Collecting unit tests from <https://builds.apache.org/job/POI-DSL-OpenJDK/ws/build/ooxml-test-classes>
     [java] Class org.apache.poi.benchmark.generated.AddImageBench_jmhType does not derive from TestCase and does not have a @Test annotation
     [java] Inner class org.apache.poi.TestPOIXMLDocument$UncaughtHandler.class not included
     [java] Inner class org.apache.poi.TestPOIXMLDocument$1.class not included
     [java] Inner class org.apache.poi.xssf.usermodel.TestMatrixFormulasFromXMLSpreadsheet$1.class not included
     [java] Inner class org.apache.poi.xssf.usermodel.TestMatrixFormulasFromXMLSpreadsheet$Navigator.class not included
     [java] Inner class org.apache.poi.dev.TestOOXMLLister$1.class not included
     [java] Inner class org.apache.poi.dev.TestOOXMLPrettyPrint$1.class not included
     [java] Found 220 classes
     [java] SLF4J: Failed to load class "org.slf4j.impl.StaticLoggerBinder".
     [java] SLF4J: Defaulting to no-operation (NOP) logger implementation
     [java] SLF4J: See http://www.slf4j.org/codes.html#StaticLoggerBinder for further details.
     [java] ....................................I.....................................................I.........................................................................................................................................I............................................................................................................................................................................................................................I........................................................................................I..I..I.I..................................................................................................................................................................................................................................................................................................................................................III.I.I.......I.......I.....I.......................................................................................................................................................................................................................I......II........I.I........................I.........I.....I...........................................................................................................I............................I....I........................................................................................................................................................................................................................................................................................................................................................................................................................................................................................................................................I............................................................................................................................................................................I...............................I............................................................................................................................................................................I...........................I.....................................................................................III......
     [java] Time: 112.621
     [java]
     [java] OK (2318 tests)
     [java]
     [java] Copying classes to <https://builds.apache.org/job/POI-DSL-OpenJDK/ws/build/ooxml-lite-classes>
     [java] Copying .xsb resources

compile-all:

jacocotask:
     [echo] Coverage reporting: true
  [taskdef] Could not load definitions from resource org/jacoco/ant/antlib.xml. It could not be found.

-test-main-check:

test-main:

BUILD FAILED
<https://builds.apache.org/job/POI-DSL-OpenJDK/ws/build.xml>:1256: Problem: failed to create task or type antlib:org.jacoco.ant:coverage
Cause: The name is undefined.
Action: Check the spelling.
Action: Check that any custom tasks/types have been declared.
Action: Check that any <presetdef>/<macrodef> declarations have taken place.
No types or tasks have been defined in this namespace yet

This appears to be an antlib declaration.
Action: Check that the implementing library exists in one of:
        -/home/jenkins/tools/ant/apache-ant-1.9.9/lib
        -/home/jenkins/.ant/lib
        -a directory added on the command line with the -lib argument


Total time: 3 minutes 2 seconds
Build step 'Invoke Ant' marked build as failure
Skipping publisher since build result is FAILURE
Archiving artifacts
[Fast Archiver] Compressed 66.30 MB of artifacts by 65.4% relative to #313
Skipping publisher since build result is FAILURE
Recording test results
ERROR: Step ?Publish JUnit test result report? failed: No test report files were found. Configuration error?


---------------------------------------------------------------------
To unsubscribe, e-mail: [hidden email]
For additional commands, e-mail: [hidden email]

Reply | Threaded
Open this post in threaded view
|

Build failed in Jenkins: POI-DSL-OpenJDK #317

Apache Jenkins Server
See <https://builds.apache.org/job/POI-DSL-OpenJDK/317/display/redirect?page=changes>

Changes:

[gwoolsey] Fixes Bug 61764 Conditional formatting rules don't evaluate properly for some multi-range rule definitions

Fixes Bug 61761 Conditional formatting rule evaluation doesn't like comparing cells of different types

fixed, with unit tests.

------------------------------------------
[...truncated 3.94 KB...]
-rwxr-xr-x 1 root root 6504 Oct 27 22:51 jar
-rwxr-xr-x 1 root root 6504 Oct 27 22:51 jarsigner
lrwxrwxrwx 1 root root   15 Oct 27 22:51 java -> ../jre/bin/java
-rwxr-xr-x 1 root root 6504 Oct 27 22:51 javac
-rwxr-xr-x 1 root root 6504 Oct 27 22:51 javadoc
-rwxr-xr-x 1 root root 6504 Oct 27 22:51 javah
-rwxr-xr-x 1 root root 6504 Oct 27 22:51 javap
-rwxr-xr-x 1 root root 2806 Oct 27 22:04 java-rmi.cgi
-rwxr-xr-x 1 root root 6504 Oct 27 22:51 jcmd
-rwxr-xr-x 1 root root 6528 Oct 27 22:51 jconsole
-rwxr-xr-x 1 root root 6520 Oct 27 22:51 jdb
-rwxr-xr-x 1 root root 6504 Oct 27 22:51 jdeps
-rwxr-xr-x 1 root root 6504 Oct 27 22:51 jhat
-rwxr-xr-x 1 root root 6568 Oct 27 22:51 jinfo
lrwxrwxrwx 1 root root   14 Oct 27 22:51 jjs -> ../jre/bin/jjs
-rwxr-xr-x 1 root root 6568 Oct 27 22:51 jmap
-rwxr-xr-x 1 root root 6504 Oct 27 22:51 jps
-rwxr-xr-x 1 root root 6504 Oct 27 22:51 jrunscript
-rwxr-xr-x 1 root root 6520 Oct 27 22:51 jsadebugd
-rwxr-xr-x 1 root root 6568 Oct 27 22:51 jstack
-rwxr-xr-x 1 root root 6504 Oct 27 22:51 jstat
-rwxr-xr-x 1 root root 6504 Oct 27 22:51 jstatd
lrwxrwxrwx 1 root root   18 Oct 27 22:51 keytool -> ../jre/bin/keytool
-rwxr-xr-x 1 root root 6504 Oct 27 22:51 native2ascii
lrwxrwxrwx 1 root root   15 Oct 27 22:51 orbd -> ../jre/bin/orbd
lrwxrwxrwx 1 root root   18 Oct 27 22:51 pack200 -> ../jre/bin/pack200
lrwxrwxrwx 1 root root   21 Oct 27 22:51 policytool -> ../jre/bin/policytool
-rwxr-xr-x 1 root root 6504 Oct 27 22:51 rmic
lrwxrwxrwx 1 root root   15 Oct 27 22:51 rmid -> ../jre/bin/rmid
lrwxrwxrwx 1 root root   22 Oct 27 22:51 rmiregistry -> ../jre/bin/rmiregistry
-rwxr-xr-x 1 root root 6504 Oct 27 22:51 schemagen
-rwxr-xr-x 1 root root 6504 Oct 27 22:51 serialver
lrwxrwxrwx 1 root root   21 Oct 27 22:51 servertool -> ../jre/bin/servertool
lrwxrwxrwx 1 root root   20 Oct 27 22:51 tnameserv -> ../jre/bin/tnameserv
lrwxrwxrwx 1 root root   20 Oct 27 22:51 unpack200 -> ../jre/bin/unpack200
-rwxr-xr-x 1 root root 6504 Oct 27 22:51 wsgen
-rwxr-xr-x 1 root root 6504 Oct 27 22:51 wsimport
-rwxr-xr-x 1 root root 6504 Oct 27 22:51 xjc
+ /usr/lib/jvm/java-8-openjdk-amd64//bin/java -version
openjdk version "1.8.0_151"
OpenJDK Runtime Environment (build 1.8.0_151-8u151-b12-0ubuntu0.16.04.2-b12)
OpenJDK 64-Bit Server VM (build 25.151-b12, mixed mode)
+ echo which java
which java
+ which java
/usr/lib/jvm/java-8-openjdk-amd64//bin/java
+ java -version
openjdk version "1.8.0_151"
OpenJDK Runtime Environment (build 1.8.0_151-8u151-b12-0ubuntu0.16.04.2-b12)
OpenJDK 64-Bit Server VM (build 25.151-b12, mixed mode)
+ echo which javac
which javac
+ which javac
/usr/lib/jvm/java-8-openjdk-amd64//bin/javac
+ javac -version
javac 1.8.0_151
+ echo '<project default="test"><target name="test"><echo>Java ${ant.java.version}/${java.version}</echo><exec executable="javac"><arg value="-version"/></exec></target></project>'
+ ant -f build.javacheck.xml -v
Apache Ant(TM) version 1.9.6 compiled on July 8 2015
Buildfile: <https://builds.apache.org/job/POI-DSL-OpenJDK/ws/build.javacheck.xml>
Detected Java version: 1.8 in: /usr/lib/jvm/java-8-openjdk-amd64/jre
Detected OS: Linux
parsing buildfile <https://builds.apache.org/job/POI-DSL-OpenJDK/ws/build.javacheck.xml> with URI = <https://builds.apache.org/job/POI-DSL-OpenJDK/ws/build.javacheck.xml>
Project base dir set to: <https://builds.apache.org/job/POI-DSL-OpenJDK/ws/>
Build sequence for target(s) `test' is [test]
Complete build sequence is [test, ]

test:
parsing buildfile jar:file:/usr/share/ant/lib/ant.jar!/org/apache/tools/ant/antlib.xml with URI = jar:file:/usr/share/ant/lib/ant.jar!/org/apache/tools/ant/antlib.xml from a zip file
     [echo] Java 1.8/1.8.0_151
     [exec] Current OS is Linux
     [exec] Executing 'javac' with arguments:
     [exec] '-version'
     [exec]
     [exec] The ' characters around the executable and arguments are
     [exec] not part of the command.
     [exec] javac 1.8.0_151

BUILD SUCCESSFUL
Total time: 0 seconds
+ exit 0
[POI-DSL-OpenJDK] $ /home/jenkins/tools/ant/apache-ant-1.9.9/bin/ant -Dcoverage.enabled=true clean jenkins
Buildfile: <https://builds.apache.org/job/POI-DSL-OpenJDK/ws/build.xml>

clean:
   [delete] Deleting directory <https://builds.apache.org/job/POI-DSL-OpenJDK/ws/build>

check-jars:

fetch-jars:

check-ooxml-jars:

fetch-ooxml-jars:

init:
    [mkdir] Created dir: <https://builds.apache.org/job/POI-DSL-OpenJDK/ws/build>
    [mkdir] Created dir: <https://builds.apache.org/job/POI-DSL-OpenJDK/ws/build/classes>
    [mkdir] Created dir: <https://builds.apache.org/job/POI-DSL-OpenJDK/ws/build/test-classes>
    [mkdir] Created dir: <https://builds.apache.org/job/POI-DSL-OpenJDK/ws/build/test-results>
    [mkdir] Created dir: <https://builds.apache.org/job/POI-DSL-OpenJDK/ws/build/scratchpad-classes>
    [mkdir] Created dir: <https://builds.apache.org/job/POI-DSL-OpenJDK/ws/build/scratchpad-test-classes>
    [mkdir] Created dir: <https://builds.apache.org/job/POI-DSL-OpenJDK/ws/build/scratchpad-test-results>
    [mkdir] Created dir: <https://builds.apache.org/job/POI-DSL-OpenJDK/ws/build/geometry-java>
    [mkdir] Created dir: <https://builds.apache.org/job/POI-DSL-OpenJDK/ws/build/ooxml-classes>
    [mkdir] Created dir: <https://builds.apache.org/job/POI-DSL-OpenJDK/ws/build/ooxml-test-classes>
    [mkdir] Created dir: <https://builds.apache.org/job/POI-DSL-OpenJDK/ws/build/ooxml-test-results>
    [mkdir] Created dir: <https://builds.apache.org/job/POI-DSL-OpenJDK/ws/build/excelant-classes>
    [mkdir] Created dir: <https://builds.apache.org/job/POI-DSL-OpenJDK/ws/build/excelant-test-classes>
    [mkdir] Created dir: <https://builds.apache.org/job/POI-DSL-OpenJDK/ws/build/excelant-test-results>
    [mkdir] Created dir: <https://builds.apache.org/job/POI-DSL-OpenJDK/ws/build/examples-classes>
    [mkdir] Created dir: <https://builds.apache.org/job/POI-DSL-OpenJDK/ws/build/integration-test-classes>
    [mkdir] Created dir: <https://builds.apache.org/job/POI-DSL-OpenJDK/317/artifact/build/integration-test-results>
    [mkdir] Created dir: <https://builds.apache.org/job/POI-DSL-OpenJDK/ws/build/dist>
    [mkdir] Created dir: <https://builds.apache.org/job/POI-DSL-OpenJDK/ws/build/tmp/site/build/site>
     [echo] Using Ant: Apache Ant(TM) version 1.9.9 compiled on February 2 2017 from /home/jenkins/tools/ant/apache-ant-1.9.9, Ant detected Java 1.8 (may be different than actual Java sometimes...)
     [echo] Using Java: 1.8.0_151/1.8.0_151-8u151-b12-0ubuntu0.16.04.2-b12/25.151-b12/OpenJDK 64-Bit Server VM from Oracle Corporation on Linux: 4.4.0-43-generic

compile-main:
    [javac] Compiling 1204 source files to <https://builds.apache.org/job/POI-DSL-OpenJDK/ws/build/classes>
    [javac] Note: Some input files use or override a deprecated API.
    [javac] Note: Recompile with -Xlint:deprecation for details.
    [javac] Note: Some input files use unchecked or unsafe operations.
    [javac] Note: Recompile with -Xlint:unchecked for details.
    [javac] Compiling 538 source files to <https://builds.apache.org/job/POI-DSL-OpenJDK/ws/build/test-classes>
    [javac] Note: Some input files use or override a deprecated API.
    [javac] Note: Recompile with -Xlint:deprecation for details.
    [javac] Note: <https://builds.apache.org/job/POI-DSL-OpenJDK/ws/src/testcases/org/apache/poi/ss/util/TestCellRangeUtil.java> uses unchecked or unsafe operations.
    [javac] Note: Recompile with -Xlint:unchecked for details.
     [copy] Copying 4 files to <https://builds.apache.org/job/POI-DSL-OpenJDK/ws/build/classes>

check-ooxml-xsds:

fetch-ooxml-xsds:

generate-geometry:

compile-scratchpad:
    [javac] Compiling 488 source files to <https://builds.apache.org/job/POI-DSL-OpenJDK/ws/build/scratchpad-classes>
    [javac] Note: Some input files use or override a deprecated API.
    [javac] Note: Recompile with -Xlint:deprecation for details.
    [javac] Compiling 190 source files to <https://builds.apache.org/job/POI-DSL-OpenJDK/ws/build/scratchpad-test-classes>
    [javac] Note: Some input files use or override a deprecated API.
    [javac] Note: Recompile with -Xlint:deprecation for details.
     [copy] Copying 2 files to <https://builds.apache.org/job/POI-DSL-OpenJDK/ws/build/scratchpad-classes>

check-compiled-ooxml-xsds:

compile-ooxml-xsds:

compile-ooxml:
    [javac] Compiling 437 source files to <https://builds.apache.org/job/POI-DSL-OpenJDK/ws/build/ooxml-classes>
    [javac] Note: Some input files use or override a deprecated API.
    [javac] Note: Recompile with -Xlint:deprecation for details.
    [javac] Compiling 243 source files to <https://builds.apache.org/job/POI-DSL-OpenJDK/ws/build/ooxml-test-classes>
    [javac] Note: Some input files use or override a deprecated API.
    [javac] Note: Recompile with -Xlint:deprecation for details.
     [copy] Copying 3 files to <https://builds.apache.org/job/POI-DSL-OpenJDK/ws/build/ooxml-classes>

compile-examples:
    [javac] Compiling 149 source files to <https://builds.apache.org/job/POI-DSL-OpenJDK/ws/build/examples-classes>
     [copy] Copying 1 file to <https://builds.apache.org/job/POI-DSL-OpenJDK/ws/build/examples-classes>

compile-excelant:
    [javac] Compiling 14 source files to <https://builds.apache.org/job/POI-DSL-OpenJDK/ws/build/excelant-classes>
    [javac] Compiling 13 source files to <https://builds.apache.org/job/POI-DSL-OpenJDK/ws/build/excelant-test-classes>
     [copy] Copying 1 file to <https://builds.apache.org/job/POI-DSL-OpenJDK/ws/build/excelant-classes>

compile:

-compile-ooxml-lite-check:

compile-ooxml-lite:
     [echo] Running ooxml-lite generator
    [mkdir] Created dir: <https://builds.apache.org/job/POI-DSL-OpenJDK/ws/build/ooxml-lite-merged>
      [jar] Building jar: <https://builds.apache.org/job/POI-DSL-OpenJDK/ws/build/ooxml-lite-merged/ooxml-lite-merged.jar>
     [java] Collecting unit tests from <https://builds.apache.org/job/POI-DSL-OpenJDK/ws/build/ooxml-test-classes>
     [java] Inner class org.apache.poi.TestPOIXMLDocument$1.class not included
     [java] Inner class org.apache.poi.TestPOIXMLDocument$UncaughtHandler.class not included
     [java] Inner class org.apache.poi.dev.TestOOXMLPrettyPrint$1.class not included
     [java] Inner class org.apache.poi.dev.TestOOXMLLister$1.class not included
     [java] Class org.apache.poi.benchmark.generated.AddImageBench_jmhType does not derive from TestCase and does not have a @Test annotation
     [java] Inner class org.apache.poi.xssf.usermodel.TestMatrixFormulasFromXMLSpreadsheet$1.class not included
     [java] Inner class org.apache.poi.xssf.usermodel.TestMatrixFormulasFromXMLSpreadsheet$Navigator.class not included
     [java] Found 220 classes
     [java] SLF4J: Failed to load class "org.slf4j.impl.StaticLoggerBinder".
     [java] SLF4J: Defaulting to no-operation (NOP) logger implementation
     [java] SLF4J: See http://www.slf4j.org/codes.html#StaticLoggerBinder for further details.
     [java] Exception in thread "main" java.lang.RuntimeException: Tests did not succeed, cannot build ooxml-lite jar
     [java] at org.apache.poi.util.OOXMLLite.build(OOXMLLite.java:151)
     [java] at org.apache.poi.util.OOXMLLite.main(OOXMLLite.java:94)
     [java] ...................................................................I...............................................................I........................................................................................................................................................................................I...............................................................................................III.............................................................................................................................I..............................................................I..........................................I.......................................................................................................................................................................................................I..I..I.I.......................................................................................................................................................................................................................................................................................III.I.I.......I.......I.....I................................................................................................................................................................................................................................I............................................................................I......II........I.I........................I.........I.....I................................................................................................................I..E...I........................................................I.........................................................................................................................................................................................................................................................................................................................................................................................................................................................................................................................................................................I.............................................................................I........................
     [java] Time: 113.363
     [java] There was 1 failure:
     [java] 1) testBug61495(org.apache.poi.xssf.usermodel.TestXSSFFormulaEvaluation)
     [java] java.lang.AssertionError: expected:<D 0,068> but was:<org.apache.poi.ss.usermodel.CellValue ["D 00,68"]>
     [java] at org.junit.Assert.fail(Assert.java:88)
     [java] at org.junit.Assert.failNotEquals(Assert.java:834)
     [java] at org.junit.Assert.assertEquals(Assert.java:118)
     [java] at org.junit.Assert.assertEquals(Assert.java:144)
     [java] at org.apache.poi.xssf.usermodel.TestXSSFFormulaEvaluation.testBug61495(TestXSSFFormulaEvaluation.java:442)
     [java] at sun.reflect.NativeMethodAccessorImpl.invoke0(Native Method)
     [java] at sun.reflect.NativeMethodAccessorImpl.invoke(NativeMethodAccessorImpl.java:62)
     [java] at sun.reflect.DelegatingMethodAccessorImpl.invoke(DelegatingMethodAccessorImpl.java:43)
     [java] at java.lang.reflect.Method.invoke(Method.java:498)
     [java] at org.junit.runners.model.FrameworkMethod$1.runReflectiveCall(FrameworkMethod.java:50)
     [java] at org.junit.internal.runners.model.ReflectiveCallable.run(ReflectiveCallable.java:12)
     [java] at org.junit.runners.model.FrameworkMethod.invokeExplosively(FrameworkMethod.java:47)
     [java] at org.junit.internal.runners.statements.InvokeMethod.evaluate(InvokeMethod.java:17)
     [java] at org.junit.runners.ParentRunner.runLeaf(ParentRunner.java:325)
     [java] at org.junit.runners.BlockJUnit4ClassRunner.runChild(BlockJUnit4ClassRunner.java:78)
     [java] at org.junit.runners.BlockJUnit4ClassRunner.runChild(BlockJUnit4ClassRunner.java:57)
     [java] at org.junit.runners.ParentRunner$3.run(ParentRunner.java:290)
     [java] at org.junit.runners.ParentRunner$1.schedule(ParentRunner.java:71)
     [java] at org.junit.runners.ParentRunner.runChildren(ParentRunner.java:288)
     [java] at org.junit.runners.ParentRunner.access$000(ParentRunner.java:58)
     [java] at org.junit.runners.ParentRunner$2.evaluate(ParentRunner.java:268)
     [java] at org.junit.runners.ParentRunner.run(ParentRunner.java:363)
     [java] at org.junit.runners.Suite.runChild(Suite.java:128)
     [java] at org.junit.runners.Suite.runChild(Suite.java:27)
     [java] at org.junit.runners.ParentRunner$3.run(ParentRunner.java:290)
     [java] at org.junit.runners.ParentRunner$1.schedule(ParentRunner.java:71)
     [java] at org.junit.runners.ParentRunner.runChildren(ParentRunner.java:288)
     [java] at org.junit.runners.ParentRunner.access$000(ParentRunner.java:58)
     [java] at org.junit.runners.ParentRunner$2.evaluate(ParentRunner.java:268)
     [java] at org.junit.runners.ParentRunner.run(ParentRunner.java:363)
     [java] at org.junit.runner.JUnitCore.run(JUnitCore.java:137)
     [java] at org.junit.runner.JUnitCore.run(JUnitCore.java:115)
     [java] at org.junit.runner.JUnitCore.run(JUnitCore.java:105)
     [java] at org.junit.runner.JUnitCore.run(JUnitCore.java:94)
     [java] at org.apache.poi.util.OOXMLLite.build(OOXMLLite.java:149)
     [java] at org.apache.poi.util.OOXMLLite.main(OOXMLLite.java:94)
     [java]
     [java] FAILURES!!!
     [java] Tests run: 2322,  Failures: 1
     [java]

BUILD FAILED
<https://builds.apache.org/job/POI-DSL-OpenJDK/ws/build.xml>:1517: Java returned: 1

Total time: 2 minutes 50 seconds
Build step 'Invoke Ant' marked build as failure
Skipping publisher since build result is FAILURE
Archiving artifacts
[Fast Archiver] Compressed 66.30 MB of artifacts by 65.4% relative to #313
Skipping publisher since build result is FAILURE
Recording test results
ERROR: Step ?Publish JUnit test result report? failed: No test report files were found. Configuration error?


---------------------------------------------------------------------
To unsubscribe, e-mail: [hidden email]
For additional commands, e-mail: [hidden email]

Reply | Threaded
Open this post in threaded view
|

Jenkins build is back to normal : POI-DSL-OpenJDK #318

Apache Jenkins Server
See <https://builds.apache.org/job/POI-DSL-OpenJDK/318/display/redirect?page=changes>


---------------------------------------------------------------------
To unsubscribe, e-mail: [hidden email]
For additional commands, e-mail: [hidden email]