Build failed in Jenkins: POI-DSL-Maven #932

classic Classic list List threaded Threaded
10 messages Options
Reply | Threaded
Open this post in threaded view
|

Build failed in Jenkins: POI-DSL-Maven #932

Apache Jenkins Server
See <https://builds.apache.org/job/POI-DSL-Maven/932/display/redirect?page=changes>

Changes:

[fanningpj] [bug-63842] mark as likely for 4.1.2 -- probably too late for 4.1.1


------------------------------------------
[...truncated 5.25 KB...]
U         src/testcases/org/apache/poi/ddf/TestEscherDggRecord.java
U         src/testcases/org/apache/poi/ddf/TestEscherSpRecord.java
U         src/testcases/org/apache/poi/ddf/TestEscherSpgrRecord.java
U         src/testcases/org/apache/poi/ddf/TestEscherSplitMenuColorsRecord.java
U         src/testcases/org/apache/poi/ddf/TestUnknownEscherRecord.java
U         src/testcases/org/apache/poi/ddf/TestEscherBlipRecord.java
U         src/testcases/org/apache/poi/ddf/TestEscherDump.java
U         src/testcases/org/apache/poi/ddf/TestEscherProperty.java
U         src/testcases/org/apache/poi/hssf/model/TestDrawingShapes.java
U         src/testcases/org/apache/poi/hssf/usermodel/TestPolygon.java
U         src/testcases/org/apache/poi/hssf/usermodel/TestCellStyle.java
U         src/testcases/org/apache/poi/hssf/usermodel/TestFormulas.java
U         src/testcases/org/apache/poi/hssf/usermodel/TestHSSFDateUtil.java
U         src/testcases/org/apache/poi/hssf/usermodel/TestReadWriteChart.java
U         src/testcases/org/apache/poi/hpsf/extractor/TestHPSFPropertiesExtractor.java
U         src/scratchpad/src/org/apache/poi/hemf/record/emf/HemfComment.java
U         src/scratchpad/src/org/apache/poi/hemf/usermodel/HemfEmbeddedIterator.java
U         src/scratchpad/src/org/apache/poi/hslf/usermodel/HSLFAutoShape.java
U         src/scratchpad/src/org/apache/poi/hslf/usermodel/HSLFFill.java
U         src/scratchpad/src/org/apache/poi/hslf/usermodel/HSLFShape.java
U         src/scratchpad/src/org/apache/poi/hslf/usermodel/HSLFSlideMaster.java
U         src/scratchpad/src/org/apache/poi/hslf/usermodel/HSLFFreeformShape.java
U         src/scratchpad/src/org/apache/poi/hslf/usermodel/HSLFLine.java
U         src/scratchpad/src/org/apache/poi/hslf/usermodel/HSLFObjectShape.java
U         src/scratchpad/src/org/apache/poi/hslf/usermodel/HSLFPictureShape.java
U         src/scratchpad/src/org/apache/poi/hslf/usermodel/HSLFShapeFactory.java
U         src/scratchpad/src/org/apache/poi/hslf/usermodel/HSLFShapePlaceholderDetails.java
U         src/scratchpad/src/org/apache/poi/hslf/usermodel/HSLFSimpleShape.java
U         src/scratchpad/src/org/apache/poi/hslf/usermodel/HSLFTable.java
U         src/scratchpad/src/org/apache/poi/hslf/usermodel/HSLFTableCell.java
U         src/scratchpad/src/org/apache/poi/hslf/usermodel/HSLFTextBox.java
U         src/scratchpad/src/org/apache/poi/hslf/usermodel/HSLFTextShape.java
U         src/scratchpad/src/org/apache/poi/hslf/record/FontCollection.java
U         src/scratchpad/src/org/apache/poi/hslf/record/EscherPlaceholder.java
U         src/scratchpad/src/org/apache/poi/hslf/record/PPDrawing.java
U         src/scratchpad/src/org/apache/poi/hslf/model/ActiveXShape.java
U         src/scratchpad/src/org/apache/poi/hslf/model/HSLFMetroShape.java
U         src/scratchpad/src/org/apache/poi/hslf/model/MovieShape.java
U         src/scratchpad/src/org/apache/poi/hslf/model/Polygon.java
U         src/scratchpad/src/org/apache/poi/hwmf/record/HwmfEscape.java
U         src/scratchpad/src/org/apache/poi/hwmf/record/HwmfColorRef.java
U         src/scratchpad/src/org/apache/poi/hwpf/usermodel/OfficeDrawingsImpl.java
U         src/scratchpad/src/org/apache/poi/hwpf/usermodel/Picture.java
U         src/scratchpad/testcases/org/apache/poi/hslf/model/TestShapes.java
U         src/scratchpad/testcases/org/apache/poi/hslf/usermodel/TestBackground.java
U         src/scratchpad/testcases/org/apache/poi/hslf/usermodel/TestBugs.java
U         src/ooxml/java/org/apache/poi/xslf/util/PPTX2PNG.java
U         src/ooxml/java/org/apache/poi/xslf/usermodel/XSLFShape.java
U         src/ooxml/java/org/apache/poi/xssf/streaming/SXSSFCell.java
U         src/ooxml/java/org/apache/poi/xssf/usermodel/XSSFCell.java
U         src/ooxml/java/org/apache/poi/ooxml/POIXMLProperties.java
U         src/ooxml/testcases/org/apache/poi/sl/TestFonts.java
U         src/ooxml/testcases/org/apache/poi/xslf/usermodel/TestXSLFShape.java
U         src/ooxml/testcases/org/apache/poi/ooxml/TestPOIXMLProperties.java
U         src/examples/src/org/apache/poi/xssf/usermodel/examples/WorkbookProperties.java
U         build.xml
U         sonar/examples/pom.xml
U         sonar/excelant/pom.xml
U         sonar/main/pom.xml
U         sonar/ooxml/pom.xml
U         sonar/ooxml-schema/pom.xml
U         sonar/ooxml-schema-encryption/pom.xml
U         sonar/ooxml-schema-security/pom.xml
U         sonar/pom.xml
U         sonar/scratchpad/pom.xml
AU        test-data/slideshow/ececapstonespring2012.pptx

<-- Got one external: forrest.properties, svn url: https://svn.apache.org/repos/asf/poi/site/forrest.properties -->
Fetching 'https://svn.apache.org/repos/asf/poi/site/forrest.properties' at -1 into '<https://builds.apache.org/job/POI-DSL-Maven/ws/forrest.properties'>
At revision 1868450


<-- Got one external: documentation, svn url: https://svn.apache.org/repos/asf/poi/site/src/documentation -->
Fetching 'https://svn.apache.org/repos/asf/poi/site/src/documentation' at -1 into '<https://builds.apache.org/job/POI-DSL-Maven/ws/src/documentation'>
U         src/documentation/content/xdocs/changes.xml
At revision 1868450

At revision 1868450

No changes for https://svn.apache.org/repos/asf/poi/trunk since the previous build
No changes for https://svn.apache.org/repos/asf/poi/site/forrest.properties since the previous build
[POI-DSL-Maven] $ /bin/bash -xe /tmp/jenkins1799167648737198712.sh
+ svn status
?       build.javacheck.xml
    X   forrest.properties
X       src/documentation

Performing status on external item at 'src/documentation':
+ echo Java-Home: /home/jenkins/tools/java/latest1.8
Java-Home: /home/jenkins/tools/java/latest1.8
+ ls -al /home/jenkins/tools/java/latest1.8/
total 26000
drwxr-xr-x  7 root root     4096 Aug 26 09:31 .
drwxr-xr-x 27 root root     4096 Oct 13 18:26 ..
drwxr-xr-x  2 root root     4096 Aug 26 09:31 bin
-r--r--r--  1 root root     3244 Oct  6  2018 COPYRIGHT
drwxr-xr-x  3 root root     4096 Aug 26 09:31 include
-rw-r--r--  1 root root  5207154 Sep 12  2018 javafx-src.zip
drwxr-xr-x  5 root root     4096 Aug 26 09:31 jre
drwxr-xr-x  5 root root     4096 Aug 26 09:31 lib
-r--r--r--  1 root root       40 Oct  6  2018 LICENSE
drwxr-xr-x  4 root root     4096 Aug 26 09:31 man
-r--r--r--  1 root root      159 Oct  6  2018 README.html
-rw-r--r--  1 root root      424 Oct  6  2018 release
-rw-r--r--  1 root root 21101479 Oct  6  2018 src.zip
-rw-r--r--  1 root root   108062 Sep 12  2018 THIRDPARTYLICENSEREADME-JAVAFX.txt
-r--r--r--  1 root root   155003 Oct  6  2018 THIRDPARTYLICENSEREADME.txt
+ ls -al /home/jenkins/tools/java/latest1.8/bin
total 904
drwxr-xr-x 2 root root   4096 Aug 26 09:31 .
drwxr-xr-x 7 root root   4096 Aug 26 09:31 ..
-rwxr-xr-x 1 root root   8592 Oct  6  2018 appletviewer
lrwxrwxrwx 1 root root      8 Oct  6  2018 ControlPanel -> jcontrol
-rwxr-xr-x 1 root root   8584 Oct  6  2018 extcheck
-rwxr-xr-x 1 root root   8584 Oct  6  2018 idlj
-rwxr-xr-x 1 root root   8584 Oct  6  2018 jar
-rwxr-xr-x 1 root root   8584 Oct  6  2018 jarsigner
-rwxr-xr-x 1 root root   8464 Oct  6  2018 java
-rwxr-xr-x 1 root root   8584 Oct  6  2018 javac
-rwxr-xr-x 1 root root   8584 Oct  6  2018 javadoc
-rwxr-xr-x 1 root root   2293 Sep 12  2018 javafxpackager
-rwxr-xr-x 1 root root   8584 Oct  6  2018 javah
-rwxr-xr-x 1 root root   8584 Oct  6  2018 javap
-rwxr-xr-x 1 root root   2293 Sep 12  2018 javapackager
-rwxr-xr-x 1 root root   1809 Oct  6  2018 java-rmi.cgi
-rwxr-xr-x 1 root root 140248 Oct  6  2018 javaws
-rwxr-xr-x 1 root root   8584 Oct  6  2018 jcmd
-rwxr-xr-x 1 root root   8608 Oct  6  2018 jconsole
-rwxr-xr-x 1 root root   6264 Oct  6  2018 jcontrol
-rwxr-xr-x 1 root root   8600 Oct  6  2018 jdb
-rwxr-xr-x 1 root root   8584 Oct  6  2018 jdeps
-rwxr-xr-x 1 root root   8584 Oct  6  2018 jhat
-rwxr-xr-x 1 root root   8648 Oct  6  2018 jinfo
-rwxr-xr-x 1 root root   8584 Oct  6  2018 jjs
-rwxr-xr-x 1 root root   8648 Oct  6  2018 jmap
-rwxr-xr-x 1 root root  74675 Dec  8  2017 jmc
-rwxr-xr-x 1 root root    402 Dec  8  2017 jmc.ini
-rwxr-xr-x 1 root root   8584 Oct  6  2018 jps
-rwxr-xr-x 1 root root   8592 Oct  6  2018 jrunscript
-rwxr-xr-x 1 root root   8600 Oct  6  2018 jsadebugd
-rwxr-xr-x 1 root root   8648 Oct  6  2018 jstack
-rwxr-xr-x 1 root root   8584 Oct  6  2018 jstat
-rwxr-xr-x 1 root root   8584 Oct  6  2018 jstatd
-rwxr-xr-x 1 root root   5110 Jan 14  2017 jvisualvm
-rwxr-xr-x 1 root root   8584 Oct  6  2018 keytool
-rwxr-xr-x 1 root root   8592 Oct  6  2018 native2ascii
-rwxr-xr-x 1 root root   8656 Oct  6  2018 orbd
-rwxr-xr-x 1 root root   8584 Oct  6  2018 pack200
-rwxr-xr-x 1 root root   8592 Oct  6  2018 policytool
-rwxr-xr-x 1 root root   8584 Oct  6  2018 rmic
-rwxr-xr-x 1 root root   8584 Oct  6  2018 rmid
-rwxr-xr-x 1 root root   8592 Oct  6  2018 rmiregistry
-rwxr-xr-x 1 root root   8584 Oct  6  2018 schemagen
-rwxr-xr-x 1 root root   8584 Oct  6  2018 serialver
-rwxr-xr-x 1 root root   8592 Oct  6  2018 servertool
-rwxr-xr-x 1 root root   8656 Oct  6  2018 tnameserv
-rwxr-xr-x 1 root root 182536 Oct  6  2018 unpack200
-rwxr-xr-x 1 root root   8584 Oct  6  2018 wsgen
-rwxr-xr-x 1 root root   8584 Oct  6  2018 wsimport
-rwxr-xr-x 1 root root   8584 Oct  6  2018 xjc
+ /home/jenkins/tools/java/latest1.8/bin/java -version
java version "1.8.0_191"
Java(TM) SE Runtime Environment (build 1.8.0_191-b12)
Java HotSpot(TM) 64-Bit Server VM (build 25.191-b12, mixed mode)
+ echo which java
which java
+ which java
/home/jenkins/tools/java/latest1.8/bin/java
+ java -version
java version "1.8.0_191"
Java(TM) SE Runtime Environment (build 1.8.0_191-b12)
Java HotSpot(TM) 64-Bit Server VM (build 25.191-b12, mixed mode)
+ echo which javac
which javac
+ which javac
/home/jenkins/tools/java/latest1.8/bin/javac
+ javac -version
javac 1.8.0_191
+ echo Ant-Home:
Ant-Home:
+ ls -al
total 496
drwxr-xr-x  15 jenkins jenkins   4096 Sep 22 04:04 .
drwxr-xr-x 557 jenkins jenkins  45056 Oct 14 15:41 ..
-rw-r--r--   1 jenkins jenkins  11321 Sep 22 04:04 build.gradle
-rw-r--r--   1 jenkins jenkins    172 Sep 25 00:04 build.javacheck.xml
-rw-r--r--   1 jenkins jenkins 142300 Oct 14 16:03 build.xml
-rw-r--r--   1 jenkins jenkins   3279 Sep 22 04:04 .classpath
drwxr-xr-x   2 jenkins jenkins   4096 Sep 22 04:04 compile-lib
-rw-r--r--   1 jenkins jenkins   5814 Sep 22 04:04 doap_POI.rdf
-rw-r--r--   1 jenkins jenkins   2596 Sep 22 04:04 file-leak-detector.exclude
-rw-r--r--   1 jenkins jenkins   6229 Sep 22 04:04 forrest.properties
-rw-r--r--   1 jenkins jenkins     53 Sep 22 04:04 .gitattributes
-rw-r--r--   1 jenkins jenkins    493 Sep 22 04:04 .gitignore
drwxr-xr-x   3 jenkins jenkins   4096 Sep 22 04:04 gradle
-rwxr-xr-x   1 jenkins jenkins   5299 Sep 22 04:04 gradlew
-rw-r--r--   1 jenkins jenkins   2260 Sep 22 04:04 gradlew.bat
drwxr-xr-x   2 jenkins jenkins   4096 Sep 22 04:04 jenkins
-rw-r--r--   1 jenkins jenkins 166411 Sep 22 04:04 KEYS
drwxr-xr-x   2 jenkins jenkins   4096 Sep 22 04:04 legal
drwxr-xr-x   2 jenkins jenkins   4096 Sep 22 04:04 lib
drwxr-xr-x   2 jenkins jenkins   4096 Sep 22 04:04 maven
drwxr-xr-x   2 jenkins jenkins   4096 Sep 22 04:04 ooxml-lib
drwxr-xr-x   4 jenkins jenkins   4096 Sep 22 04:04 osgi
-rw-r--r--   1 jenkins jenkins   4813 Sep 22 04:04 patch.xml
-rw-r--r--   1 jenkins jenkins    426 Sep 22 04:04 .project
-rw-r--r--   1 jenkins jenkins   4280 Sep 22 04:04 README.rst
drwxr-xr-x   2 jenkins jenkins   4096 Sep 22 04:04 .settings
-rw-r--r--   1 jenkins jenkins    556 Sep 22 04:04 settings.gradle
drwxr-xr-x  10 jenkins jenkins   4096 Oct 14 16:03 sonar
drwxr-xr-x  15 jenkins jenkins   4096 Sep 22 04:04 src
drwxr-xr-x   4 jenkins jenkins   4096 Oct 14 16:04 .svn
drwxr-xr-x  14 jenkins jenkins   4096 Sep 22 04:04 test-data
-rw-r--r--   1 jenkins jenkins    136 Sep 22 04:04 .travis.yml
+ echo which ant
which ant
+ which ant
/usr/bin/ant
+ ant -version
Apache Ant(TM) version 1.10.5 compiled on March 28 2019
+ echo '<project default="test"><target name="test"><echo>Java ${ant.java.version}/${java.version}</echo><exec executable="javac"><arg value="-version"/></exec></target></project>'
+ ant -f build.javacheck.xml -v
Apache Ant(TM) version 1.10.5 compiled on March 28 2019
Buildfile: <https://builds.apache.org/job/POI-DSL-Maven/ws/build.javacheck.xml>
Detected Java version: 1.8 in: /usr/local/asfpackages/java/jdk1.8.0_191/jre
Detected OS: Linux
parsing buildfile <https://builds.apache.org/job/POI-DSL-Maven/ws/build.javacheck.xml> with URI = <https://builds.apache.org/job/POI-DSL-Maven/ws/build.javacheck.xml>
Project base dir set to: <https://builds.apache.org/job/POI-DSL-Maven/ws/>
Build sequence for target(s) `test' is [test]
Complete build sequence is [test, ]

test:
parsing buildfile jar:file:/usr/share/ant/lib/ant.jar!/org/apache/tools/ant/antlib.xml with URI = jar:file:/usr/share/ant/lib/ant.jar!/org/apache/tools/ant/antlib.xml from a zip file
     [echo] Java 1.8/1.8.0_191
     [exec] Current OS is Linux
     [exec] Executing 'javac' with arguments:
     [exec] '-version'
     [exec]
     [exec] The ' characters around the executable and arguments are
     [exec] not part of the command.
     [exec] javac 1.8.0_191

BUILD SUCCESSFUL
Total time: 0 seconds
+ exit 0
FATAL: Couldn?t find any executable in /home/jenkins/tools/maven/apache-maven-3.2.1
Build step 'Invoke top-level Maven targets' marked build as failure
Recording test results
ERROR: Step ?Publish JUnit test result report? failed: No test report files were found. Configuration error?

---------------------------------------------------------------------
To unsubscribe, e-mail: [hidden email]
For additional commands, e-mail: [hidden email]

Reply | Threaded
Open this post in threaded view
|

Build failed in Jenkins: POI-DSL-Maven #933

Apache Jenkins Server
See <https://builds.apache.org/job/POI-DSL-Maven/933/display/redirect?page=changes>

Changes:

[fanningpj] use spaces for indents

[kiwiwings] Fix one-off error at referencing adjust values for HSLF preset shapes


------------------------------------------
[...truncated 376.43 KB...]
AU        src/documentation/resources/images/logoRandyStanard03.png
AU        src/documentation/resources/images/logoRandyStanard04.png
AU        src/documentation/resources/images/logoRandyStanard05.png
AU        src/documentation/resources/images/POIFSWriteFilesystem.gif
AU        src/documentation/resources/images/logoRandyStanard06.png
AU        src/documentation/resources/images/logoRandyStanard07.png
AU        src/documentation/resources/images/built-with-forrest-button.png
AU        src/documentation/resources/images/logoRandyStanard08.png
AU        src/documentation/resources/images/timesheet.jpg
AU        src/documentation/resources/images/poi-logo.png
AU        src/documentation/resources/images/unknown.jpg
AU        src/documentation/resources/images/logoKarmokar1s.png
AU        src/documentation/resources/images/POIFSRootPropertyPreWrite.gif
AU        src/documentation/resources/images/logoWendyWise.png
AU        src/documentation/resources/images/POIFSPropertyTablePreWrite.gif
AU        src/documentation/resources/images/logoKarmokar5s.png
AU        src/documentation/resources/images/ss-features.png
AU        src/documentation/resources/images/businessplan.jpg
AU        src/documentation/resources/images/logoJanssen1.png
AU        src/documentation/resources/images/logoJanssen2.png
AU        src/documentation/resources/images/calendar.jpg
AU        src/documentation/resources/images/loancalc.jpg
AU        src/documentation/resources/images/usermodel.gif
AU        src/documentation/resources/images/logoLoicLefevre.png
AU        src/documentation/resources/images/simple-xls-with-function.jpg
AU        src/documentation/resources/images/logoRaPiGmbH1.png
AU        src/documentation/resources/images/PropertySet.jpg
AU        src/documentation/resources/images/logoRaPiGmbH2.png
AU        src/documentation/resources/images/vba-example.jpg
AU        src/documentation/resources/images/logoKarmokar2s.png
AU        src/documentation/resources/images/logoRaPiGmbH5.png
AU        src/documentation/resources/images/logoRaPiGmbH6.png
AU        src/documentation/resources/images/logoKarmokar6s.png
AU        src/documentation/resources/images/logoRaPiGmbH7.png
AU        src/documentation/resources/images/logoRaPiGmbH8.png
AU        src/documentation/resources/images/logoRaPiGmbH9.png
AU        src/documentation/resources/images/logoDanielFernandez.png
AU        src/documentation/resources/images/logoAndrewClements2.png
AU        src/documentation/resources/images/hslf_shapes.gif
AU        src/documentation/resources/images/logoWendyWise2.png
AU        src/documentation/resources/images/POIFSLifeCycle.gif
AU        src/documentation/resources/images/logoAdria1.png
AU        src/documentation/resources/images/logoAdria2.png
AU        src/documentation/resources/images/logoAdria3.png
AU        src/documentation/resources/images/remove.jpg
AU        src/documentation/resources/images/logoKarmokar3s.png
AU        src/documentation/resources/images/logoGlenStampoutlzis.png
AU        src/documentation/resources/images/logoKarmokar1.png
AU        src/documentation/resources/images/POIFSInitialization.gif
AU        src/documentation/resources/images/logoKarmokar2.png
AU        src/documentation/resources/images/logoRaPiGmbH10.png
AU        src/documentation/resources/images/logoKarmokar3.png
AU        src/documentation/resources/images/logoRaPiGmbH11.png
AU        src/documentation/resources/images/logoMichaelMosmann.png
AU        src/documentation/resources/images/logoKarmokar4.png
AU        src/documentation/resources/images/logoRaPiGmbH12.png
AU        src/documentation/resources/images/logoKarmokar5.png
AU        src/documentation/resources/images/logoKarmokar6.png
AU        src/documentation/resources/images/ApacheConEu08.jpg
AU        src/documentation/resources/images/BlockClassDiagram.gif
AU        src/documentation/resources/images/calculatePayment.jpg
AU        src/documentation/resources/images/PropertyTableClassDiagram.gif
AU        src/documentation/resources/images/logoRussellBeattie1.png
AU        src/documentation/resources/images/logoRussellBeattie2.png
AU        src/documentation/resources/images/logoRussellBeattie3.png
A         src/documentation/resources/schema
A         src/documentation/resources/schema/catalog.xcat
AU        src/documentation/resources/schema/changes-poi.dtd
AU        src/documentation/resources/schema/changes-poi.mod
A         src/documentation/sitemap.xmap
AU        src/documentation/skinconf.xml
AU        src/documentation/release-guide.txt
A         src/documentation/cli.xconf
AU        src/documentation/RELEASE-NOTES.txt
AU        src/documentation/README.txt
A         src/documentation/classes
A         src/documentation/classes/CatalogManager.properties
At revision 1868463

At revision 1868463

No changes for https://svn.apache.org/repos/asf/poi/site/forrest.properties since the previous build
No changes for https://svn.apache.org/repos/asf/poi/site/src/documentation since the previous build
[POI-DSL-Maven] $ /bin/bash -xe /tmp/jenkins6247269724675883057.sh
+ svn status
    X   forrest.properties
X       src/documentation

Performing status on external item at 'src/documentation':
+ echo Java-Home: /home/jenkins/tools/java/latest1.8
Java-Home: /home/jenkins/tools/java/latest1.8
+ ls -al /home/jenkins/tools/java/latest1.8/
total 26000
drwxr-xr-x  7 root root     4096 Aug 26 09:33 .
drwxr-xr-x 44 root root     4096 Oct  5 08:40 ..
drwxr-xr-x  2 root root     4096 Aug 26 09:33 bin
-r--r--r--  1 root root     3244 Oct  6  2018 COPYRIGHT
drwxr-xr-x  3 root root     4096 Aug 26 09:33 include
-rw-r--r--  1 root root  5207154 Sep 12  2018 javafx-src.zip
drwxr-xr-x  5 root root     4096 Aug 26 09:33 jre
drwxr-xr-x  5 root root     4096 Aug 26 09:33 lib
-r--r--r--  1 root root       40 Oct  6  2018 LICENSE
drwxr-xr-x  4 root root     4096 Aug 26 09:33 man
-r--r--r--  1 root root      159 Oct  6  2018 README.html
-rw-r--r--  1 root root      424 Oct  6  2018 release
-rw-r--r--  1 root root 21101479 Oct  6  2018 src.zip
-rw-r--r--  1 root root   108062 Sep 12  2018 THIRDPARTYLICENSEREADME-JAVAFX.txt
-r--r--r--  1 root root   155003 Oct  6  2018 THIRDPARTYLICENSEREADME.txt
+ ls -al /home/jenkins/tools/java/latest1.8/bin
total 904
drwxr-xr-x 2 root root   4096 Aug 26 09:33 .
drwxr-xr-x 7 root root   4096 Aug 26 09:33 ..
-rwxr-xr-x 1 root root   8592 Oct  6  2018 appletviewer
lrwxrwxrwx 1 root root      8 Oct  6  2018 ControlPanel -> jcontrol
-rwxr-xr-x 1 root root   8584 Oct  6  2018 extcheck
-rwxr-xr-x 1 root root   8584 Oct  6  2018 idlj
-rwxr-xr-x 1 root root   8584 Oct  6  2018 jar
-rwxr-xr-x 1 root root   8584 Oct  6  2018 jarsigner
-rwxr-xr-x 1 root root   8464 Oct  6  2018 java
-rwxr-xr-x 1 root root   8584 Oct  6  2018 javac
-rwxr-xr-x 1 root root   8584 Oct  6  2018 javadoc
-rwxr-xr-x 1 root root   2293 Sep 12  2018 javafxpackager
-rwxr-xr-x 1 root root   8584 Oct  6  2018 javah
-rwxr-xr-x 1 root root   8584 Oct  6  2018 javap
-rwxr-xr-x 1 root root   2293 Sep 12  2018 javapackager
-rwxr-xr-x 1 root root   1809 Oct  6  2018 java-rmi.cgi
-rwxr-xr-x 1 root root 140248 Oct  6  2018 javaws
-rwxr-xr-x 1 root root   8584 Oct  6  2018 jcmd
-rwxr-xr-x 1 root root   8608 Oct  6  2018 jconsole
-rwxr-xr-x 1 root root   6264 Oct  6  2018 jcontrol
-rwxr-xr-x 1 root root   8600 Oct  6  2018 jdb
-rwxr-xr-x 1 root root   8584 Oct  6  2018 jdeps
-rwxr-xr-x 1 root root   8584 Oct  6  2018 jhat
-rwxr-xr-x 1 root root   8648 Oct  6  2018 jinfo
-rwxr-xr-x 1 root root   8584 Oct  6  2018 jjs
-rwxr-xr-x 1 root root   8648 Oct  6  2018 jmap
-rwxr-xr-x 1 root root  74675 Dec  8  2017 jmc
-rwxr-xr-x 1 root root    402 Dec  8  2017 jmc.ini
-rwxr-xr-x 1 root root   8584 Oct  6  2018 jps
-rwxr-xr-x 1 root root   8592 Oct  6  2018 jrunscript
-rwxr-xr-x 1 root root   8600 Oct  6  2018 jsadebugd
-rwxr-xr-x 1 root root   8648 Oct  6  2018 jstack
-rwxr-xr-x 1 root root   8584 Oct  6  2018 jstat
-rwxr-xr-x 1 root root   8584 Oct  6  2018 jstatd
-rwxr-xr-x 1 root root   5110 Jan 14  2017 jvisualvm
-rwxr-xr-x 1 root root   8584 Oct  6  2018 keytool
-rwxr-xr-x 1 root root   8592 Oct  6  2018 native2ascii
-rwxr-xr-x 1 root root   8656 Oct  6  2018 orbd
-rwxr-xr-x 1 root root   8584 Oct  6  2018 pack200
-rwxr-xr-x 1 root root   8592 Oct  6  2018 policytool
-rwxr-xr-x 1 root root   8584 Oct  6  2018 rmic
-rwxr-xr-x 1 root root   8584 Oct  6  2018 rmid
-rwxr-xr-x 1 root root   8592 Oct  6  2018 rmiregistry
-rwxr-xr-x 1 root root   8584 Oct  6  2018 schemagen
-rwxr-xr-x 1 root root   8584 Oct  6  2018 serialver
-rwxr-xr-x 1 root root   8592 Oct  6  2018 servertool
-rwxr-xr-x 1 root root   8656 Oct  6  2018 tnameserv
-rwxr-xr-x 1 root root 182536 Oct  6  2018 unpack200
-rwxr-xr-x 1 root root   8584 Oct  6  2018 wsgen
-rwxr-xr-x 1 root root   8584 Oct  6  2018 wsimport
-rwxr-xr-x 1 root root   8584 Oct  6  2018 xjc
+ /home/jenkins/tools/java/latest1.8/bin/java -version
java version "1.8.0_191"
Java(TM) SE Runtime Environment (build 1.8.0_191-b12)
Java HotSpot(TM) 64-Bit Server VM (build 25.191-b12, mixed mode)
+ echo which java
which java
+ which java
/home/jenkins/tools/java/latest1.8/bin/java
+ java -version
java version "1.8.0_191"
Java(TM) SE Runtime Environment (build 1.8.0_191-b12)
Java HotSpot(TM) 64-Bit Server VM (build 25.191-b12, mixed mode)
+ echo which javac
which javac
+ which javac
/home/jenkins/tools/java/latest1.8/bin/javac
+ javac -version
javac 1.8.0_191
+ echo Ant-Home:
Ant-Home:
+ ls -al
total 484
drwxr-xr-x  15 jenkins jenkins   4096 Oct 15 00:16 .
drwxr-xr-x 390 jenkins jenkins  36864 Oct 15 00:12 ..
-rw-r--r--   1 jenkins jenkins  11321 Oct 15 00:16 build.gradle
-rw-r--r--   1 jenkins jenkins 142300 Oct 15 00:15 build.xml
-rw-r--r--   1 jenkins jenkins   3279 Oct 15 00:16 .classpath
drwxr-xr-x   2 jenkins jenkins   4096 Oct 15 00:16 compile-lib
-rw-r--r--   1 jenkins jenkins   5814 Oct 15 00:16 doap_POI.rdf
-rw-r--r--   1 jenkins jenkins   2596 Oct 15 00:16 file-leak-detector.exclude
-rw-r--r--   1 jenkins jenkins   6229 Oct 15 00:16 forrest.properties
-rw-r--r--   1 jenkins jenkins     53 Oct 15 00:16 .gitattributes
-rw-r--r--   1 jenkins jenkins    493 Oct 15 00:16 .gitignore
drwxr-xr-x   3 jenkins jenkins   4096 Oct 15 00:16 gradle
-rwxr-xr-x   1 jenkins jenkins   5299 Oct 15 00:16 gradlew
-rw-r--r--   1 jenkins jenkins   2260 Oct 15 00:16 gradlew.bat
drwxr-xr-x   2 jenkins jenkins   4096 Oct 15 00:16 jenkins
-rw-r--r--   1 jenkins jenkins 166411 Oct 15 00:16 KEYS
drwxr-xr-x   2 jenkins jenkins   4096 Oct 15 00:16 legal
drwxr-xr-x   2 jenkins jenkins   4096 Oct 15 00:16 lib
drwxr-xr-x   2 jenkins jenkins   4096 Oct 15 00:16 maven
drwxr-xr-x   2 jenkins jenkins   4096 Oct 15 00:16 ooxml-lib
drwxr-xr-x   4 jenkins jenkins   4096 Oct 15 00:16 osgi
-rw-r--r--   1 jenkins jenkins   4813 Oct 15 00:16 patch.xml
-rw-r--r--   1 jenkins jenkins    426 Oct 15 00:16 .project
-rw-r--r--   1 jenkins jenkins   4280 Oct 15 00:16 README.rst
drwxr-xr-x   2 jenkins jenkins   4096 Oct 15 00:16 .settings
-rw-r--r--   1 jenkins jenkins    556 Oct 15 00:16 settings.gradle
drwxr-xr-x  10 jenkins jenkins   4096 Oct 15 00:15 sonar
drwxr-xr-x  15 jenkins jenkins   4096 Oct 15 00:16 src
drwxr-xr-x   4 jenkins jenkins   4096 Oct 15 00:16 .svn
drwxr-xr-x  14 jenkins jenkins   4096 Oct 15 00:16 test-data
-rw-r--r--   1 jenkins jenkins    136 Oct 15 00:16 .travis.yml
+ echo which ant
which ant
+ which ant
/usr/bin/ant
+ ant -version
Apache Ant(TM) version 1.10.5 compiled on March 28 2019
+ echo '<project default="test"><target name="test"><echo>Java ${ant.java.version}/${java.version}</echo><exec executable="javac"><arg value="-version"/></exec></target></project>'
+ ant -f build.javacheck.xml -v
Apache Ant(TM) version 1.10.5 compiled on March 28 2019
Buildfile: <https://builds.apache.org/job/POI-DSL-Maven/ws/build.javacheck.xml>
Detected Java version: 1.8 in: /usr/local/asfpackages/java/jdk1.8.0_191/jre
Detected OS: Linux
parsing buildfile <https://builds.apache.org/job/POI-DSL-Maven/ws/build.javacheck.xml> with URI = <https://builds.apache.org/job/POI-DSL-Maven/ws/build.javacheck.xml>
Project base dir set to: <https://builds.apache.org/job/POI-DSL-Maven/ws/>
Build sequence for target(s) `test' is [test]
Complete build sequence is [test, ]

test:
parsing buildfile jar:file:/usr/share/ant/lib/ant.jar!/org/apache/tools/ant/antlib.xml with URI = jar:file:/usr/share/ant/lib/ant.jar!/org/apache/tools/ant/antlib.xml from a zip file
     [echo] Java 1.8/1.8.0_191
     [exec] Current OS is Linux
     [exec] Executing 'javac' with arguments:
     [exec] '-version'
     [exec]
     [exec] The ' characters around the executable and arguments are
     [exec] not part of the command.
     [exec] javac 1.8.0_191

BUILD SUCCESSFUL
Total time: 0 seconds
+ exit 0
FATAL: Couldn?t find any executable in /home/jenkins/tools/maven/apache-maven-3.2.1
Build step 'Invoke top-level Maven targets' marked build as failure
Recording test results
ERROR: Step ?Publish JUnit test result report? failed: No test report files were found. Configuration error?

---------------------------------------------------------------------
To unsubscribe, e-mail: [hidden email]
For additional commands, e-mail: [hidden email]

Reply | Threaded
Open this post in threaded view
|

Build failed in Jenkins: POI-DSL-Maven #934

Apache Jenkins Server
See <https://builds.apache.org/job/POI-DSL-Maven/934/display/redirect?page=changes>

Changes:

[kiwiwings] prepare for 4.1.2

[kiwiwings] release prepare for 4.1.1 - updating build.xml and changes.xml


------------------------------------------
[...truncated 378 B...]
[EnvInject] - Variables injected successfully.
[EnvInject] - Injecting contributions.
Building remotely on H43 (ubuntu xenial) in workspace <https://builds.apache.org/job/POI-DSL-Maven/ws/>
[WS-CLEANUP] Deleting project workspace...
[WS-CLEANUP] Done
Updating https://svn.apache.org/repos/asf/poi/trunk at revision '2019-10-16T00:04:08.956 +0000'
U         build.xml
U         src/testcases/org/apache/poi/hpsf/extractor/TestHPSFPropertiesExtractor.java
U         src/testcases/org/apache/poi/ss/usermodel/TestFractionFormat.java
U         src/scratchpad/src/org/apache/poi/hslf/usermodel/HSLFSimpleShape.java
U         src/scratchpad/src/org/apache/poi/hslf/usermodel/HSLFAutoShape.java
U         src/scratchpad/src/org/apache/poi/hemf/record/emf/HemfComment.java
U         src/scratchpad/src/org/apache/poi/hemf/usermodel/HemfEmbeddedIterator.java
U         src/scratchpad/src/org/apache/poi/hwmf/record/HwmfEscape.java
U         src/java/org/apache/poi/ss/usermodel/FractionFormat.java
U         sonar/examples/pom.xml
U         sonar/excelant/pom.xml
U         sonar/main/pom.xml
U         sonar/ooxml/pom.xml
U         sonar/ooxml-schema/pom.xml
U         sonar/ooxml-schema-encryption/pom.xml
U         sonar/ooxml-schema-security/pom.xml
U         sonar/pom.xml
U         sonar/scratchpad/pom.xml

<-- Got one external: forrest.properties, svn url: https://svn.apache.org/repos/asf/poi/site/forrest.properties -->
Fetching 'https://svn.apache.org/repos/asf/poi/site/forrest.properties' at -1 into '<https://builds.apache.org/job/POI-DSL-Maven/ws/forrest.properties'>
At revision 1868493


<-- Got one external: documentation, svn url: https://svn.apache.org/repos/asf/poi/site/src/documentation -->
Fetching 'https://svn.apache.org/repos/asf/poi/site/src/documentation' at -1 into '<https://builds.apache.org/job/POI-DSL-Maven/ws/src/documentation'>
U         src/documentation/content/xdocs/changes.xml
At revision 1868493

At revision 1868493

No changes for https://svn.apache.org/repos/asf/poi/site/forrest.properties since the previous build
[POI-DSL-Maven] $ /bin/bash -xe /tmp/jenkins708580148835273974.sh
+ svn status
?       .repository
?       build.javacheck.xml
    X   forrest.properties
X       src/documentation

Performing status on external item at 'src/documentation':
+ echo Java-Home: /home/jenkins/tools/java/latest1.8
Java-Home: /home/jenkins/tools/java/latest1.8
+ ls -al /home/jenkins/tools/java/latest1.8/
total 26000
drwxr-xr-x  7 root root     4096 Nov  5  2018 .
drwxr-xr-x 51 root root     4096 Sep 15 02:15 ..
drwxr-xr-x  2 root root     4096 Nov  5  2018 bin
-r--r--r--  1 root root     3244 Oct  6  2018 COPYRIGHT
drwxr-xr-x  3 root root     4096 Nov  5  2018 include
-rw-r--r--  1 root root  5207154 Sep 12  2018 javafx-src.zip
drwxr-xr-x  5 root root     4096 Nov  5  2018 jre
drwxr-xr-x  5 root root     4096 Nov  5  2018 lib
-r--r--r--  1 root root       40 Oct  6  2018 LICENSE
drwxr-xr-x  4 root root     4096 Nov  5  2018 man
-r--r--r--  1 root root      159 Oct  6  2018 README.html
-rw-r--r--  1 root root      424 Oct  6  2018 release
-rw-r--r--  1 root root 21101479 Oct  6  2018 src.zip
-rw-r--r--  1 root root   108062 Sep 12  2018 THIRDPARTYLICENSEREADME-JAVAFX.txt
-r--r--r--  1 root root   155003 Oct  6  2018 THIRDPARTYLICENSEREADME.txt
+ ls -al /home/jenkins/tools/java/latest1.8/bin
total 904
drwxr-xr-x 2 root root   4096 Nov  5  2018 .
drwxr-xr-x 7 root root   4096 Nov  5  2018 ..
-rwxr-xr-x 1 root root   8592 Oct  6  2018 appletviewer
lrwxrwxrwx 1 root root      8 Oct  6  2018 ControlPanel -> jcontrol
-rwxr-xr-x 1 root root   8584 Oct  6  2018 extcheck
-rwxr-xr-x 1 root root   8584 Oct  6  2018 idlj
-rwxr-xr-x 1 root root   8584 Oct  6  2018 jar
-rwxr-xr-x 1 root root   8584 Oct  6  2018 jarsigner
-rwxr-xr-x 1 root root   8464 Oct  6  2018 java
-rwxr-xr-x 1 root root   8584 Oct  6  2018 javac
-rwxr-xr-x 1 root root   8584 Oct  6  2018 javadoc
-rwxr-xr-x 1 root root   2293 Sep 12  2018 javafxpackager
-rwxr-xr-x 1 root root   8584 Oct  6  2018 javah
-rwxr-xr-x 1 root root   8584 Oct  6  2018 javap
-rwxr-xr-x 1 root root   2293 Sep 12  2018 javapackager
-rwxr-xr-x 1 root root   1809 Oct  6  2018 java-rmi.cgi
-rwxr-xr-x 1 root root 140248 Oct  6  2018 javaws
-rwxr-xr-x 1 root root   8584 Oct  6  2018 jcmd
-rwxr-xr-x 1 root root   8608 Oct  6  2018 jconsole
-rwxr-xr-x 1 root root   6264 Oct  6  2018 jcontrol
-rwxr-xr-x 1 root root   8600 Oct  6  2018 jdb
-rwxr-xr-x 1 root root   8584 Oct  6  2018 jdeps
-rwxr-xr-x 1 root root   8584 Oct  6  2018 jhat
-rwxr-xr-x 1 root root   8648 Oct  6  2018 jinfo
-rwxr-xr-x 1 root root   8584 Oct  6  2018 jjs
-rwxr-xr-x 1 root root   8648 Oct  6  2018 jmap
-rwxr-xr-x 1 root root  74675 Dec  8  2017 jmc
-rwxr-xr-x 1 root root    402 Dec  8  2017 jmc.ini
-rwxr-xr-x 1 root root   8584 Oct  6  2018 jps
-rwxr-xr-x 1 root root   8592 Oct  6  2018 jrunscript
-rwxr-xr-x 1 root root   8600 Oct  6  2018 jsadebugd
-rwxr-xr-x 1 root root   8648 Oct  6  2018 jstack
-rwxr-xr-x 1 root root   8584 Oct  6  2018 jstat
-rwxr-xr-x 1 root root   8584 Oct  6  2018 jstatd
-rwxr-xr-x 1 root root   5110 Jan 14  2017 jvisualvm
-rwxr-xr-x 1 root root   8584 Oct  6  2018 keytool
-rwxr-xr-x 1 root root   8592 Oct  6  2018 native2ascii
-rwxr-xr-x 1 root root   8656 Oct  6  2018 orbd
-rwxr-xr-x 1 root root   8584 Oct  6  2018 pack200
-rwxr-xr-x 1 root root   8592 Oct  6  2018 policytool
-rwxr-xr-x 1 root root   8584 Oct  6  2018 rmic
-rwxr-xr-x 1 root root   8584 Oct  6  2018 rmid
-rwxr-xr-x 1 root root   8592 Oct  6  2018 rmiregistry
-rwxr-xr-x 1 root root   8584 Oct  6  2018 schemagen
-rwxr-xr-x 1 root root   8584 Oct  6  2018 serialver
-rwxr-xr-x 1 root root   8592 Oct  6  2018 servertool
-rwxr-xr-x 1 root root   8656 Oct  6  2018 tnameserv
-rwxr-xr-x 1 root root 182536 Oct  6  2018 unpack200
-rwxr-xr-x 1 root root   8584 Oct  6  2018 wsgen
-rwxr-xr-x 1 root root   8584 Oct  6  2018 wsimport
-rwxr-xr-x 1 root root   8584 Oct  6  2018 xjc
+ /home/jenkins/tools/java/latest1.8/bin/java -version
java version "1.8.0_191"
Java(TM) SE Runtime Environment (build 1.8.0_191-b12)
Java HotSpot(TM) 64-Bit Server VM (build 25.191-b12, mixed mode)
+ echo which java
which java
+ which java
/home/jenkins/tools/java/latest1.8/bin/java
+ java -version
java version "1.8.0_191"
Java(TM) SE Runtime Environment (build 1.8.0_191-b12)
Java HotSpot(TM) 64-Bit Server VM (build 25.191-b12, mixed mode)
+ echo which javac
which javac
+ which javac
/home/jenkins/tools/java/latest1.8/bin/javac
+ javac -version
javac 1.8.0_191
+ echo Ant-Home:
Ant-Home:
+ ls -al
total 520
drwxr-xr-x  16 jenkins jenkins   4096 Sep 16 20:05 .
drwxr-xr-x 716 jenkins jenkins  65536 Oct 15 23:39 ..
-rw-r--r--   1 jenkins jenkins  11321 Sep 16 20:05 build.gradle
-rw-r--r--   1 jenkins jenkins    172 Oct 13 16:04 build.javacheck.xml
-rw-r--r--   1 jenkins jenkins 142300 Oct 16 00:04 build.xml
-rw-r--r--   1 jenkins jenkins   3279 Sep 16 20:05 .classpath
drwxr-xr-x   2 jenkins jenkins   4096 Sep 16 20:05 compile-lib
-rw-r--r--   1 jenkins jenkins   5814 Sep 16 20:05 doap_POI.rdf
-rw-r--r--   1 jenkins jenkins   2596 Sep 16 20:05 file-leak-detector.exclude
-rw-r--r--   1 jenkins jenkins   6229 Sep 16 20:05 forrest.properties
-rw-r--r--   1 jenkins jenkins     53 Sep 16 20:05 .gitattributes
-rw-r--r--   1 jenkins jenkins    493 Sep 16 20:05 .gitignore
drwxr-xr-x   3 jenkins jenkins   4096 Sep 16 20:05 gradle
-rwxr-xr-x   1 jenkins jenkins   5299 Sep 16 20:03 gradlew
-rw-r--r--   1 jenkins jenkins   2260 Sep 16 20:05 gradlew.bat
drwxr-xr-x   2 jenkins jenkins   4096 Sep 16 20:05 jenkins
-rw-r--r--   1 jenkins jenkins 166411 Sep 16 20:05 KEYS
drwxr-xr-x   2 jenkins jenkins   4096 Sep 16 20:03 legal
drwxr-xr-x   2 jenkins jenkins   4096 Sep 16 20:05 lib
drwxr-xr-x   2 jenkins jenkins   4096 Sep 16 20:05 maven
drwxr-xr-x   2 jenkins jenkins   4096 Sep 16 20:05 ooxml-lib
drwxr-xr-x   4 jenkins jenkins   4096 Sep 16 20:05 osgi
-rw-r--r--   1 jenkins jenkins   4813 Sep 16 20:05 patch.xml
-rw-r--r--   1 jenkins jenkins    426 Sep 16 20:03 .project
-rw-r--r--   1 jenkins jenkins   4280 Sep 16 20:05 README.rst
drwxr-xr-x  20 jenkins jenkins   4096 Sep 17 01:54 .repository
drwxr-xr-x   2 jenkins jenkins   4096 Sep 16 20:03 .settings
-rw-r--r--   1 jenkins jenkins    556 Sep 16 20:05 settings.gradle
drwxr-xr-x  10 jenkins jenkins   4096 Oct 16 00:04 sonar
drwxr-xr-x  15 jenkins jenkins   4096 Sep 16 20:05 src
drwxr-xr-x   4 jenkins jenkins   4096 Oct 16 00:04 .svn
drwxr-xr-x  14 jenkins jenkins   4096 Sep 16 20:04 test-data
-rw-r--r--   1 jenkins jenkins    136 Sep 16 20:04 .travis.yml
+ echo which ant
which ant
+ which ant
/usr/bin/ant
+ ant -version
Apache Ant(TM) version 1.9.6 compiled on July 20 2018
+ echo '<project default="test"><target name="test"><echo>Java ${ant.java.version}/${java.version}</echo><exec executable="javac"><arg value="-version"/></exec></target></project>'
+ ant -f build.javacheck.xml -v
Apache Ant(TM) version 1.9.6 compiled on July 20 2018
Buildfile: <https://builds.apache.org/job/POI-DSL-Maven/ws/build.javacheck.xml>
Detected Java version: 1.8 in: /usr/local/asfpackages/java/jdk1.8.0_191/jre
Detected OS: Linux
parsing buildfile <https://builds.apache.org/job/POI-DSL-Maven/ws/build.javacheck.xml> with URI = <https://builds.apache.org/job/POI-DSL-Maven/ws/build.javacheck.xml>
Project base dir set to: <https://builds.apache.org/job/POI-DSL-Maven/ws/>
Build sequence for target(s) `test' is [test]
Complete build sequence is [test, ]

test:
parsing buildfile jar:file:/usr/share/ant/lib/ant.jar!/org/apache/tools/ant/antlib.xml with URI = jar:file:/usr/share/ant/lib/ant.jar!/org/apache/tools/ant/antlib.xml from a zip file
     [echo] Java 1.8/1.8.0_191
     [exec] Current OS is Linux
     [exec] Executing 'javac' with arguments:
     [exec] '-version'
     [exec]
     [exec] The ' characters around the executable and arguments are
     [exec] not part of the command.
     [exec] javac 1.8.0_191

BUILD SUCCESSFUL
Total time: 0 seconds
+ exit 0
[POI-DSL-Maven] $ mvn -f sonar/pom.xml -Dmaven.repo.local=<https://builds.apache.org/job/POI-DSL-Maven/ws/.repository> clean
FATAL: command execution failed
java.io.IOException: error=2, No such file or directory
        at java.lang.UNIXProcess.forkAndExec(Native Method)
        at java.lang.UNIXProcess.<init>(UNIXProcess.java:247)
        at java.lang.ProcessImpl.start(ProcessImpl.java:134)
        at java.lang.ProcessBuilder.start(ProcessBuilder.java:1029)
Also:   hudson.remoting.Channel$CallSiteStackTrace: Remote call to H43
                at hudson.remoting.Channel.attachCallSiteStackTrace(Channel.java:1743)
                at hudson.remoting.UserRequest$ExceptionResponse.retrieve(UserRequest.java:357)
                at hudson.remoting.Channel.call(Channel.java:957)
                at hudson.Launcher$RemoteLauncher.launch(Launcher.java:1060)
                at hudson.Launcher$ProcStarter.start(Launcher.java:455)
                at hudson.Launcher$ProcStarter.join(Launcher.java:466)
                at hudson.tasks.Maven.perform(Maven.java:368)
                at hudson.tasks.BuildStepMonitor$1.perform(BuildStepMonitor.java:20)
                at hudson.model.AbstractBuild$AbstractBuildExecution.perform(AbstractBuild.java:741)
                at hudson.model.Build$BuildExecution.build(Build.java:206)
                at hudson.model.Build$BuildExecution.doRun(Build.java:163)
                at hudson.model.AbstractBuild$AbstractBuildExecution.run(AbstractBuild.java:504)
                at hudson.model.Run.execute(Run.java:1815)
                at hudson.model.FreeStyleBuild.run(FreeStyleBuild.java:43)
                at hudson.model.ResourceController.execute(ResourceController.java:97)
                at hudson.model.Executor.run(Executor.java:429)
Caused: java.io.IOException: Cannot run program "mvn" (in directory "<https://builds.apache.org/job/POI-DSL-Maven/ws/")>: error=2, No such file or directory
        at java.lang.ProcessBuilder.start(ProcessBuilder.java:1048)
        at hudson.Proc$LocalProc.<init>(Proc.java:250)
        at hudson.Proc$LocalProc.<init>(Proc.java:219)
        at hudson.Launcher$LocalLauncher.launch(Launcher.java:937)
        at hudson.Launcher$ProcStarter.start(Launcher.java:455)
        at hudson.Launcher$RemoteLaunchCallable.call(Launcher.java:1319)
        at hudson.Launcher$RemoteLaunchCallable.call(Launcher.java:1272)
        at hudson.remoting.UserRequest.perform(UserRequest.java:212)
        at hudson.remoting.UserRequest.perform(UserRequest.java:54)
        at hudson.remoting.Request$2.run(Request.java:369)
        at hudson.remoting.InterceptingExecutorService$1.call(InterceptingExecutorService.java:72)
        at java.util.concurrent.FutureTask.run(FutureTask.java:266)
        at java.util.concurrent.ThreadPoolExecutor.runWorker(ThreadPoolExecutor.java:1142)
        at java.util.concurrent.ThreadPoolExecutor$Worker.run(ThreadPoolExecutor.java:617)
        at java.lang.Thread.run(Thread.java:748)
Build step 'Invoke top-level Maven targets' marked build as failure
Recording test results
ERROR: Step ?Publish JUnit test result report? failed: Test reports were found but none of them are new. Did leafNodes run?
For example, <https://builds.apache.org/job/POI-DSL-Maven/ws/sonar/excelant/target/surefire-reports/TEST-org.apache.poi.ss.examples.formula.TestExcelAntUserDefinedFunction.xml> is 2 days 7 hr old


---------------------------------------------------------------------
To unsubscribe, e-mail: [hidden email]
For additional commands, e-mail: [hidden email]

Reply | Threaded
Open this post in threaded view
|

Build failed in Jenkins: POI-DSL-Maven #935

Apache Jenkins Server
See <https://builds.apache.org/job/POI-DSL-Maven/935/display/redirect?page=changes>

Changes:

[kiwiwings] POI 4.1.1 release infos

[kiwiwings] POI 4.1.1 release infos


------------------------------------------
[...truncated 378.89 KB...]
AU        src/documentation/resources/images/logoWendyWise2.png
AU        src/documentation/resources/images/POIFSLifeCycle.gif
AU        src/documentation/resources/images/logoAdria1.png
AU        src/documentation/resources/images/logoAdria2.png
AU        src/documentation/resources/images/logoAdria3.png
AU        src/documentation/resources/images/remove.jpg
AU        src/documentation/resources/images/logoKarmokar3s.png
AU        src/documentation/resources/images/logoGlenStampoutlzis.png
AU        src/documentation/resources/images/logoKarmokar1.png
AU        src/documentation/resources/images/POIFSInitialization.gif
AU        src/documentation/resources/images/logoKarmokar2.png
AU        src/documentation/resources/images/logoRaPiGmbH10.png
AU        src/documentation/resources/images/logoKarmokar3.png
AU        src/documentation/resources/images/logoRaPiGmbH11.png
AU        src/documentation/resources/images/logoMichaelMosmann.png
AU        src/documentation/resources/images/logoKarmokar4.png
AU        src/documentation/resources/images/logoRaPiGmbH12.png
AU        src/documentation/resources/images/logoKarmokar5.png
AU        src/documentation/resources/images/logoKarmokar6.png
AU        src/documentation/resources/images/ApacheConEu08.jpg
AU        src/documentation/resources/images/BlockClassDiagram.gif
AU        src/documentation/resources/images/calculatePayment.jpg
AU        src/documentation/resources/images/PropertyTableClassDiagram.gif
AU        src/documentation/resources/images/logoRussellBeattie1.png
AU        src/documentation/resources/images/logoRussellBeattie2.png
AU        src/documentation/resources/images/logoRussellBeattie3.png
A         src/documentation/resources/schema
A         src/documentation/resources/schema/catalog.xcat
AU        src/documentation/resources/schema/changes-poi.dtd
AU        src/documentation/resources/schema/changes-poi.mod
A         src/documentation/sitemap.xmap
AU        src/documentation/skinconf.xml
AU        src/documentation/release-guide.txt
A         src/documentation/cli.xconf
AU        src/documentation/RELEASE-NOTES.txt
AU        src/documentation/README.txt
A         src/documentation/classes
A         src/documentation/classes/CatalogManager.properties
At revision 1868670

At revision 1868670

No changes for https://svn.apache.org/repos/asf/poi/trunk since the previous build
No changes for https://svn.apache.org/repos/asf/poi/site/forrest.properties since the previous build
[POI-DSL-Maven] $ /bin/bash -xe /tmp/jenkins4782978076480464590.sh
+ svn status
    X   forrest.properties
X       src/documentation

Performing status on external item at 'src/documentation':
+ echo Java-Home: /home/jenkins/tools/java/latest1.8
Java-Home: /home/jenkins/tools/java/latest1.8
+ ls -al /home/jenkins/tools/java/latest1.8/
total 26000
drwxr-xr-x  7 root root     4096 Oct  3 20:08 .
drwxr-xr-x 27 root root     4096 Oct 14 18:30 ..
drwxr-xr-x  2 root root     4096 Oct  3 20:08 bin
-r--r--r--  1 root root     3244 Oct  6  2018 COPYRIGHT
drwxr-xr-x  3 root root     4096 Oct  3 20:08 include
-rw-r--r--  1 root root  5207154 Sep 12  2018 javafx-src.zip
drwxr-xr-x  5 root root     4096 Oct  3 20:08 jre
drwxr-xr-x  5 root root     4096 Oct  3 20:08 lib
-r--r--r--  1 root root       40 Oct  6  2018 LICENSE
drwxr-xr-x  4 root root     4096 Oct  3 20:08 man
-r--r--r--  1 root root      159 Oct  6  2018 README.html
-rw-r--r--  1 root root      424 Oct  6  2018 release
-rw-r--r--  1 root root 21101479 Oct  6  2018 src.zip
-rw-r--r--  1 root root   108062 Sep 12  2018 THIRDPARTYLICENSEREADME-JAVAFX.txt
-r--r--r--  1 root root   155003 Oct  6  2018 THIRDPARTYLICENSEREADME.txt
+ ls -al /home/jenkins/tools/java/latest1.8/bin
total 904
drwxr-xr-x 2 root root   4096 Oct  3 20:08 .
drwxr-xr-x 7 root root   4096 Oct  3 20:08 ..
-rwxr-xr-x 1 root root   8592 Oct  6  2018 appletviewer
lrwxrwxrwx 1 root root      8 Oct  6  2018 ControlPanel -> jcontrol
-rwxr-xr-x 1 root root   8584 Oct  6  2018 extcheck
-rwxr-xr-x 1 root root   8584 Oct  6  2018 idlj
-rwxr-xr-x 1 root root   8584 Oct  6  2018 jar
-rwxr-xr-x 1 root root   8584 Oct  6  2018 jarsigner
-rwxr-xr-x 1 root root   8464 Oct  6  2018 java
-rwxr-xr-x 1 root root   8584 Oct  6  2018 javac
-rwxr-xr-x 1 root root   8584 Oct  6  2018 javadoc
-rwxr-xr-x 1 root root   2293 Sep 12  2018 javafxpackager
-rwxr-xr-x 1 root root   8584 Oct  6  2018 javah
-rwxr-xr-x 1 root root   8584 Oct  6  2018 javap
-rwxr-xr-x 1 root root   2293 Sep 12  2018 javapackager
-rwxr-xr-x 1 root root   1809 Oct  6  2018 java-rmi.cgi
-rwxr-xr-x 1 root root 140248 Oct  6  2018 javaws
-rwxr-xr-x 1 root root   8584 Oct  6  2018 jcmd
-rwxr-xr-x 1 root root   8608 Oct  6  2018 jconsole
-rwxr-xr-x 1 root root   6264 Oct  6  2018 jcontrol
-rwxr-xr-x 1 root root   8600 Oct  6  2018 jdb
-rwxr-xr-x 1 root root   8584 Oct  6  2018 jdeps
-rwxr-xr-x 1 root root   8584 Oct  6  2018 jhat
-rwxr-xr-x 1 root root   8648 Oct  6  2018 jinfo
-rwxr-xr-x 1 root root   8584 Oct  6  2018 jjs
-rwxr-xr-x 1 root root   8648 Oct  6  2018 jmap
-rwxr-xr-x 1 root root  74675 Dec  8  2017 jmc
-rwxr-xr-x 1 root root    402 Dec  8  2017 jmc.ini
-rwxr-xr-x 1 root root   8584 Oct  6  2018 jps
-rwxr-xr-x 1 root root   8592 Oct  6  2018 jrunscript
-rwxr-xr-x 1 root root   8600 Oct  6  2018 jsadebugd
-rwxr-xr-x 1 root root   8648 Oct  6  2018 jstack
-rwxr-xr-x 1 root root   8584 Oct  6  2018 jstat
-rwxr-xr-x 1 root root   8584 Oct  6  2018 jstatd
-rwxr-xr-x 1 root root   5110 Jan 14  2017 jvisualvm
-rwxr-xr-x 1 root root   8584 Oct  6  2018 keytool
-rwxr-xr-x 1 root root   8592 Oct  6  2018 native2ascii
-rwxr-xr-x 1 root root   8656 Oct  6  2018 orbd
-rwxr-xr-x 1 root root   8584 Oct  6  2018 pack200
-rwxr-xr-x 1 root root   8592 Oct  6  2018 policytool
-rwxr-xr-x 1 root root   8584 Oct  6  2018 rmic
-rwxr-xr-x 1 root root   8584 Oct  6  2018 rmid
-rwxr-xr-x 1 root root   8592 Oct  6  2018 rmiregistry
-rwxr-xr-x 1 root root   8584 Oct  6  2018 schemagen
-rwxr-xr-x 1 root root   8584 Oct  6  2018 serialver
-rwxr-xr-x 1 root root   8592 Oct  6  2018 servertool
-rwxr-xr-x 1 root root   8656 Oct  6  2018 tnameserv
-rwxr-xr-x 1 root root 182536 Oct  6  2018 unpack200
-rwxr-xr-x 1 root root   8584 Oct  6  2018 wsgen
-rwxr-xr-x 1 root root   8584 Oct  6  2018 wsimport
-rwxr-xr-x 1 root root   8584 Oct  6  2018 xjc
+ /home/jenkins/tools/java/latest1.8/bin/java -version
java version "1.8.0_191"
Java(TM) SE Runtime Environment (build 1.8.0_191-b12)
Java HotSpot(TM) 64-Bit Server VM (build 25.191-b12, mixed mode)
+ echo which java
which java
+ which java
/home/jenkins/tools/java/latest1.8/bin/java
+ java -version
java version "1.8.0_191"
Java(TM) SE Runtime Environment (build 1.8.0_191-b12)
Java HotSpot(TM) 64-Bit Server VM (build 25.191-b12, mixed mode)
+ echo which javac
which javac
+ which javac
/home/jenkins/tools/java/latest1.8/bin/javac
+ javac -version
javac 1.8.0_191
+ echo Ant-Home:
Ant-Home:
+ ls -al
total 456
drwxr-xr-x  15 jenkins jenkins   4096 Oct 20 20:05 .
drwxr-xr-x 153 jenkins jenkins  12288 Oct 20 20:03 ..
-rw-r--r--   1 jenkins jenkins  11321 Oct 20 20:04 build.gradle
-rw-r--r--   1 jenkins jenkins 142300 Oct 20 20:04 build.xml
-rw-r--r--   1 jenkins jenkins   3279 Oct 20 20:04 .classpath
drwxr-xr-x   2 jenkins jenkins   4096 Oct 20 20:04 compile-lib
-rw-r--r--   1 jenkins jenkins   5814 Oct 20 20:04 doap_POI.rdf
-rw-r--r--   1 jenkins jenkins   2596 Oct 20 20:04 file-leak-detector.exclude
-rw-r--r--   1 jenkins jenkins   6229 Oct 20 20:05 forrest.properties
-rw-r--r--   1 jenkins jenkins     53 Oct 20 20:04 .gitattributes
-rw-r--r--   1 jenkins jenkins    493 Oct 20 20:04 .gitignore
drwxr-xr-x   3 jenkins jenkins   4096 Oct 20 20:04 gradle
-rwxr-xr-x   1 jenkins jenkins   5299 Oct 20 20:04 gradlew
-rw-r--r--   1 jenkins jenkins   2260 Oct 20 20:04 gradlew.bat
drwxr-xr-x   2 jenkins jenkins   4096 Oct 20 20:04 jenkins
-rw-r--r--   1 jenkins jenkins 166411 Oct 20 20:04 KEYS
drwxr-xr-x   2 jenkins jenkins   4096 Oct 20 20:04 legal
drwxr-xr-x   2 jenkins jenkins   4096 Oct 20 20:04 lib
drwxr-xr-x   2 jenkins jenkins   4096 Oct 20 20:04 maven
drwxr-xr-x   2 jenkins jenkins   4096 Oct 20 20:04 ooxml-lib
drwxr-xr-x   4 jenkins jenkins   4096 Oct 20 20:04 osgi
-rw-r--r--   1 jenkins jenkins   4813 Oct 20 20:04 patch.xml
-rw-r--r--   1 jenkins jenkins    426 Oct 20 20:04 .project
-rw-r--r--   1 jenkins jenkins   4280 Oct 20 20:04 README.rst
drwxr-xr-x   2 jenkins jenkins   4096 Oct 20 20:04 .settings
-rw-r--r--   1 jenkins jenkins    556 Oct 20 20:04 settings.gradle
drwxr-xr-x  10 jenkins jenkins   4096 Oct 20 20:04 sonar
drwxr-xr-x  15 jenkins jenkins   4096 Oct 20 20:05 src
drwxr-xr-x   4 jenkins jenkins   4096 Oct 20 20:05 .svn
drwxr-xr-x  14 jenkins jenkins   4096 Oct 20 20:04 test-data
-rw-r--r--   1 jenkins jenkins    136 Oct 20 20:04 .travis.yml
+ echo which ant
which ant
+ which ant
/usr/bin/ant
+ ant -version
Apache Ant(TM) version 1.10.5 compiled on March 28 2019
+ echo '<project default="test"><target name="test"><echo>Java ${ant.java.version}/${java.version}</echo><exec executable="javac"><arg value="-version"/></exec></target></project>'
+ ant -f build.javacheck.xml -v
Apache Ant(TM) version 1.10.5 compiled on March 28 2019
Buildfile: <https://builds.apache.org/job/POI-DSL-Maven/ws/build.javacheck.xml>
Detected Java version: 1.8 in: /usr/local/asfpackages/java/jdk1.8.0_191/jre
Detected OS: Linux
parsing buildfile <https://builds.apache.org/job/POI-DSL-Maven/ws/build.javacheck.xml> with URI = <https://builds.apache.org/job/POI-DSL-Maven/ws/build.javacheck.xml>
Project base dir set to: <https://builds.apache.org/job/POI-DSL-Maven/ws/>
Build sequence for target(s) `test' is [test]
Complete build sequence is [test, ]

test:
parsing buildfile jar:file:/usr/share/ant/lib/ant.jar!/org/apache/tools/ant/antlib.xml with URI = jar:file:/usr/share/ant/lib/ant.jar!/org/apache/tools/ant/antlib.xml from a zip file
     [echo] Java 1.8/1.8.0_191
     [exec] Current OS is Linux
     [exec] Executing 'javac' with arguments:
     [exec] '-version'
     [exec]
     [exec] The ' characters around the executable and arguments are
     [exec] not part of the command.
     [exec] javac 1.8.0_191

BUILD SUCCESSFUL
Total time: 1 second
+ exit 0
[POI-DSL-Maven] $ mvn -f sonar/pom.xml -Dmaven.repo.local=<https://builds.apache.org/job/POI-DSL-Maven/ws/.repository> clean
FATAL: command execution failed
java.io.IOException: error=2, No such file or directory
        at java.lang.UNIXProcess.forkAndExec(Native Method)
        at java.lang.UNIXProcess.<init>(UNIXProcess.java:247)
        at java.lang.ProcessImpl.start(ProcessImpl.java:134)
        at java.lang.ProcessBuilder.start(ProcessBuilder.java:1029)
Also:   hudson.remoting.Channel$CallSiteStackTrace: Remote call to H33
                at hudson.remoting.Channel.attachCallSiteStackTrace(Channel.java:1743)
                at hudson.remoting.UserRequest$ExceptionResponse.retrieve(UserRequest.java:357)
                at hudson.remoting.Channel.call(Channel.java:957)
                at hudson.Launcher$RemoteLauncher.launch(Launcher.java:1060)
                at hudson.Launcher$ProcStarter.start(Launcher.java:455)
                at hudson.Launcher$ProcStarter.join(Launcher.java:466)
                at hudson.tasks.Maven.perform(Maven.java:368)
                at hudson.tasks.BuildStepMonitor$1.perform(BuildStepMonitor.java:20)
                at hudson.model.AbstractBuild$AbstractBuildExecution.perform(AbstractBuild.java:741)
                at hudson.model.Build$BuildExecution.build(Build.java:206)
                at hudson.model.Build$BuildExecution.doRun(Build.java:163)
                at hudson.model.AbstractBuild$AbstractBuildExecution.run(AbstractBuild.java:504)
                at hudson.model.Run.execute(Run.java:1815)
                at hudson.model.FreeStyleBuild.run(FreeStyleBuild.java:43)
                at hudson.model.ResourceController.execute(ResourceController.java:97)
                at hudson.model.Executor.run(Executor.java:429)
Caused: java.io.IOException: Cannot run program "mvn" (in directory "<https://builds.apache.org/job/POI-DSL-Maven/ws/")>: error=2, No such file or directory
        at java.lang.ProcessBuilder.start(ProcessBuilder.java:1048)
        at hudson.Proc$LocalProc.<init>(Proc.java:250)
        at hudson.Proc$LocalProc.<init>(Proc.java:219)
        at hudson.Launcher$LocalLauncher.launch(Launcher.java:937)
        at hudson.Launcher$ProcStarter.start(Launcher.java:455)
        at hudson.Launcher$RemoteLaunchCallable.call(Launcher.java:1319)
        at hudson.Launcher$RemoteLaunchCallable.call(Launcher.java:1272)
        at hudson.remoting.UserRequest.perform(UserRequest.java:212)
        at hudson.remoting.UserRequest.perform(UserRequest.java:54)
        at hudson.remoting.Request$2.run(Request.java:369)
        at hudson.remoting.InterceptingExecutorService$1.call(InterceptingExecutorService.java:72)
        at java.util.concurrent.FutureTask.run(FutureTask.java:266)
        at java.util.concurrent.ThreadPoolExecutor.runWorker(ThreadPoolExecutor.java:1149)
        at java.util.concurrent.ThreadPoolExecutor$Worker.run(ThreadPoolExecutor.java:624)
        at java.lang.Thread.run(Thread.java:748)
Build step 'Invoke top-level Maven targets' marked build as failure
Recording test results
ERROR: Step ?Publish JUnit test result report? failed: No test report files were found. Configuration error?

---------------------------------------------------------------------
To unsubscribe, e-mail: [hidden email]
For additional commands, e-mail: [hidden email]

Reply | Threaded
Open this post in threaded view
|

Build failed in Jenkins: POI-DSL-Maven #936

Apache Jenkins Server
See <https://builds.apache.org/job/POI-DSL-Maven/936/display/redirect?page=changes>

Changes:

[kiwiwings] POI 4.1.1 release infos


------------------------------------------
Started by an SCM change
Running as SYSTEM
[EnvInject] - Loading node environment variables.
[EnvInject] - Preparing an environment for the build.
[EnvInject] - Keeping Jenkins system variables.
[EnvInject] - Keeping Jenkins build variables.
[EnvInject] - Injecting as environment variables the properties content
LANG=en_US.UTF-8
FORREST_HOME=/home/jenkins/tools/forrest/latest

[EnvInject] - Variables injected successfully.
[EnvInject] - Injecting contributions.
Building remotely on H43 (ubuntu xenial) in workspace <https://builds.apache.org/job/POI-DSL-Maven/ws/>
[WS-CLEANUP] Deleting project workspace...
[WS-CLEANUP] Done
Updating https://svn.apache.org/repos/asf/poi/trunk at revision '2019-10-21T00:04:07.476 +0000'
U         doap_POI.rdf

<-- Got one external: forrest.properties, svn url: https://svn.apache.org/repos/asf/poi/site/forrest.properties -->
Fetching 'https://svn.apache.org/repos/asf/poi/site/forrest.properties' at -1 into '<https://builds.apache.org/job/POI-DSL-Maven/ws/forrest.properties'>
At revision 1868671


<-- Got one external: documentation, svn url: https://svn.apache.org/repos/asf/poi/site/src/documentation -->
Fetching 'https://svn.apache.org/repos/asf/poi/site/src/documentation' at -1 into '<https://builds.apache.org/job/POI-DSL-Maven/ws/src/documentation'>
U         src/documentation/content/xdocs/index.xml
U         src/documentation/content/xdocs/apidocs/index.xml
U         src/documentation/content/xdocs/changes.xml
U         src/documentation/content/xdocs/download.xml
At revision 1868671

At revision 1868671

No changes for https://svn.apache.org/repos/asf/poi/site/forrest.properties since the previous build
No changes for https://svn.apache.org/repos/asf/poi/site/src/documentation since the previous build
[POI-DSL-Maven] $ /bin/bash -xe /tmp/jenkins7473296434092298834.sh
+ svn status
?       .repository
?       build.javacheck.xml
    X   forrest.properties
X       src/documentation

Performing status on external item at 'src/documentation':
+ echo Java-Home: /home/jenkins/tools/java/latest1.8
Java-Home: /home/jenkins/tools/java/latest1.8
+ ls -al /home/jenkins/tools/java/latest1.8/
total 26000
drwxr-xr-x  7 root root     4096 Nov  5  2018 .
drwxr-xr-x 51 root root     4096 Sep 15 02:15 ..
drwxr-xr-x  2 root root     4096 Nov  5  2018 bin
-r--r--r--  1 root root     3244 Oct  6  2018 COPYRIGHT
drwxr-xr-x  3 root root     4096 Nov  5  2018 include
-rw-r--r--  1 root root  5207154 Sep 12  2018 javafx-src.zip
drwxr-xr-x  5 root root     4096 Nov  5  2018 jre
drwxr-xr-x  5 root root     4096 Nov  5  2018 lib
-r--r--r--  1 root root       40 Oct  6  2018 LICENSE
drwxr-xr-x  4 root root     4096 Nov  5  2018 man
-r--r--r--  1 root root      159 Oct  6  2018 README.html
-rw-r--r--  1 root root      424 Oct  6  2018 release
-rw-r--r--  1 root root 21101479 Oct  6  2018 src.zip
-rw-r--r--  1 root root   108062 Sep 12  2018 THIRDPARTYLICENSEREADME-JAVAFX.txt
-r--r--r--  1 root root   155003 Oct  6  2018 THIRDPARTYLICENSEREADME.txt
+ ls -al /home/jenkins/tools/java/latest1.8/bin
total 904
drwxr-xr-x 2 root root   4096 Nov  5  2018 .
drwxr-xr-x 7 root root   4096 Nov  5  2018 ..
-rwxr-xr-x 1 root root   8592 Oct  6  2018 appletviewer
lrwxrwxrwx 1 root root      8 Oct  6  2018 ControlPanel -> jcontrol
-rwxr-xr-x 1 root root   8584 Oct  6  2018 extcheck
-rwxr-xr-x 1 root root   8584 Oct  6  2018 idlj
-rwxr-xr-x 1 root root   8584 Oct  6  2018 jar
-rwxr-xr-x 1 root root   8584 Oct  6  2018 jarsigner
-rwxr-xr-x 1 root root   8464 Oct  6  2018 java
-rwxr-xr-x 1 root root   8584 Oct  6  2018 javac
-rwxr-xr-x 1 root root   8584 Oct  6  2018 javadoc
-rwxr-xr-x 1 root root   2293 Sep 12  2018 javafxpackager
-rwxr-xr-x 1 root root   8584 Oct  6  2018 javah
-rwxr-xr-x 1 root root   8584 Oct  6  2018 javap
-rwxr-xr-x 1 root root   2293 Sep 12  2018 javapackager
-rwxr-xr-x 1 root root   1809 Oct  6  2018 java-rmi.cgi
-rwxr-xr-x 1 root root 140248 Oct  6  2018 javaws
-rwxr-xr-x 1 root root   8584 Oct  6  2018 jcmd
-rwxr-xr-x 1 root root   8608 Oct  6  2018 jconsole
-rwxr-xr-x 1 root root   6264 Oct  6  2018 jcontrol
-rwxr-xr-x 1 root root   8600 Oct  6  2018 jdb
-rwxr-xr-x 1 root root   8584 Oct  6  2018 jdeps
-rwxr-xr-x 1 root root   8584 Oct  6  2018 jhat
-rwxr-xr-x 1 root root   8648 Oct  6  2018 jinfo
-rwxr-xr-x 1 root root   8584 Oct  6  2018 jjs
-rwxr-xr-x 1 root root   8648 Oct  6  2018 jmap
-rwxr-xr-x 1 root root  74675 Dec  8  2017 jmc
-rwxr-xr-x 1 root root    402 Dec  8  2017 jmc.ini
-rwxr-xr-x 1 root root   8584 Oct  6  2018 jps
-rwxr-xr-x 1 root root   8592 Oct  6  2018 jrunscript
-rwxr-xr-x 1 root root   8600 Oct  6  2018 jsadebugd
-rwxr-xr-x 1 root root   8648 Oct  6  2018 jstack
-rwxr-xr-x 1 root root   8584 Oct  6  2018 jstat
-rwxr-xr-x 1 root root   8584 Oct  6  2018 jstatd
-rwxr-xr-x 1 root root   5110 Jan 14  2017 jvisualvm
-rwxr-xr-x 1 root root   8584 Oct  6  2018 keytool
-rwxr-xr-x 1 root root   8592 Oct  6  2018 native2ascii
-rwxr-xr-x 1 root root   8656 Oct  6  2018 orbd
-rwxr-xr-x 1 root root   8584 Oct  6  2018 pack200
-rwxr-xr-x 1 root root   8592 Oct  6  2018 policytool
-rwxr-xr-x 1 root root   8584 Oct  6  2018 rmic
-rwxr-xr-x 1 root root   8584 Oct  6  2018 rmid
-rwxr-xr-x 1 root root   8592 Oct  6  2018 rmiregistry
-rwxr-xr-x 1 root root   8584 Oct  6  2018 schemagen
-rwxr-xr-x 1 root root   8584 Oct  6  2018 serialver
-rwxr-xr-x 1 root root   8592 Oct  6  2018 servertool
-rwxr-xr-x 1 root root   8656 Oct  6  2018 tnameserv
-rwxr-xr-x 1 root root 182536 Oct  6  2018 unpack200
-rwxr-xr-x 1 root root   8584 Oct  6  2018 wsgen
-rwxr-xr-x 1 root root   8584 Oct  6  2018 wsimport
-rwxr-xr-x 1 root root   8584 Oct  6  2018 xjc
+ /home/jenkins/tools/java/latest1.8/bin/java -version
java version "1.8.0_191"
Java(TM) SE Runtime Environment (build 1.8.0_191-b12)
Java HotSpot(TM) 64-Bit Server VM (build 25.191-b12, mixed mode)
+ echo which java
which java
+ which java
/home/jenkins/tools/java/latest1.8/bin/java
+ java -version
java version "1.8.0_191"
Java(TM) SE Runtime Environment (build 1.8.0_191-b12)
Java HotSpot(TM) 64-Bit Server VM (build 25.191-b12, mixed mode)
+ echo which javac
which javac
+ which javac
/home/jenkins/tools/java/latest1.8/bin/javac
+ javac -version
javac 1.8.0_191
+ echo Ant-Home:
Ant-Home:
+ ls -al
total 520
drwxr-xr-x  16 jenkins jenkins   4096 Sep 16 20:05 .
drwxr-xr-x 702 jenkins jenkins  65536 Oct 20 23:54 ..
-rw-r--r--   1 jenkins jenkins  11321 Sep 16 20:05 build.gradle
-rw-r--r--   1 jenkins jenkins    172 Oct 16 00:04 build.javacheck.xml
-rw-r--r--   1 jenkins jenkins 142300 Oct 16 00:04 build.xml
-rw-r--r--   1 jenkins jenkins   3279 Sep 16 20:05 .classpath
drwxr-xr-x   2 jenkins jenkins   4096 Sep 16 20:05 compile-lib
-rw-r--r--   1 jenkins jenkins   5987 Oct 21 00:04 doap_POI.rdf
-rw-r--r--   1 jenkins jenkins   2596 Sep 16 20:05 file-leak-detector.exclude
-rw-r--r--   1 jenkins jenkins   6229 Sep 16 20:05 forrest.properties
-rw-r--r--   1 jenkins jenkins     53 Sep 16 20:05 .gitattributes
-rw-r--r--   1 jenkins jenkins    493 Sep 16 20:05 .gitignore
drwxr-xr-x   3 jenkins jenkins   4096 Sep 16 20:05 gradle
-rwxr-xr-x   1 jenkins jenkins   5299 Sep 16 20:03 gradlew
-rw-r--r--   1 jenkins jenkins   2260 Sep 16 20:05 gradlew.bat
drwxr-xr-x   2 jenkins jenkins   4096 Sep 16 20:05 jenkins
-rw-r--r--   1 jenkins jenkins 166411 Sep 16 20:05 KEYS
drwxr-xr-x   2 jenkins jenkins   4096 Sep 16 20:03 legal
drwxr-xr-x   2 jenkins jenkins   4096 Sep 16 20:05 lib
drwxr-xr-x   2 jenkins jenkins   4096 Sep 16 20:05 maven
drwxr-xr-x   2 jenkins jenkins   4096 Sep 16 20:05 ooxml-lib
drwxr-xr-x   4 jenkins jenkins   4096 Sep 16 20:05 osgi
-rw-r--r--   1 jenkins jenkins   4813 Sep 16 20:05 patch.xml
-rw-r--r--   1 jenkins jenkins    426 Sep 16 20:03 .project
-rw-r--r--   1 jenkins jenkins   4280 Sep 16 20:05 README.rst
drwxr-xr-x  20 jenkins jenkins   4096 Sep 17 01:54 .repository
drwxr-xr-x   2 jenkins jenkins   4096 Sep 16 20:03 .settings
-rw-r--r--   1 jenkins jenkins    556 Sep 16 20:05 settings.gradle
drwxr-xr-x  10 jenkins jenkins   4096 Oct 16 00:04 sonar
drwxr-xr-x  15 jenkins jenkins   4096 Sep 16 20:05 src
drwxr-xr-x   4 jenkins jenkins   4096 Oct 21 00:04 .svn
drwxr-xr-x  14 jenkins jenkins   4096 Sep 16 20:04 test-data
-rw-r--r--   1 jenkins jenkins    136 Sep 16 20:04 .travis.yml
+ echo which ant
which ant
+ which ant
/usr/bin/ant
+ ant -version
Apache Ant(TM) version 1.9.6 compiled on July 20 2018
+ echo '<project default="test"><target name="test"><echo>Java ${ant.java.version}/${java.version}</echo><exec executable="javac"><arg value="-version"/></exec></target></project>'
+ ant -f build.javacheck.xml -v
Apache Ant(TM) version 1.9.6 compiled on July 20 2018
Buildfile: <https://builds.apache.org/job/POI-DSL-Maven/ws/build.javacheck.xml>
Detected Java version: 1.8 in: /usr/local/asfpackages/java/jdk1.8.0_191/jre
Detected OS: Linux
parsing buildfile <https://builds.apache.org/job/POI-DSL-Maven/ws/build.javacheck.xml> with URI = <https://builds.apache.org/job/POI-DSL-Maven/ws/build.javacheck.xml>
Project base dir set to: <https://builds.apache.org/job/POI-DSL-Maven/ws/>
Build sequence for target(s) `test' is [test]
Complete build sequence is [test, ]

test:
parsing buildfile jar:file:/usr/share/ant/lib/ant.jar!/org/apache/tools/ant/antlib.xml with URI = jar:file:/usr/share/ant/lib/ant.jar!/org/apache/tools/ant/antlib.xml from a zip file
     [echo] Java 1.8/1.8.0_191
     [exec] Current OS is Linux
     [exec] Executing 'javac' with arguments:
     [exec] '-version'
     [exec]
     [exec] The ' characters around the executable and arguments are
     [exec] not part of the command.
     [exec] javac 1.8.0_191

BUILD SUCCESSFUL
Total time: 0 seconds
+ exit 0
[POI-DSL-Maven] $ mvn -f sonar/pom.xml -Dmaven.repo.local=<https://builds.apache.org/job/POI-DSL-Maven/ws/.repository> clean
FATAL: command execution failed
java.io.IOException: error=2, No such file or directory
        at java.lang.UNIXProcess.forkAndExec(Native Method)
        at java.lang.UNIXProcess.<init>(UNIXProcess.java:247)
        at java.lang.ProcessImpl.start(ProcessImpl.java:134)
        at java.lang.ProcessBuilder.start(ProcessBuilder.java:1029)
Also:   hudson.remoting.Channel$CallSiteStackTrace: Remote call to H43
                at hudson.remoting.Channel.attachCallSiteStackTrace(Channel.java:1743)
                at hudson.remoting.UserRequest$ExceptionResponse.retrieve(UserRequest.java:357)
                at hudson.remoting.Channel.call(Channel.java:957)
                at hudson.Launcher$RemoteLauncher.launch(Launcher.java:1060)
                at hudson.Launcher$ProcStarter.start(Launcher.java:455)
                at hudson.Launcher$ProcStarter.join(Launcher.java:466)
                at hudson.tasks.Maven.perform(Maven.java:368)
                at hudson.tasks.BuildStepMonitor$1.perform(BuildStepMonitor.java:20)
                at hudson.model.AbstractBuild$AbstractBuildExecution.perform(AbstractBuild.java:741)
                at hudson.model.Build$BuildExecution.build(Build.java:206)
                at hudson.model.Build$BuildExecution.doRun(Build.java:163)
                at hudson.model.AbstractBuild$AbstractBuildExecution.run(AbstractBuild.java:504)
                at hudson.model.Run.execute(Run.java:1815)
                at hudson.model.FreeStyleBuild.run(FreeStyleBuild.java:43)
                at hudson.model.ResourceController.execute(ResourceController.java:97)
                at hudson.model.Executor.run(Executor.java:429)
Caused: java.io.IOException: Cannot run program "mvn" (in directory "<https://builds.apache.org/job/POI-DSL-Maven/ws/")>: error=2, No such file or directory
        at java.lang.ProcessBuilder.start(ProcessBuilder.java:1048)
        at hudson.Proc$LocalProc.<init>(Proc.java:250)
        at hudson.Proc$LocalProc.<init>(Proc.java:219)
        at hudson.Launcher$LocalLauncher.launch(Launcher.java:937)
        at hudson.Launcher$ProcStarter.start(Launcher.java:455)
        at hudson.Launcher$RemoteLaunchCallable.call(Launcher.java:1319)
        at hudson.Launcher$RemoteLaunchCallable.call(Launcher.java:1272)
        at hudson.remoting.UserRequest.perform(UserRequest.java:212)
        at hudson.remoting.UserRequest.perform(UserRequest.java:54)
        at hudson.remoting.Request$2.run(Request.java:369)
        at hudson.remoting.InterceptingExecutorService$1.call(InterceptingExecutorService.java:72)
        at java.util.concurrent.FutureTask.run(FutureTask.java:266)
        at java.util.concurrent.ThreadPoolExecutor.runWorker(ThreadPoolExecutor.java:1142)
        at java.util.concurrent.ThreadPoolExecutor$Worker.run(ThreadPoolExecutor.java:617)
        at java.lang.Thread.run(Thread.java:748)
Build step 'Invoke top-level Maven targets' marked build as failure
Recording test results
ERROR: Step ?Publish JUnit test result report? failed: Test reports were found but none of them are new. Did leafNodes run?
For example, <https://builds.apache.org/job/POI-DSL-Maven/ws/sonar/excelant/target/surefire-reports/TEST-org.apache.poi.ss.examples.formula.TestExcelAntUserDefinedFunction.xml> is 7 days 7 hr old


---------------------------------------------------------------------
To unsubscribe, e-mail: [hidden email]
For additional commands, e-mail: [hidden email]

Reply | Threaded
Open this post in threaded view
|

Build failed in Jenkins: POI-DSL-Maven #937

Apache Jenkins Server
See <https://builds.apache.org/job/POI-DSL-Maven/937/display/redirect?page=changes>

Changes:

[centic] Bug 63805: BigDecimal: use enum args instead of integers (deprecated in Java 9)


------------------------------------------
Started by an SCM change
Running as SYSTEM
[EnvInject] - Loading node environment variables.
[EnvInject] - Preparing an environment for the build.
[EnvInject] - Keeping Jenkins system variables.
[EnvInject] - Keeping Jenkins build variables.
[EnvInject] - Injecting as environment variables the properties content
LANG=en_US.UTF-8
FORREST_HOME=/home/jenkins/tools/forrest/latest

[EnvInject] - Variables injected successfully.
[EnvInject] - Injecting contributions.
Building remotely on H43 (ubuntu xenial) in workspace <https://builds.apache.org/job/POI-DSL-Maven/ws/>
[WS-CLEANUP] Deleting project workspace...
[WS-CLEANUP] Done
Updating https://svn.apache.org/repos/asf/poi/trunk at revision '2019-10-25T08:03:47.937 +0000'
U         src/scratchpad/src/org/apache/poi/hemf/record/emfplus/HemfPlusDraw.java
U         src/testcases/org/apache/poi/ss/util/TestExpandedDouble.java

<-- Got one external: forrest.properties, svn url: https://svn.apache.org/repos/asf/poi/site/forrest.properties -->
Fetching 'https://svn.apache.org/repos/asf/poi/site/forrest.properties' at -1 into '<https://builds.apache.org/job/POI-DSL-Maven/ws/forrest.properties'>
At revision 1868905


<-- Got one external: documentation, svn url: https://svn.apache.org/repos/asf/poi/site/src/documentation -->
Fetching 'https://svn.apache.org/repos/asf/poi/site/src/documentation' at -1 into '<https://builds.apache.org/job/POI-DSL-Maven/ws/src/documentation'>
At revision 1868905

At revision 1868905

No changes for https://svn.apache.org/repos/asf/poi/site/forrest.properties since the previous build
No changes for https://svn.apache.org/repos/asf/poi/site/src/documentation since the previous build
[POI-DSL-Maven] $ /bin/bash -xe /tmp/jenkins3624198114950470673.sh
+ svn status
?       .repository
?       build.javacheck.xml
    X   forrest.properties
X       src/documentation

Performing status on external item at 'src/documentation':
+ echo Java-Home: /home/jenkins/tools/java/latest1.8
Java-Home: /home/jenkins/tools/java/latest1.8
+ ls -al /home/jenkins/tools/java/latest1.8/
total 26000
drwxr-xr-x  7 root root     4096 Nov  5  2018 .
drwxr-xr-x 51 root root     4096 Sep 15 02:15 ..
drwxr-xr-x  2 root root     4096 Nov  5  2018 bin
-r--r--r--  1 root root     3244 Oct  6  2018 COPYRIGHT
drwxr-xr-x  3 root root     4096 Nov  5  2018 include
-rw-r--r--  1 root root  5207154 Sep 12  2018 javafx-src.zip
drwxr-xr-x  5 root root     4096 Nov  5  2018 jre
drwxr-xr-x  5 root root     4096 Nov  5  2018 lib
-r--r--r--  1 root root       40 Oct  6  2018 LICENSE
drwxr-xr-x  4 root root     4096 Nov  5  2018 man
-r--r--r--  1 root root      159 Oct  6  2018 README.html
-rw-r--r--  1 root root      424 Oct  6  2018 release
-rw-r--r--  1 root root 21101479 Oct  6  2018 src.zip
-rw-r--r--  1 root root   108062 Sep 12  2018 THIRDPARTYLICENSEREADME-JAVAFX.txt
-r--r--r--  1 root root   155003 Oct  6  2018 THIRDPARTYLICENSEREADME.txt
+ ls -al /home/jenkins/tools/java/latest1.8/bin
total 904
drwxr-xr-x 2 root root   4096 Nov  5  2018 .
drwxr-xr-x 7 root root   4096 Nov  5  2018 ..
-rwxr-xr-x 1 root root   8592 Oct  6  2018 appletviewer
lrwxrwxrwx 1 root root      8 Oct  6  2018 ControlPanel -> jcontrol
-rwxr-xr-x 1 root root   8584 Oct  6  2018 extcheck
-rwxr-xr-x 1 root root   8584 Oct  6  2018 idlj
-rwxr-xr-x 1 root root   8584 Oct  6  2018 jar
-rwxr-xr-x 1 root root   8584 Oct  6  2018 jarsigner
-rwxr-xr-x 1 root root   8464 Oct  6  2018 java
-rwxr-xr-x 1 root root   8584 Oct  6  2018 javac
-rwxr-xr-x 1 root root   8584 Oct  6  2018 javadoc
-rwxr-xr-x 1 root root   2293 Sep 12  2018 javafxpackager
-rwxr-xr-x 1 root root   8584 Oct  6  2018 javah
-rwxr-xr-x 1 root root   8584 Oct  6  2018 javap
-rwxr-xr-x 1 root root   2293 Sep 12  2018 javapackager
-rwxr-xr-x 1 root root   1809 Oct  6  2018 java-rmi.cgi
-rwxr-xr-x 1 root root 140248 Oct  6  2018 javaws
-rwxr-xr-x 1 root root   8584 Oct  6  2018 jcmd
-rwxr-xr-x 1 root root   8608 Oct  6  2018 jconsole
-rwxr-xr-x 1 root root   6264 Oct  6  2018 jcontrol
-rwxr-xr-x 1 root root   8600 Oct  6  2018 jdb
-rwxr-xr-x 1 root root   8584 Oct  6  2018 jdeps
-rwxr-xr-x 1 root root   8584 Oct  6  2018 jhat
-rwxr-xr-x 1 root root   8648 Oct  6  2018 jinfo
-rwxr-xr-x 1 root root   8584 Oct  6  2018 jjs
-rwxr-xr-x 1 root root   8648 Oct  6  2018 jmap
-rwxr-xr-x 1 root root  74675 Dec  8  2017 jmc
-rwxr-xr-x 1 root root    402 Dec  8  2017 jmc.ini
-rwxr-xr-x 1 root root   8584 Oct  6  2018 jps
-rwxr-xr-x 1 root root   8592 Oct  6  2018 jrunscript
-rwxr-xr-x 1 root root   8600 Oct  6  2018 jsadebugd
-rwxr-xr-x 1 root root   8648 Oct  6  2018 jstack
-rwxr-xr-x 1 root root   8584 Oct  6  2018 jstat
-rwxr-xr-x 1 root root   8584 Oct  6  2018 jstatd
-rwxr-xr-x 1 root root   5110 Jan 14  2017 jvisualvm
-rwxr-xr-x 1 root root   8584 Oct  6  2018 keytool
-rwxr-xr-x 1 root root   8592 Oct  6  2018 native2ascii
-rwxr-xr-x 1 root root   8656 Oct  6  2018 orbd
-rwxr-xr-x 1 root root   8584 Oct  6  2018 pack200
-rwxr-xr-x 1 root root   8592 Oct  6  2018 policytool
-rwxr-xr-x 1 root root   8584 Oct  6  2018 rmic
-rwxr-xr-x 1 root root   8584 Oct  6  2018 rmid
-rwxr-xr-x 1 root root   8592 Oct  6  2018 rmiregistry
-rwxr-xr-x 1 root root   8584 Oct  6  2018 schemagen
-rwxr-xr-x 1 root root   8584 Oct  6  2018 serialver
-rwxr-xr-x 1 root root   8592 Oct  6  2018 servertool
-rwxr-xr-x 1 root root   8656 Oct  6  2018 tnameserv
-rwxr-xr-x 1 root root 182536 Oct  6  2018 unpack200
-rwxr-xr-x 1 root root   8584 Oct  6  2018 wsgen
-rwxr-xr-x 1 root root   8584 Oct  6  2018 wsimport
-rwxr-xr-x 1 root root   8584 Oct  6  2018 xjc
+ /home/jenkins/tools/java/latest1.8/bin/java -version
java version "1.8.0_191"
Java(TM) SE Runtime Environment (build 1.8.0_191-b12)
Java HotSpot(TM) 64-Bit Server VM (build 25.191-b12, mixed mode)
+ echo which java
which java
+ which java
/home/jenkins/tools/java/latest1.8/bin/java
+ java -version
java version "1.8.0_191"
Java(TM) SE Runtime Environment (build 1.8.0_191-b12)
Java HotSpot(TM) 64-Bit Server VM (build 25.191-b12, mixed mode)
+ echo which javac
which javac
+ which javac
/home/jenkins/tools/java/latest1.8/bin/javac
+ javac -version
javac 1.8.0_191
+ echo Ant-Home:
Ant-Home:
+ ls -al
total 520
drwxr-xr-x  16 jenkins jenkins   4096 Sep 16 20:05 .
drwxr-xr-x 729 jenkins jenkins  65536 Oct 25 07:55 ..
-rw-r--r--   1 jenkins jenkins  11321 Sep 16 20:05 build.gradle
-rw-r--r--   1 jenkins jenkins    172 Oct 21 00:04 build.javacheck.xml
-rw-r--r--   1 jenkins jenkins 142300 Oct 16 00:04 build.xml
-rw-r--r--   1 jenkins jenkins   3279 Sep 16 20:05 .classpath
drwxr-xr-x   2 jenkins jenkins   4096 Sep 16 20:05 compile-lib
-rw-r--r--   1 jenkins jenkins   5987 Oct 21 00:04 doap_POI.rdf
-rw-r--r--   1 jenkins jenkins   2596 Sep 16 20:05 file-leak-detector.exclude
-rw-r--r--   1 jenkins jenkins   6229 Sep 16 20:05 forrest.properties
-rw-r--r--   1 jenkins jenkins     53 Sep 16 20:05 .gitattributes
-rw-r--r--   1 jenkins jenkins    493 Sep 16 20:05 .gitignore
drwxr-xr-x   3 jenkins jenkins   4096 Sep 16 20:05 gradle
-rwxr-xr-x   1 jenkins jenkins   5299 Sep 16 20:03 gradlew
-rw-r--r--   1 jenkins jenkins   2260 Sep 16 20:05 gradlew.bat
drwxr-xr-x   2 jenkins jenkins   4096 Sep 16 20:05 jenkins
-rw-r--r--   1 jenkins jenkins 166411 Sep 16 20:05 KEYS
drwxr-xr-x   2 jenkins jenkins   4096 Sep 16 20:03 legal
drwxr-xr-x   2 jenkins jenkins   4096 Sep 16 20:05 lib
drwxr-xr-x   2 jenkins jenkins   4096 Sep 16 20:05 maven
drwxr-xr-x   2 jenkins jenkins   4096 Sep 16 20:05 ooxml-lib
drwxr-xr-x   4 jenkins jenkins   4096 Sep 16 20:05 osgi
-rw-r--r--   1 jenkins jenkins   4813 Sep 16 20:05 patch.xml
-rw-r--r--   1 jenkins jenkins    426 Sep 16 20:03 .project
-rw-r--r--   1 jenkins jenkins   4280 Sep 16 20:05 README.rst
drwxr-xr-x  20 jenkins jenkins   4096 Sep 17 01:54 .repository
drwxr-xr-x   2 jenkins jenkins   4096 Sep 16 20:03 .settings
-rw-r--r--   1 jenkins jenkins    556 Sep 16 20:05 settings.gradle
drwxr-xr-x  10 jenkins jenkins   4096 Oct 16 00:04 sonar
drwxr-xr-x  15 jenkins jenkins   4096 Sep 16 20:05 src
drwxr-xr-x   4 jenkins jenkins   4096 Oct 25 08:04 .svn
drwxr-xr-x  14 jenkins jenkins   4096 Sep 16 20:04 test-data
-rw-r--r--   1 jenkins jenkins    136 Sep 16 20:04 .travis.yml
+ echo which ant
which ant
+ which ant
/usr/bin/ant
+ ant -version
Apache Ant(TM) version 1.9.6 compiled on July 20 2018
+ echo '<project default="test"><target name="test"><echo>Java ${ant.java.version}/${java.version}</echo><exec executable="javac"><arg value="-version"/></exec></target></project>'
+ ant -f build.javacheck.xml -v
Apache Ant(TM) version 1.9.6 compiled on July 20 2018
Buildfile: <https://builds.apache.org/job/POI-DSL-Maven/ws/build.javacheck.xml>
Detected Java version: 1.8 in: /usr/local/asfpackages/java/jdk1.8.0_191/jre
Detected OS: Linux
parsing buildfile <https://builds.apache.org/job/POI-DSL-Maven/ws/build.javacheck.xml> with URI = <https://builds.apache.org/job/POI-DSL-Maven/ws/build.javacheck.xml>
Project base dir set to: <https://builds.apache.org/job/POI-DSL-Maven/ws/>
Build sequence for target(s) `test' is [test]
Complete build sequence is [test, ]

test:
parsing buildfile jar:file:/usr/share/ant/lib/ant.jar!/org/apache/tools/ant/antlib.xml with URI = jar:file:/usr/share/ant/lib/ant.jar!/org/apache/tools/ant/antlib.xml from a zip file
     [echo] Java 1.8/1.8.0_191
     [exec] Current OS is Linux
     [exec] Executing 'javac' with arguments:
     [exec] '-version'
     [exec]
     [exec] The ' characters around the executable and arguments are
     [exec] not part of the command.
     [exec] javac 1.8.0_191

BUILD SUCCESSFUL
Total time: 0 seconds
+ exit 0
[POI-DSL-Maven] $ mvn -f sonar/pom.xml -Dmaven.repo.local=<https://builds.apache.org/job/POI-DSL-Maven/ws/.repository> clean
FATAL: command execution failed
java.io.IOException: error=2, No such file or directory
        at java.lang.UNIXProcess.forkAndExec(Native Method)
        at java.lang.UNIXProcess.<init>(UNIXProcess.java:247)
        at java.lang.ProcessImpl.start(ProcessImpl.java:134)
        at java.lang.ProcessBuilder.start(ProcessBuilder.java:1029)
Also:   hudson.remoting.Channel$CallSiteStackTrace: Remote call to H43
                at hudson.remoting.Channel.attachCallSiteStackTrace(Channel.java:1743)
                at hudson.remoting.UserRequest$ExceptionResponse.retrieve(UserRequest.java:357)
                at hudson.remoting.Channel.call(Channel.java:957)
                at hudson.Launcher$RemoteLauncher.launch(Launcher.java:1060)
                at hudson.Launcher$ProcStarter.start(Launcher.java:455)
                at hudson.Launcher$ProcStarter.join(Launcher.java:466)
                at hudson.tasks.Maven.perform(Maven.java:368)
                at hudson.tasks.BuildStepMonitor$1.perform(BuildStepMonitor.java:20)
                at hudson.model.AbstractBuild$AbstractBuildExecution.perform(AbstractBuild.java:741)
                at hudson.model.Build$BuildExecution.build(Build.java:206)
                at hudson.model.Build$BuildExecution.doRun(Build.java:163)
                at hudson.model.AbstractBuild$AbstractBuildExecution.run(AbstractBuild.java:504)
                at hudson.model.Run.execute(Run.java:1815)
                at hudson.model.FreeStyleBuild.run(FreeStyleBuild.java:43)
                at hudson.model.ResourceController.execute(ResourceController.java:97)
                at hudson.model.Executor.run(Executor.java:429)
Caused: java.io.IOException: Cannot run program "mvn" (in directory "<https://builds.apache.org/job/POI-DSL-Maven/ws/")>: error=2, No such file or directory
        at java.lang.ProcessBuilder.start(ProcessBuilder.java:1048)
        at hudson.Proc$LocalProc.<init>(Proc.java:250)
        at hudson.Proc$LocalProc.<init>(Proc.java:219)
        at hudson.Launcher$LocalLauncher.launch(Launcher.java:937)
        at hudson.Launcher$ProcStarter.start(Launcher.java:455)
        at hudson.Launcher$RemoteLaunchCallable.call(Launcher.java:1319)
        at hudson.Launcher$RemoteLaunchCallable.call(Launcher.java:1272)
        at hudson.remoting.UserRequest.perform(UserRequest.java:212)
        at hudson.remoting.UserRequest.perform(UserRequest.java:54)
        at hudson.remoting.Request$2.run(Request.java:369)
        at hudson.remoting.InterceptingExecutorService$1.call(InterceptingExecutorService.java:72)
        at java.util.concurrent.FutureTask.run(FutureTask.java:266)
        at java.util.concurrent.ThreadPoolExecutor.runWorker(ThreadPoolExecutor.java:1142)
        at java.util.concurrent.ThreadPoolExecutor$Worker.run(ThreadPoolExecutor.java:617)
        at java.lang.Thread.run(Thread.java:748)
Build step 'Invoke top-level Maven targets' marked build as failure
Recording test results
ERROR: Step ?Publish JUnit test result report? failed: Test reports were found but none of them are new. Did leafNodes run?
For example, <https://builds.apache.org/job/POI-DSL-Maven/ws/sonar/excelant/target/surefire-reports/TEST-org.apache.poi.ss.examples.formula.TestExcelAntUserDefinedFunction.xml> is 11 days old


---------------------------------------------------------------------
To unsubscribe, e-mail: [hidden email]
For additional commands, e-mail: [hidden email]

Reply | Threaded
Open this post in threaded view
|

Build failed in Jenkins: POI-DSL-Maven #938

Apache Jenkins Server
See <https://builds.apache.org/job/POI-DSL-Maven/938/display/redirect?page=changes>

Changes:

[kiwiwings] #63869 - Download page should use KEYS for the link text

[kiwiwings] Remove references to DatatypeConverter

[kiwiwings] #63745 - Make GenericRecordJsonWriter Json-conformant


------------------------------------------
[...truncated 378.83 KB...]
AU        src/documentation/resources/images/hslf_shapes.gif
AU        src/documentation/resources/images/logoWendyWise2.png
AU        src/documentation/resources/images/POIFSLifeCycle.gif
AU        src/documentation/resources/images/logoAdria1.png
AU        src/documentation/resources/images/logoAdria2.png
AU        src/documentation/resources/images/logoAdria3.png
AU        src/documentation/resources/images/remove.jpg
AU        src/documentation/resources/images/logoKarmokar3s.png
AU        src/documentation/resources/images/logoGlenStampoutlzis.png
AU        src/documentation/resources/images/logoKarmokar1.png
AU        src/documentation/resources/images/POIFSInitialization.gif
AU        src/documentation/resources/images/logoKarmokar2.png
AU        src/documentation/resources/images/logoRaPiGmbH10.png
AU        src/documentation/resources/images/logoKarmokar3.png
AU        src/documentation/resources/images/logoRaPiGmbH11.png
AU        src/documentation/resources/images/logoMichaelMosmann.png
AU        src/documentation/resources/images/logoKarmokar4.png
AU        src/documentation/resources/images/logoRaPiGmbH12.png
AU        src/documentation/resources/images/logoKarmokar5.png
AU        src/documentation/resources/images/logoKarmokar6.png
AU        src/documentation/resources/images/ApacheConEu08.jpg
AU        src/documentation/resources/images/BlockClassDiagram.gif
AU        src/documentation/resources/images/calculatePayment.jpg
AU        src/documentation/resources/images/PropertyTableClassDiagram.gif
AU        src/documentation/resources/images/logoRussellBeattie1.png
AU        src/documentation/resources/images/logoRussellBeattie2.png
AU        src/documentation/resources/images/logoRussellBeattie3.png
A         src/documentation/resources/schema
A         src/documentation/resources/schema/catalog.xcat
AU        src/documentation/resources/schema/changes-poi.dtd
AU        src/documentation/resources/schema/changes-poi.mod
A         src/documentation/sitemap.xmap
AU        src/documentation/skinconf.xml
AU        src/documentation/release-guide.txt
A         src/documentation/cli.xconf
AU        src/documentation/RELEASE-NOTES.txt
AU        src/documentation/README.txt
A         src/documentation/classes
A         src/documentation/classes/CatalogManager.properties
At revision 1868958

At revision 1868958

No changes for https://svn.apache.org/repos/asf/poi/site/forrest.properties since the previous build
[POI-DSL-Maven] $ /bin/bash -xe /tmp/jenkins7000937725639693829.sh
+ svn status
    X   forrest.properties
X       src/documentation

Performing status on external item at 'src/documentation':
+ echo Java-Home: /home/jenkins/tools/java/latest1.8
Java-Home: /home/jenkins/tools/java/latest1.8
+ ls -al /home/jenkins/tools/java/latest1.8/
total 26000
drwxr-xr-x  7 root root     4096 Oct  2 17:13 .
drwxr-xr-x 27 root root     4096 Oct 13 18:30 ..
drwxr-xr-x  2 root root     4096 Oct  2 17:13 bin
-r--r--r--  1 root root     3244 Oct  6  2018 COPYRIGHT
drwxr-xr-x  3 root root     4096 Oct  2 17:13 include
-rw-r--r--  1 root root  5207154 Sep 12  2018 javafx-src.zip
drwxr-xr-x  5 root root     4096 Oct  2 17:13 jre
drwxr-xr-x  5 root root     4096 Oct  2 17:13 lib
-r--r--r--  1 root root       40 Oct  6  2018 LICENSE
drwxr-xr-x  4 root root     4096 Oct  2 17:13 man
-r--r--r--  1 root root      159 Oct  6  2018 README.html
-rw-r--r--  1 root root      424 Oct  6  2018 release
-rw-r--r--  1 root root 21101479 Oct  6  2018 src.zip
-rw-r--r--  1 root root   108062 Sep 12  2018 THIRDPARTYLICENSEREADME-JAVAFX.txt
-r--r--r--  1 root root   155003 Oct  6  2018 THIRDPARTYLICENSEREADME.txt
+ ls -al /home/jenkins/tools/java/latest1.8/bin
total 904
drwxr-xr-x 2 root root   4096 Oct  2 17:13 .
drwxr-xr-x 7 root root   4096 Oct  2 17:13 ..
-rwxr-xr-x 1 root root   8592 Oct  6  2018 appletviewer
lrwxrwxrwx 1 root root      8 Oct  6  2018 ControlPanel -> jcontrol
-rwxr-xr-x 1 root root   8584 Oct  6  2018 extcheck
-rwxr-xr-x 1 root root   8584 Oct  6  2018 idlj
-rwxr-xr-x 1 root root   8584 Oct  6  2018 jar
-rwxr-xr-x 1 root root   8584 Oct  6  2018 jarsigner
-rwxr-xr-x 1 root root   8464 Oct  6  2018 java
-rwxr-xr-x 1 root root   8584 Oct  6  2018 javac
-rwxr-xr-x 1 root root   8584 Oct  6  2018 javadoc
-rwxr-xr-x 1 root root   2293 Sep 12  2018 javafxpackager
-rwxr-xr-x 1 root root   8584 Oct  6  2018 javah
-rwxr-xr-x 1 root root   8584 Oct  6  2018 javap
-rwxr-xr-x 1 root root   2293 Sep 12  2018 javapackager
-rwxr-xr-x 1 root root   1809 Oct  6  2018 java-rmi.cgi
-rwxr-xr-x 1 root root 140248 Oct  6  2018 javaws
-rwxr-xr-x 1 root root   8584 Oct  6  2018 jcmd
-rwxr-xr-x 1 root root   8608 Oct  6  2018 jconsole
-rwxr-xr-x 1 root root   6264 Oct  6  2018 jcontrol
-rwxr-xr-x 1 root root   8600 Oct  6  2018 jdb
-rwxr-xr-x 1 root root   8584 Oct  6  2018 jdeps
-rwxr-xr-x 1 root root   8584 Oct  6  2018 jhat
-rwxr-xr-x 1 root root   8648 Oct  6  2018 jinfo
-rwxr-xr-x 1 root root   8584 Oct  6  2018 jjs
-rwxr-xr-x 1 root root   8648 Oct  6  2018 jmap
-rwxr-xr-x 1 root root  74675 Dec  8  2017 jmc
-rwxr-xr-x 1 root root    402 Dec  8  2017 jmc.ini
-rwxr-xr-x 1 root root   8584 Oct  6  2018 jps
-rwxr-xr-x 1 root root   8592 Oct  6  2018 jrunscript
-rwxr-xr-x 1 root root   8600 Oct  6  2018 jsadebugd
-rwxr-xr-x 1 root root   8648 Oct  6  2018 jstack
-rwxr-xr-x 1 root root   8584 Oct  6  2018 jstat
-rwxr-xr-x 1 root root   8584 Oct  6  2018 jstatd
-rwxr-xr-x 1 root root   5110 Jan 14  2017 jvisualvm
-rwxr-xr-x 1 root root   8584 Oct  6  2018 keytool
-rwxr-xr-x 1 root root   8592 Oct  6  2018 native2ascii
-rwxr-xr-x 1 root root   8656 Oct  6  2018 orbd
-rwxr-xr-x 1 root root   8584 Oct  6  2018 pack200
-rwxr-xr-x 1 root root   8592 Oct  6  2018 policytool
-rwxr-xr-x 1 root root   8584 Oct  6  2018 rmic
-rwxr-xr-x 1 root root   8584 Oct  6  2018 rmid
-rwxr-xr-x 1 root root   8592 Oct  6  2018 rmiregistry
-rwxr-xr-x 1 root root   8584 Oct  6  2018 schemagen
-rwxr-xr-x 1 root root   8584 Oct  6  2018 serialver
-rwxr-xr-x 1 root root   8592 Oct  6  2018 servertool
-rwxr-xr-x 1 root root   8656 Oct  6  2018 tnameserv
-rwxr-xr-x 1 root root 182536 Oct  6  2018 unpack200
-rwxr-xr-x 1 root root   8584 Oct  6  2018 wsgen
-rwxr-xr-x 1 root root   8584 Oct  6  2018 wsimport
-rwxr-xr-x 1 root root   8584 Oct  6  2018 xjc
+ /home/jenkins/tools/java/latest1.8/bin/java -version
java version "1.8.0_191"
Java(TM) SE Runtime Environment (build 1.8.0_191-b12)
Java HotSpot(TM) 64-Bit Server VM (build 25.191-b12, mixed mode)
+ echo which java
which java
+ which java
/home/jenkins/tools/java/latest1.8/bin/java
+ java -version
java version "1.8.0_191"
Java(TM) SE Runtime Environment (build 1.8.0_191-b12)
Java HotSpot(TM) 64-Bit Server VM (build 25.191-b12, mixed mode)
+ echo which javac
which javac
+ which javac
/home/jenkins/tools/java/latest1.8/bin/javac
+ javac -version
javac 1.8.0_191
+ echo Ant-Home:
Ant-Home:
+ ls -al
total 464
drwxr-xr-x  15 jenkins jenkins   4096 Oct 25 21:09 .
drwxr-xr-x 246 jenkins jenkins  20480 Oct 25 21:08 ..
-rw-r--r--   1 jenkins jenkins  11321 Oct 25 21:09 build.gradle
-rw-r--r--   1 jenkins jenkins 142300 Oct 25 21:09 build.xml
-rw-r--r--   1 jenkins jenkins   3279 Oct 25 21:09 .classpath
drwxr-xr-x   2 jenkins jenkins   4096 Oct 25 21:09 compile-lib
-rw-r--r--   1 jenkins jenkins   5987 Oct 25 21:09 doap_POI.rdf
-rw-r--r--   1 jenkins jenkins   2596 Oct 25 21:09 file-leak-detector.exclude
-rw-r--r--   1 jenkins jenkins   6229 Oct 25 21:09 forrest.properties
-rw-r--r--   1 jenkins jenkins     53 Oct 25 21:09 .gitattributes
-rw-r--r--   1 jenkins jenkins    493 Oct 25 21:09 .gitignore
drwxr-xr-x   3 jenkins jenkins   4096 Oct 25 21:09 gradle
-rwxr-xr-x   1 jenkins jenkins   5299 Oct 25 21:09 gradlew
-rw-r--r--   1 jenkins jenkins   2260 Oct 25 21:09 gradlew.bat
drwxr-xr-x   2 jenkins jenkins   4096 Oct 25 21:09 jenkins
-rw-r--r--   1 jenkins jenkins 166411 Oct 25 21:09 KEYS
drwxr-xr-x   2 jenkins jenkins   4096 Oct 25 21:09 legal
drwxr-xr-x   2 jenkins jenkins   4096 Oct 25 21:09 lib
drwxr-xr-x   2 jenkins jenkins   4096 Oct 25 21:09 maven
drwxr-xr-x   2 jenkins jenkins   4096 Oct 25 21:09 ooxml-lib
drwxr-xr-x   4 jenkins jenkins   4096 Oct 25 21:09 osgi
-rw-r--r--   1 jenkins jenkins   4813 Oct 25 21:09 patch.xml
-rw-r--r--   1 jenkins jenkins    426 Oct 25 21:09 .project
-rw-r--r--   1 jenkins jenkins   4280 Oct 25 21:09 README.rst
drwxr-xr-x   2 jenkins jenkins   4096 Oct 25 21:09 .settings
-rw-r--r--   1 jenkins jenkins    556 Oct 25 21:09 settings.gradle
drwxr-xr-x  10 jenkins jenkins   4096 Oct 25 21:09 sonar
drwxr-xr-x  15 jenkins jenkins   4096 Oct 25 21:09 src
drwxr-xr-x   4 jenkins jenkins   4096 Oct 25 21:10 .svn
drwxr-xr-x  14 jenkins jenkins   4096 Oct 25 21:09 test-data
-rw-r--r--   1 jenkins jenkins    136 Oct 25 21:09 .travis.yml
+ echo which ant
which ant
+ which ant
/usr/bin/ant
+ ant -version
Apache Ant(TM) version 1.10.5 compiled on March 28 2019
+ echo '<project default="test"><target name="test"><echo>Java ${ant.java.version}/${java.version}</echo><exec executable="javac"><arg value="-version"/></exec></target></project>'
+ ant -f build.javacheck.xml -v
Apache Ant(TM) version 1.10.5 compiled on March 28 2019
Buildfile: <https://builds.apache.org/job/POI-DSL-Maven/ws/build.javacheck.xml>
Detected Java version: 1.8 in: /usr/local/asfpackages/java/jdk1.8.0_191/jre
Detected OS: Linux
parsing buildfile <https://builds.apache.org/job/POI-DSL-Maven/ws/build.javacheck.xml> with URI = <https://builds.apache.org/job/POI-DSL-Maven/ws/build.javacheck.xml>
Project base dir set to: <https://builds.apache.org/job/POI-DSL-Maven/ws/>
Build sequence for target(s) `test' is [test]
Complete build sequence is [test, ]

test:
parsing buildfile jar:file:/usr/share/ant/lib/ant.jar!/org/apache/tools/ant/antlib.xml with URI = jar:file:/usr/share/ant/lib/ant.jar!/org/apache/tools/ant/antlib.xml from a zip file
     [echo] Java 1.8/1.8.0_191
     [exec] Current OS is Linux
     [exec] Executing 'javac' with arguments:
     [exec] '-version'
     [exec]
     [exec] The ' characters around the executable and arguments are
     [exec] not part of the command.
     [exec] javac 1.8.0_191

BUILD SUCCESSFUL
Total time: 0 seconds
+ exit 0
[POI-DSL-Maven] $ mvn -f sonar/pom.xml -Dmaven.repo.local=<https://builds.apache.org/job/POI-DSL-Maven/ws/.repository> clean
FATAL: command execution failed
java.io.IOException: error=2, No such file or directory
        at java.lang.UNIXProcess.forkAndExec(Native Method)
        at java.lang.UNIXProcess.<init>(UNIXProcess.java:247)
        at java.lang.ProcessImpl.start(ProcessImpl.java:134)
        at java.lang.ProcessBuilder.start(ProcessBuilder.java:1029)
Also:   hudson.remoting.Channel$CallSiteStackTrace: Remote call to H29
                at hudson.remoting.Channel.attachCallSiteStackTrace(Channel.java:1743)
                at hudson.remoting.UserRequest$ExceptionResponse.retrieve(UserRequest.java:357)
                at hudson.remoting.Channel.call(Channel.java:957)
                at hudson.Launcher$RemoteLauncher.launch(Launcher.java:1060)
                at hudson.Launcher$ProcStarter.start(Launcher.java:455)
                at hudson.Launcher$ProcStarter.join(Launcher.java:466)
                at hudson.tasks.Maven.perform(Maven.java:368)
                at hudson.tasks.BuildStepMonitor$1.perform(BuildStepMonitor.java:20)
                at hudson.model.AbstractBuild$AbstractBuildExecution.perform(AbstractBuild.java:741)
                at hudson.model.Build$BuildExecution.build(Build.java:206)
                at hudson.model.Build$BuildExecution.doRun(Build.java:163)
                at hudson.model.AbstractBuild$AbstractBuildExecution.run(AbstractBuild.java:504)
                at hudson.model.Run.execute(Run.java:1815)
                at hudson.model.FreeStyleBuild.run(FreeStyleBuild.java:43)
                at hudson.model.ResourceController.execute(ResourceController.java:97)
                at hudson.model.Executor.run(Executor.java:429)
Caused: java.io.IOException: Cannot run program "mvn" (in directory "<https://builds.apache.org/job/POI-DSL-Maven/ws/")>: error=2, No such file or directory
        at java.lang.ProcessBuilder.start(ProcessBuilder.java:1048)
        at hudson.Proc$LocalProc.<init>(Proc.java:250)
        at hudson.Proc$LocalProc.<init>(Proc.java:219)
        at hudson.Launcher$LocalLauncher.launch(Launcher.java:937)
        at hudson.Launcher$ProcStarter.start(Launcher.java:455)
        at hudson.Launcher$RemoteLaunchCallable.call(Launcher.java:1319)
        at hudson.Launcher$RemoteLaunchCallable.call(Launcher.java:1272)
        at hudson.remoting.UserRequest.perform(UserRequest.java:212)
        at hudson.remoting.UserRequest.perform(UserRequest.java:54)
        at hudson.remoting.Request$2.run(Request.java:369)
        at hudson.remoting.InterceptingExecutorService$1.call(InterceptingExecutorService.java:72)
        at java.util.concurrent.FutureTask.run(FutureTask.java:266)
        at java.util.concurrent.ThreadPoolExecutor.runWorker(ThreadPoolExecutor.java:1149)
        at java.util.concurrent.ThreadPoolExecutor$Worker.run(ThreadPoolExecutor.java:624)
        at java.lang.Thread.run(Thread.java:748)
Build step 'Invoke top-level Maven targets' marked build as failure
Recording test results
ERROR: Step ?Publish JUnit test result report? failed: No test report files were found. Configuration error?

---------------------------------------------------------------------
To unsubscribe, e-mail: [hidden email]
For additional commands, e-mail: [hidden email]

Reply | Threaded
Open this post in threaded view
|

Build failed in Jenkins: POI-DSL-Maven #939

Apache Jenkins Server
See <https://builds.apache.org/job/POI-DSL-Maven/939/display/redirect?page=changes>

Changes:

[centic] Revert "Add script to convert PPT to PNGs"

This reverts commit 81beb58ab32078387afc546ff7d6bd287cbc799b.

[centic] Revert "Add script to run ant locally with Java 1.6/Ant 1.8.x"

This reverts commit 9843e1ab7150f5d105879cd6dc04e744dce0aa55.

[centic] Revert "Add script to run BiffViewer"

This reverts commit b1684d5c2bf83265db5878fdbeb6375ba052352e.

[centic] Add script to convert PPT to PNGs

[centic] Add script to run ant locally with Java 1.6/Ant 1.8.x

[centic] Add script to run BiffViewer
Set property to include escher-records in view.sh and add Launchconfig for BiffViewer

[centic] Jenkins-DSL: Do not expect to find mvn executable in Test-Environment

[centic] Jenkins-DSL: Add JDK 14, remove JDK 10, add testing for Maven to Test-Environment

[centic] Try to fix test which is still failing on Windows in a different way

[centic] Update to latest Gradle 5.6 to allow to build with newer Java versions
Adjust build.gradle slightly to work with new version of Gradle

[centic] Adjust comments and add slightly more test-coverage

[centic] Sync version in more places and use -SNAPSHOT everywhere during development

[centic] Adjust an error message slightly

[centic] Add one more file-type to the integration tests

[centic] XWPF: Insert newlines between multiple paragraphs in comments.

Closes PR #161 on GitHub

[centic] Fix some IDE warnings and update some JavaDoc


------------------------------------------
[...truncated 2.32 KB...]
U         src/java/org/apache/poi/util/GenericRecordJsonWriter.java
U         src/java/org/apache/poi/util/GenericRecordXmlWriter.java
U         src/integrationtest/org/apache/poi/TestAllFiles.java
U         src/ooxml/java/org/apache/poi/xwpf/usermodel/XWPFComment.java
U         src/ooxml/java/org/apache/poi/xssf/usermodel/XSSFDrawing.java
U         src/ooxml/java/org/apache/poi/xssf/usermodel/helpers/XSSFPasswordHelper.java
U         src/ooxml/java/org/apache/poi/poifs/crypt/dsig/SignatureInfo.java
U         src/ooxml/java/org/apache/poi/poifs/crypt/dsig/services/TSPTimeStampService.java
AU        src/ooxml/testcases/org/apache/poi/xwpf/usermodel/TestXWPFComment.java
U         src/ooxml/testcases/org/apache/poi/poifs/crypt/dsig/TestSignatureConfig.java
U         src/ooxml/testcases/org/apache/poi/ss/extractor/TestEmbeddedExtractor.java
U         src/resources/devtools/forbidden-signatures.txt
U         src/scratchpad/src/org/apache/poi/hslf/usermodel/HSLFObjectData.java
U         src/scratchpad/src/org/apache/poi/hslf/usermodel/HSLFPictureData.java
U         src/scratchpad/src/org/apache/poi/hslf/usermodel/HSLFSlideShow.java
U         build.gradle
U         gradle/wrapper/gradle-wrapper.jar
U         gradle/wrapper/gradle-wrapper.properties
U         gradlew
U         gradlew.bat
U         build.xml
U         osgi/build.xml
A         test-data/document/comment.docx

<-- Got one external: forrest.properties, svn url: https://svn.apache.org/repos/asf/poi/site/forrest.properties -->
Fetching 'https://svn.apache.org/repos/asf/poi/site/forrest.properties' at -1 into '<https://builds.apache.org/job/POI-DSL-Maven/ws/forrest.properties'>
At revision 1868992


<-- Got one external: documentation, svn url: https://svn.apache.org/repos/asf/poi/site/src/documentation -->
Fetching 'https://svn.apache.org/repos/asf/poi/site/src/documentation' at -1 into '<https://builds.apache.org/job/POI-DSL-Maven/ws/src/documentation'>
U         src/documentation/content/xdocs/download.xml
At revision 1868992

At revision 1868992

No changes for https://svn.apache.org/repos/asf/poi/site/forrest.properties since the previous build
No changes for https://svn.apache.org/repos/asf/poi/site/src/documentation since the previous build
[POI-DSL-Maven] $ /bin/bash -xe /tmp/jenkins2117925148735924357.sh
+ svn status
?       .repository
?       build.javacheck.xml
    X   forrest.properties
X       src/documentation

Performing status on external item at 'src/documentation':
+ echo Java-Home: /home/jenkins/tools/java/latest1.8
Java-Home: /home/jenkins/tools/java/latest1.8
+ ls -al /home/jenkins/tools/java/latest1.8/
total 26000
drwxr-xr-x  7 root root     4096 Nov  5  2018 .
drwxr-xr-x 51 root root     4096 Sep 15 02:15 ..
drwxr-xr-x  2 root root     4096 Nov  5  2018 bin
-r--r--r--  1 root root     3244 Oct  6  2018 COPYRIGHT
drwxr-xr-x  3 root root     4096 Nov  5  2018 include
-rw-r--r--  1 root root  5207154 Sep 12  2018 javafx-src.zip
drwxr-xr-x  5 root root     4096 Nov  5  2018 jre
drwxr-xr-x  5 root root     4096 Nov  5  2018 lib
-r--r--r--  1 root root       40 Oct  6  2018 LICENSE
drwxr-xr-x  4 root root     4096 Nov  5  2018 man
-r--r--r--  1 root root      159 Oct  6  2018 README.html
-rw-r--r--  1 root root      424 Oct  6  2018 release
-rw-r--r--  1 root root 21101479 Oct  6  2018 src.zip
-rw-r--r--  1 root root   108062 Sep 12  2018 THIRDPARTYLICENSEREADME-JAVAFX.txt
-r--r--r--  1 root root   155003 Oct  6  2018 THIRDPARTYLICENSEREADME.txt
+ ls -al /home/jenkins/tools/java/latest1.8/bin
total 904
drwxr-xr-x 2 root root   4096 Nov  5  2018 .
drwxr-xr-x 7 root root   4096 Nov  5  2018 ..
-rwxr-xr-x 1 root root   8592 Oct  6  2018 appletviewer
lrwxrwxrwx 1 root root      8 Oct  6  2018 ControlPanel -> jcontrol
-rwxr-xr-x 1 root root   8584 Oct  6  2018 extcheck
-rwxr-xr-x 1 root root   8584 Oct  6  2018 idlj
-rwxr-xr-x 1 root root   8584 Oct  6  2018 jar
-rwxr-xr-x 1 root root   8584 Oct  6  2018 jarsigner
-rwxr-xr-x 1 root root   8464 Oct  6  2018 java
-rwxr-xr-x 1 root root   8584 Oct  6  2018 javac
-rwxr-xr-x 1 root root   8584 Oct  6  2018 javadoc
-rwxr-xr-x 1 root root   2293 Sep 12  2018 javafxpackager
-rwxr-xr-x 1 root root   8584 Oct  6  2018 javah
-rwxr-xr-x 1 root root   8584 Oct  6  2018 javap
-rwxr-xr-x 1 root root   2293 Sep 12  2018 javapackager
-rwxr-xr-x 1 root root   1809 Oct  6  2018 java-rmi.cgi
-rwxr-xr-x 1 root root 140248 Oct  6  2018 javaws
-rwxr-xr-x 1 root root   8584 Oct  6  2018 jcmd
-rwxr-xr-x 1 root root   8608 Oct  6  2018 jconsole
-rwxr-xr-x 1 root root   6264 Oct  6  2018 jcontrol
-rwxr-xr-x 1 root root   8600 Oct  6  2018 jdb
-rwxr-xr-x 1 root root   8584 Oct  6  2018 jdeps
-rwxr-xr-x 1 root root   8584 Oct  6  2018 jhat
-rwxr-xr-x 1 root root   8648 Oct  6  2018 jinfo
-rwxr-xr-x 1 root root   8584 Oct  6  2018 jjs
-rwxr-xr-x 1 root root   8648 Oct  6  2018 jmap
-rwxr-xr-x 1 root root  74675 Dec  8  2017 jmc
-rwxr-xr-x 1 root root    402 Dec  8  2017 jmc.ini
-rwxr-xr-x 1 root root   8584 Oct  6  2018 jps
-rwxr-xr-x 1 root root   8592 Oct  6  2018 jrunscript
-rwxr-xr-x 1 root root   8600 Oct  6  2018 jsadebugd
-rwxr-xr-x 1 root root   8648 Oct  6  2018 jstack
-rwxr-xr-x 1 root root   8584 Oct  6  2018 jstat
-rwxr-xr-x 1 root root   8584 Oct  6  2018 jstatd
-rwxr-xr-x 1 root root   5110 Jan 14  2017 jvisualvm
-rwxr-xr-x 1 root root   8584 Oct  6  2018 keytool
-rwxr-xr-x 1 root root   8592 Oct  6  2018 native2ascii
-rwxr-xr-x 1 root root   8656 Oct  6  2018 orbd
-rwxr-xr-x 1 root root   8584 Oct  6  2018 pack200
-rwxr-xr-x 1 root root   8592 Oct  6  2018 policytool
-rwxr-xr-x 1 root root   8584 Oct  6  2018 rmic
-rwxr-xr-x 1 root root   8584 Oct  6  2018 rmid
-rwxr-xr-x 1 root root   8592 Oct  6  2018 rmiregistry
-rwxr-xr-x 1 root root   8584 Oct  6  2018 schemagen
-rwxr-xr-x 1 root root   8584 Oct  6  2018 serialver
-rwxr-xr-x 1 root root   8592 Oct  6  2018 servertool
-rwxr-xr-x 1 root root   8656 Oct  6  2018 tnameserv
-rwxr-xr-x 1 root root 182536 Oct  6  2018 unpack200
-rwxr-xr-x 1 root root   8584 Oct  6  2018 wsgen
-rwxr-xr-x 1 root root   8584 Oct  6  2018 wsimport
-rwxr-xr-x 1 root root   8584 Oct  6  2018 xjc
+ /home/jenkins/tools/java/latest1.8/bin/java -version
java version "1.8.0_191"
Java(TM) SE Runtime Environment (build 1.8.0_191-b12)
Java HotSpot(TM) 64-Bit Server VM (build 25.191-b12, mixed mode)
+ echo which java
which java
+ which java
/home/jenkins/tools/java/latest1.8/bin/java
+ java -version
java version "1.8.0_191"
Java(TM) SE Runtime Environment (build 1.8.0_191-b12)
Java HotSpot(TM) 64-Bit Server VM (build 25.191-b12, mixed mode)
+ echo which javac
which javac
+ which javac
/home/jenkins/tools/java/latest1.8/bin/javac
+ javac -version
javac 1.8.0_191
+ echo Ant-Home:
Ant-Home:
+ ls -al
total 520
drwxr-xr-x  16 jenkins jenkins   4096 Oct 26 08:03 .
drwxr-xr-x 742 jenkins jenkins  65536 Oct 26 07:38 ..
-rw-r--r--   1 jenkins jenkins  11175 Oct 26 08:03 build.gradle
-rw-r--r--   1 jenkins jenkins    172 Oct 25 08:04 build.javacheck.xml
-rw-r--r--   1 jenkins jenkins 142582 Oct 26 08:03 build.xml
-rw-r--r--   1 jenkins jenkins   3279 Sep 16 20:05 .classpath
drwxr-xr-x   2 jenkins jenkins   4096 Sep 16 20:05 compile-lib
-rw-r--r--   1 jenkins jenkins   5987 Oct 21 00:04 doap_POI.rdf
-rw-r--r--   1 jenkins jenkins   2596 Sep 16 20:05 file-leak-detector.exclude
-rw-r--r--   1 jenkins jenkins   6229 Sep 16 20:05 forrest.properties
-rw-r--r--   1 jenkins jenkins     53 Sep 16 20:05 .gitattributes
-rw-r--r--   1 jenkins jenkins    493 Sep 16 20:05 .gitignore
drwxr-xr-x   3 jenkins jenkins   4096 Sep 16 20:05 gradle
-rwxr-xr-x   1 jenkins jenkins   5917 Oct 26 08:03 gradlew
-rw-r--r--   1 jenkins jenkins   2842 Oct 26 08:03 gradlew.bat
drwxr-xr-x   2 jenkins jenkins   4096 Oct 26 08:03 jenkins
-rw-r--r--   1 jenkins jenkins 166411 Sep 16 20:05 KEYS
drwxr-xr-x   2 jenkins jenkins   4096 Sep 16 20:03 legal
drwxr-xr-x   2 jenkins jenkins   4096 Sep 16 20:05 lib
drwxr-xr-x   2 jenkins jenkins   4096 Sep 16 20:05 maven
drwxr-xr-x   2 jenkins jenkins   4096 Sep 16 20:05 ooxml-lib
drwxr-xr-x   4 jenkins jenkins   4096 Oct 26 08:03 osgi
-rw-r--r--   1 jenkins jenkins   4813 Sep 16 20:05 patch.xml
-rw-r--r--   1 jenkins jenkins    426 Sep 16 20:03 .project
-rw-r--r--   1 jenkins jenkins   4280 Sep 16 20:05 README.rst
drwxr-xr-x  20 jenkins jenkins   4096 Sep 17 01:54 .repository
drwxr-xr-x   2 jenkins jenkins   4096 Sep 16 20:03 .settings
-rw-r--r--   1 jenkins jenkins    556 Sep 16 20:05 settings.gradle
drwxr-xr-x  10 jenkins jenkins   4096 Oct 16 00:04 sonar
drwxr-xr-x  15 jenkins jenkins   4096 Sep 16 20:05 src
drwxr-xr-x   4 jenkins jenkins   4096 Oct 26 08:04 .svn
drwxr-xr-x  14 jenkins jenkins   4096 Sep 16 20:04 test-data
-rw-r--r--   1 jenkins jenkins    136 Sep 16 20:04 .travis.yml
+ echo which ant
which ant
+ which ant
/usr/bin/ant
+ ant -version
Apache Ant(TM) version 1.9.6 compiled on July 20 2018
+ echo '<project default="test"><target name="test"><echo>Java ${ant.java.version}/${java.version}</echo><exec executable="javac"><arg value="-version"/></exec></target></project>'
+ ant -f build.javacheck.xml -v
Apache Ant(TM) version 1.9.6 compiled on July 20 2018
Buildfile: <https://builds.apache.org/job/POI-DSL-Maven/ws/build.javacheck.xml>
Detected Java version: 1.8 in: /usr/local/asfpackages/java/jdk1.8.0_191/jre
Detected OS: Linux
parsing buildfile <https://builds.apache.org/job/POI-DSL-Maven/ws/build.javacheck.xml> with URI = <https://builds.apache.org/job/POI-DSL-Maven/ws/build.javacheck.xml>
Project base dir set to: <https://builds.apache.org/job/POI-DSL-Maven/ws/>
Build sequence for target(s) `test' is [test]
Complete build sequence is [test, ]

test:
parsing buildfile jar:file:/usr/share/ant/lib/ant.jar!/org/apache/tools/ant/antlib.xml with URI = jar:file:/usr/share/ant/lib/ant.jar!/org/apache/tools/ant/antlib.xml from a zip file
     [echo] Java 1.8/1.8.0_191
     [exec] Current OS is Linux
     [exec] Executing 'javac' with arguments:
     [exec] '-version'
     [exec]
     [exec] The ' characters around the executable and arguments are
     [exec] not part of the command.
     [exec] javac 1.8.0_191

BUILD SUCCESSFUL
Total time: 0 seconds
+ exit 0
[POI-DSL-Maven] $ mvn -f sonar/pom.xml -Dmaven.repo.local=<https://builds.apache.org/job/POI-DSL-Maven/ws/.repository> clean
FATAL: command execution failed
java.io.IOException: error=2, No such file or directory
        at java.lang.UNIXProcess.forkAndExec(Native Method)
        at java.lang.UNIXProcess.<init>(UNIXProcess.java:247)
        at java.lang.ProcessImpl.start(ProcessImpl.java:134)
        at java.lang.ProcessBuilder.start(ProcessBuilder.java:1029)
Also:   hudson.remoting.Channel$CallSiteStackTrace: Remote call to H43
                at hudson.remoting.Channel.attachCallSiteStackTrace(Channel.java:1743)
                at hudson.remoting.UserRequest$ExceptionResponse.retrieve(UserRequest.java:357)
                at hudson.remoting.Channel.call(Channel.java:957)
                at hudson.Launcher$RemoteLauncher.launch(Launcher.java:1060)
                at hudson.Launcher$ProcStarter.start(Launcher.java:455)
                at hudson.Launcher$ProcStarter.join(Launcher.java:466)
                at hudson.tasks.Maven.perform(Maven.java:368)
                at hudson.tasks.BuildStepMonitor$1.perform(BuildStepMonitor.java:20)
                at hudson.model.AbstractBuild$AbstractBuildExecution.perform(AbstractBuild.java:741)
                at hudson.model.Build$BuildExecution.build(Build.java:206)
                at hudson.model.Build$BuildExecution.doRun(Build.java:163)
                at hudson.model.AbstractBuild$AbstractBuildExecution.run(AbstractBuild.java:504)
                at hudson.model.Run.execute(Run.java:1815)
                at hudson.model.FreeStyleBuild.run(FreeStyleBuild.java:43)
                at hudson.model.ResourceController.execute(ResourceController.java:97)
                at hudson.model.Executor.run(Executor.java:429)
Caused: java.io.IOException: Cannot run program "mvn" (in directory "<https://builds.apache.org/job/POI-DSL-Maven/ws/")>: error=2, No such file or directory
        at java.lang.ProcessBuilder.start(ProcessBuilder.java:1048)
        at hudson.Proc$LocalProc.<init>(Proc.java:250)
        at hudson.Proc$LocalProc.<init>(Proc.java:219)
        at hudson.Launcher$LocalLauncher.launch(Launcher.java:937)
        at hudson.Launcher$ProcStarter.start(Launcher.java:455)
        at hudson.Launcher$RemoteLaunchCallable.call(Launcher.java:1319)
        at hudson.Launcher$RemoteLaunchCallable.call(Launcher.java:1272)
        at hudson.remoting.UserRequest.perform(UserRequest.java:212)
        at hudson.remoting.UserRequest.perform(UserRequest.java:54)
        at hudson.remoting.Request$2.run(Request.java:369)
        at hudson.remoting.InterceptingExecutorService$1.call(InterceptingExecutorService.java:72)
        at java.util.concurrent.FutureTask.run(FutureTask.java:266)
        at java.util.concurrent.ThreadPoolExecutor.runWorker(ThreadPoolExecutor.java:1142)
        at java.util.concurrent.ThreadPoolExecutor$Worker.run(ThreadPoolExecutor.java:617)
        at java.lang.Thread.run(Thread.java:748)
Build step 'Invoke top-level Maven targets' marked build as failure
Recording test results
ERROR: Step ?Publish JUnit test result report? failed: Test reports were found but none of them are new. Did leafNodes run?
For example, <https://builds.apache.org/job/POI-DSL-Maven/ws/sonar/excelant/target/surefire-reports/TEST-org.apache.poi.ss.examples.formula.TestExcelAntUserDefinedFunction.xml> is 12 days old


---------------------------------------------------------------------
To unsubscribe, e-mail: [hidden email]
For additional commands, e-mail: [hidden email]

Reply | Threaded
Open this post in threaded view
|

Build failed in Jenkins: POI-DSL-Maven #940

Apache Jenkins Server
See <https://builds.apache.org/job/POI-DSL-Maven/940/display/redirect>

Changes:


------------------------------------------
Started by user centic
Running as SYSTEM
[EnvInject] - Loading node environment variables.
[EnvInject] - Preparing an environment for the build.
[EnvInject] - Keeping Jenkins system variables.
[EnvInject] - Keeping Jenkins build variables.
[EnvInject] - Injecting as environment variables the properties content
LANG=en_US.UTF-8
FORREST_HOME=/home/jenkins/tools/forrest/latest

[EnvInject] - Variables injected successfully.
[EnvInject] - Injecting contributions.
Building remotely on H43 (ubuntu xenial) in workspace <https://builds.apache.org/job/POI-DSL-Maven/ws/>
[WS-CLEANUP] Deleting project workspace...
[WS-CLEANUP] Done
Updating https://svn.apache.org/repos/asf/poi/trunk at revision '2019-10-26T18:32:24.917 +0000'
U         jenkins/create_jobs.groovy

<-- Got one external: forrest.properties, svn url: https://svn.apache.org/repos/asf/poi/site/forrest.properties -->
Fetching 'https://svn.apache.org/repos/asf/poi/site/forrest.properties' at -1 into '<https://builds.apache.org/job/POI-DSL-Maven/ws/forrest.properties'>
At revision 1869011


<-- Got one external: documentation, svn url: https://svn.apache.org/repos/asf/poi/site/src/documentation -->
Fetching 'https://svn.apache.org/repos/asf/poi/site/src/documentation' at -1 into '<https://builds.apache.org/job/POI-DSL-Maven/ws/src/documentation'>
At revision 1869011

At revision 1869011

org.tmatesoft.svn.core.SVNException: svn: E130003: Parser configuration problem: namespace reporting is not enabled
        at org.tmatesoft.svn.core.internal.wc.SVNErrorManager.error(SVNErrorManager.java:70)
        at org.tmatesoft.svn.core.internal.wc.SVNErrorManager.error(SVNErrorManager.java:57)
        at org.tmatesoft.svn.core.internal.io.dav.http.HTTPConnection.request(HTTPConnection.java:760)
        at org.tmatesoft.svn.core.internal.io.dav.http.HTTPConnection.request(HTTPConnection.java:352)
        at org.tmatesoft.svn.core.internal.io.dav.http.HTTPConnection.request(HTTPConnection.java:340)
        at org.tmatesoft.svn.core.internal.io.dav.DAVConnection.performHttpRequest(DAVConnection.java:910)
        at org.tmatesoft.svn.core.internal.io.dav.DAVConnection.doReport(DAVConnection.java:363)
        at org.tmatesoft.svn.core.internal.io.dav.DAVConnection.doReport(DAVConnection.java:353)
        at org.tmatesoft.svn.core.internal.io.dav.DAVRepository.logImpl(DAVRepository.java:1003)
        at org.tmatesoft.svn.core.io.SVNRepository.log(SVNRepository.java:1041)
        at org.tmatesoft.svn.core.internal.wc2.remote.SvnRemoteLog.run(SvnRemoteLog.java:181)
        at org.tmatesoft.svn.core.internal.wc2.remote.SvnRemoteLog.run(SvnRemoteLog.java:35)
        at org.tmatesoft.svn.core.internal.wc2.SvnOperationRunner.run(SvnOperationRunner.java:21)
        at org.tmatesoft.svn.core.wc2.SvnOperationFactory.run(SvnOperationFactory.java:1239)
        at org.tmatesoft.svn.core.wc2.SvnOperation.run(SvnOperation.java:294)
        at org.tmatesoft.svn.core.wc.SVNLogClient.doLog(SVNLogClient.java:968)
        at org.tmatesoft.svn.core.wc.SVNLogClient.doLog(SVNLogClient.java:873)
        at hudson.scm.SubversionChangeLogBuilder.buildModule(SubversionChangeLogBuilder.java:190)
Caused: hudson.util.IOException2: revision check failed on https://svn.apache.org/repos/asf/poi/trunk
        at hudson.scm.SubversionChangeLogBuilder.buildModule(SubversionChangeLogBuilder.java:204)
        at hudson.scm.SubversionChangeLogBuilder.run(SubversionChangeLogBuilder.java:124)
        at hudson.scm.SubversionSCM.calcChangeLog(SubversionSCM.java:757)
        at hudson.scm.SubversionSCM.checkout(SubversionSCM.java:898)
        at hudson.scm.SCM.checkout(SCM.java:504)
        at hudson.model.AbstractProject.checkout(AbstractProject.java:1208)
        at hudson.model.AbstractBuild$AbstractBuildExecution.defaultCheckout(AbstractBuild.java:574)
        at jenkins.scm.SCMCheckoutStrategy.checkout(SCMCheckoutStrategy.java:86)
        at hudson.model.AbstractBuild$AbstractBuildExecution.run(AbstractBuild.java:499)
        at hudson.model.Run.execute(Run.java:1815)
        at hudson.model.FreeStyleBuild.run(FreeStyleBuild.java:43)
        at hudson.model.ResourceController.execute(ResourceController.java:97)
        at hudson.model.Executor.run(Executor.java:429)
Retrying after 10 seconds
Updating https://svn.apache.org/repos/asf/poi/trunk at revision '2019-10-26T18:32:24.917 +0000'

<-- Got one external: forrest.properties, svn url: https://svn.apache.org/repos/asf/poi/site/forrest.properties -->
Fetching 'https://svn.apache.org/repos/asf/poi/site/forrest.properties' at -1 into '<https://builds.apache.org/job/POI-DSL-Maven/ws/forrest.properties'>
At revision 1869011


<-- Got one external: documentation, svn url: https://svn.apache.org/repos/asf/poi/site/src/documentation -->
Fetching 'https://svn.apache.org/repos/asf/poi/site/src/documentation' at -1 into '<https://builds.apache.org/job/POI-DSL-Maven/ws/src/documentation'>
At revision 1869011

At revision 1869011

org.tmatesoft.svn.core.SVNException: svn: E130003: Parser configuration problem: namespace reporting is not enabled
        at org.tmatesoft.svn.core.internal.wc.SVNErrorManager.error(SVNErrorManager.java:70)
        at org.tmatesoft.svn.core.internal.wc.SVNErrorManager.error(SVNErrorManager.java:57)
        at org.tmatesoft.svn.core.internal.io.dav.http.HTTPConnection.request(HTTPConnection.java:760)
        at org.tmatesoft.svn.core.internal.io.dav.http.HTTPConnection.request(HTTPConnection.java:352)
        at org.tmatesoft.svn.core.internal.io.dav.http.HTTPConnection.request(HTTPConnection.java:340)
        at org.tmatesoft.svn.core.internal.io.dav.DAVConnection.performHttpRequest(DAVConnection.java:910)
        at org.tmatesoft.svn.core.internal.io.dav.DAVConnection.doReport(DAVConnection.java:363)
        at org.tmatesoft.svn.core.internal.io.dav.DAVConnection.doReport(DAVConnection.java:353)
        at org.tmatesoft.svn.core.internal.io.dav.DAVRepository.logImpl(DAVRepository.java:1003)
        at org.tmatesoft.svn.core.io.SVNRepository.log(SVNRepository.java:1041)
        at org.tmatesoft.svn.core.internal.wc2.remote.SvnRemoteLog.run(SvnRemoteLog.java:181)
        at org.tmatesoft.svn.core.internal.wc2.remote.SvnRemoteLog.run(SvnRemoteLog.java:35)
        at org.tmatesoft.svn.core.internal.wc2.SvnOperationRunner.run(SvnOperationRunner.java:21)
        at org.tmatesoft.svn.core.wc2.SvnOperationFactory.run(SvnOperationFactory.java:1239)
        at org.tmatesoft.svn.core.wc2.SvnOperation.run(SvnOperation.java:294)
        at org.tmatesoft.svn.core.wc.SVNLogClient.doLog(SVNLogClient.java:968)
        at org.tmatesoft.svn.core.wc.SVNLogClient.doLog(SVNLogClient.java:873)
        at hudson.scm.SubversionChangeLogBuilder.buildModule(SubversionChangeLogBuilder.java:190)
Caused: hudson.util.IOException2: revision check failed on https://svn.apache.org/repos/asf/poi/trunk
        at hudson.scm.SubversionChangeLogBuilder.buildModule(SubversionChangeLogBuilder.java:204)
        at hudson.scm.SubversionChangeLogBuilder.run(SubversionChangeLogBuilder.java:124)
        at hudson.scm.SubversionSCM.calcChangeLog(SubversionSCM.java:757)
        at hudson.scm.SubversionSCM.checkout(SubversionSCM.java:898)
        at hudson.scm.SCM.checkout(SCM.java:504)
        at hudson.model.AbstractProject.checkout(AbstractProject.java:1208)
        at hudson.model.AbstractBuild$AbstractBuildExecution.defaultCheckout(AbstractBuild.java:574)
        at jenkins.scm.SCMCheckoutStrategy.checkout(SCMCheckoutStrategy.java:86)
        at hudson.model.AbstractBuild$AbstractBuildExecution.run(AbstractBuild.java:499)
        at hudson.model.Run.execute(Run.java:1815)
        at hudson.model.FreeStyleBuild.run(FreeStyleBuild.java:43)
        at hudson.model.ResourceController.execute(ResourceController.java:97)
        at hudson.model.Executor.run(Executor.java:429)
Retrying after 10 seconds
Updating https://svn.apache.org/repos/asf/poi/trunk at revision '2019-10-26T18:32:24.917 +0000'

<-- Got one external: forrest.properties, svn url: https://svn.apache.org/repos/asf/poi/site/forrest.properties -->
Fetching 'https://svn.apache.org/repos/asf/poi/site/forrest.properties' at -1 into '<https://builds.apache.org/job/POI-DSL-Maven/ws/forrest.properties'>
At revision 1869011


<-- Got one external: documentation, svn url: https://svn.apache.org/repos/asf/poi/site/src/documentation -->
Fetching 'https://svn.apache.org/repos/asf/poi/site/src/documentation' at -1 into '<https://builds.apache.org/job/POI-DSL-Maven/ws/src/documentation'>
At revision 1869011

At revision 1869011

org.tmatesoft.svn.core.SVNException: svn: E130003: Parser configuration problem: namespace reporting is not enabled
        at org.tmatesoft.svn.core.internal.wc.SVNErrorManager.error(SVNErrorManager.java:70)
        at org.tmatesoft.svn.core.internal.wc.SVNErrorManager.error(SVNErrorManager.java:57)
        at org.tmatesoft.svn.core.internal.io.dav.http.HTTPConnection.request(HTTPConnection.java:760)
        at org.tmatesoft.svn.core.internal.io.dav.http.HTTPConnection.request(HTTPConnection.java:352)
        at org.tmatesoft.svn.core.internal.io.dav.http.HTTPConnection.request(HTTPConnection.java:340)
        at org.tmatesoft.svn.core.internal.io.dav.DAVConnection.performHttpRequest(DAVConnection.java:910)
        at org.tmatesoft.svn.core.internal.io.dav.DAVConnection.doReport(DAVConnection.java:363)
        at org.tmatesoft.svn.core.internal.io.dav.DAVConnection.doReport(DAVConnection.java:353)
        at org.tmatesoft.svn.core.internal.io.dav.DAVRepository.logImpl(DAVRepository.java:1003)
        at org.tmatesoft.svn.core.io.SVNRepository.log(SVNRepository.java:1041)
        at org.tmatesoft.svn.core.internal.wc2.remote.SvnRemoteLog.run(SvnRemoteLog.java:181)
        at org.tmatesoft.svn.core.internal.wc2.remote.SvnRemoteLog.run(SvnRemoteLog.java:35)
        at org.tmatesoft.svn.core.internal.wc2.SvnOperationRunner.run(SvnOperationRunner.java:21)
        at org.tmatesoft.svn.core.wc2.SvnOperationFactory.run(SvnOperationFactory.java:1239)
        at org.tmatesoft.svn.core.wc2.SvnOperation.run(SvnOperation.java:294)
        at org.tmatesoft.svn.core.wc.SVNLogClient.doLog(SVNLogClient.java:968)
        at org.tmatesoft.svn.core.wc.SVNLogClient.doLog(SVNLogClient.java:873)
        at hudson.scm.SubversionChangeLogBuilder.buildModule(SubversionChangeLogBuilder.java:190)
Caused: hudson.util.IOException2: revision check failed on https://svn.apache.org/repos/asf/poi/trunk
        at hudson.scm.SubversionChangeLogBuilder.buildModule(SubversionChangeLogBuilder.java:204)
        at hudson.scm.SubversionChangeLogBuilder.run(SubversionChangeLogBuilder.java:124)
        at hudson.scm.SubversionSCM.calcChangeLog(SubversionSCM.java:757)
        at hudson.scm.SubversionSCM.checkout(SubversionSCM.java:898)
        at hudson.scm.SCM.checkout(SCM.java:504)
        at hudson.model.AbstractProject.checkout(AbstractProject.java:1208)
        at hudson.model.AbstractBuild$AbstractBuildExecution.defaultCheckout(AbstractBuild.java:574)
        at jenkins.scm.SCMCheckoutStrategy.checkout(SCMCheckoutStrategy.java:86)
        at hudson.model.AbstractBuild$AbstractBuildExecution.run(AbstractBuild.java:499)
        at hudson.model.Run.execute(Run.java:1815)
        at hudson.model.FreeStyleBuild.run(FreeStyleBuild.java:43)
        at hudson.model.ResourceController.execute(ResourceController.java:97)
        at hudson.model.Executor.run(Executor.java:429)
Retrying after 10 seconds
Updating https://svn.apache.org/repos/asf/poi/trunk at revision '2019-10-26T18:32:24.917 +0000'

<-- Got one external: forrest.properties, svn url: https://svn.apache.org/repos/asf/poi/site/forrest.properties -->
Fetching 'https://svn.apache.org/repos/asf/poi/site/forrest.properties' at -1 into '<https://builds.apache.org/job/POI-DSL-Maven/ws/forrest.properties'>
At revision 1869011


<-- Got one external: documentation, svn url: https://svn.apache.org/repos/asf/poi/site/src/documentation -->
Fetching 'https://svn.apache.org/repos/asf/poi/site/src/documentation' at -1 into '<https://builds.apache.org/job/POI-DSL-Maven/ws/src/documentation'>
At revision 1869011

At revision 1869011

org.tmatesoft.svn.core.SVNException: svn: E130003: Parser configuration problem: namespace reporting is not enabled
        at org.tmatesoft.svn.core.internal.wc.SVNErrorManager.error(SVNErrorManager.java:70)
        at org.tmatesoft.svn.core.internal.wc.SVNErrorManager.error(SVNErrorManager.java:57)
        at org.tmatesoft.svn.core.internal.io.dav.http.HTTPConnection.request(HTTPConnection.java:760)
        at org.tmatesoft.svn.core.internal.io.dav.http.HTTPConnection.request(HTTPConnection.java:352)
        at org.tmatesoft.svn.core.internal.io.dav.http.HTTPConnection.request(HTTPConnection.java:340)
        at org.tmatesoft.svn.core.internal.io.dav.DAVConnection.performHttpRequest(DAVConnection.java:910)
        at org.tmatesoft.svn.core.internal.io.dav.DAVConnection.doReport(DAVConnection.java:363)
        at org.tmatesoft.svn.core.internal.io.dav.DAVConnection.doReport(DAVConnection.java:353)
        at org.tmatesoft.svn.core.internal.io.dav.DAVRepository.logImpl(DAVRepository.java:1003)
        at org.tmatesoft.svn.core.io.SVNRepository.log(SVNRepository.java:1041)
        at org.tmatesoft.svn.core.internal.wc2.remote.SvnRemoteLog.run(SvnRemoteLog.java:181)
        at org.tmatesoft.svn.core.internal.wc2.remote.SvnRemoteLog.run(SvnRemoteLog.java:35)
        at org.tmatesoft.svn.core.internal.wc2.SvnOperationRunner.run(SvnOperationRunner.java:21)
        at org.tmatesoft.svn.core.wc2.SvnOperationFactory.run(SvnOperationFactory.java:1239)
        at org.tmatesoft.svn.core.wc2.SvnOperation.run(SvnOperation.java:294)
        at org.tmatesoft.svn.core.wc.SVNLogClient.doLog(SVNLogClient.java:968)
        at org.tmatesoft.svn.core.wc.SVNLogClient.doLog(SVNLogClient.java:873)
        at hudson.scm.SubversionChangeLogBuilder.buildModule(SubversionChangeLogBuilder.java:190)
Caused: hudson.util.IOException2: revision check failed on https://svn.apache.org/repos/asf/poi/trunk
        at hudson.scm.SubversionChangeLogBuilder.buildModule(SubversionChangeLogBuilder.java:204)
        at hudson.scm.SubversionChangeLogBuilder.run(SubversionChangeLogBuilder.java:124)
        at hudson.scm.SubversionSCM.calcChangeLog(SubversionSCM.java:757)
        at hudson.scm.SubversionSCM.checkout(SubversionSCM.java:898)
        at hudson.scm.SCM.checkout(SCM.java:504)
        at hudson.model.AbstractProject.checkout(AbstractProject.java:1208)
        at hudson.model.AbstractBuild$AbstractBuildExecution.defaultCheckout(AbstractBuild.java:574)
        at jenkins.scm.SCMCheckoutStrategy.checkout(SCMCheckoutStrategy.java:86)
        at hudson.model.AbstractBuild$AbstractBuildExecution.run(AbstractBuild.java:499)
        at hudson.model.Run.execute(Run.java:1815)
        at hudson.model.FreeStyleBuild.run(FreeStyleBuild.java:43)
        at hudson.model.ResourceController.execute(ResourceController.java:97)
        at hudson.model.Executor.run(Executor.java:429)
Recording test results
ERROR: Step ?Publish JUnit test result report? failed: Test reports were found but none of them are new. Did leafNodes run?
For example, <https://builds.apache.org/job/POI-DSL-Maven/ws/sonar/excelant/target/surefire-reports/TEST-org.apache.poi.ss.examples.formula.TestExcelAntUserDefinedFunction.xml> is 13 days old


---------------------------------------------------------------------
To unsubscribe, e-mail: [hidden email]
For additional commands, e-mail: [hidden email]

Reply | Threaded
Open this post in threaded view
|

Jenkins build is back to normal : POI-DSL-Maven #941

Apache Jenkins Server
See <https://builds.apache.org/job/POI-DSL-Maven/941/display/redirect>


---------------------------------------------------------------------
To unsubscribe, e-mail: [hidden email]
For additional commands, e-mail: [hidden email]