Build failed in Jenkins: POI-DSL-Maven #908

classic Classic list List threaded Threaded
2 messages Options
Reply | Threaded
Open this post in threaded view
|

Build failed in Jenkins: POI-DSL-Maven #908

Apache Jenkins Server
See <https://builds.apache.org/job/POI-DSL-Maven/908/display/redirect?page=changes>

Changes:

[centic] Adjust reproducer test-case for bug 59322 to not print to stdout and close resources

[centic] Fix bug 59322: NullPointerException when converting a certain Word document to HTML

------------------------------------------
[...truncated 90.46 KB...]
Running org.apache.poi.ss.formula.functions.TestMid
Tests run: 4, Failures: 0, Errors: 0, Skipped: 0, Time elapsed: 0 sec - in org.apache.poi.ss.formula.functions.TestMid
Running org.apache.poi.ss.formula.functions.TestTime
Tests run: 2, Failures: 0, Errors: 0, Skipped: 0, Time elapsed: 0 sec - in org.apache.poi.ss.formula.functions.TestTime
Running org.apache.poi.ss.formula.functions.TestOct2Dec
Tests run: 2, Failures: 0, Errors: 0, Skipped: 0, Time elapsed: 0 sec - in org.apache.poi.ss.formula.functions.TestOct2Dec
Running org.apache.poi.ss.formula.functions.TestWeekNumFunctionsFromSpreadsheet2013
Tests run: 7, Failures: 0, Errors: 0, Skipped: 0, Time elapsed: 0.001 sec - in org.apache.poi.ss.formula.functions.TestWeekNumFunctionsFromSpreadsheet2013
Running org.apache.poi.ss.formula.functions.TestEDate
Tests run: 9, Failures: 0, Errors: 0, Skipped: 0, Time elapsed: 0 sec - in org.apache.poi.ss.formula.functions.TestEDate
Running org.apache.poi.ss.formula.functions.TestPPMT
Tests run: 1, Failures: 0, Errors: 0, Skipped: 0, Time elapsed: 0 sec - in org.apache.poi.ss.formula.functions.TestPPMT
Running org.apache.poi.ss.formula.functions.TestIndex
Tests run: 9, Failures: 0, Errors: 0, Skipped: 0, Time elapsed: 0.002 sec - in org.apache.poi.ss.formula.functions.TestIndex
Running org.apache.poi.ss.formula.functions.TestImRealFunctionsFromSpreadsheet
Tests run: 7, Failures: 0, Errors: 0, Skipped: 0, Time elapsed: 0 sec - in org.apache.poi.ss.formula.functions.TestImRealFunctionsFromSpreadsheet
Running org.apache.poi.ss.formula.functions.TestRank
Tests run: 1, Failures: 0, Errors: 0, Skipped: 0, Time elapsed: 0.002 sec - in org.apache.poi.ss.formula.functions.TestRank
Running org.apache.poi.ss.formula.functions.TestText
Tests run: 4, Failures: 0, Errors: 0, Skipped: 0, Time elapsed: 0 sec - in org.apache.poi.ss.formula.functions.TestText
Running org.apache.poi.ss.formula.functions.TestMirr
Tests run: 4, Failures: 0, Errors: 0, Skipped: 0, Time elapsed: 0.001 sec - in org.apache.poi.ss.formula.functions.TestMirr
Running org.apache.poi.ss.formula.functions.TestCalendarFieldFunction
Tests run: 4, Failures: 0, Errors: 0, Skipped: 0, Time elapsed: 0.002 sec - in org.apache.poi.ss.formula.functions.TestCalendarFieldFunction
Running org.apache.poi.ss.formula.functions.TestSumifs
Tests run: 7, Failures: 0, Errors: 0, Skipped: 0, Time elapsed: 0.003 sec - in org.apache.poi.ss.formula.functions.TestSumifs
Running org.apache.poi.ss.formula.functions.TestLen
Tests run: 3, Failures: 0, Errors: 0, Skipped: 0, Time elapsed: 0 sec - in org.apache.poi.ss.formula.functions.TestLen
Running org.apache.poi.ss.formula.functions.TestAverage
Tests run: 3, Failures: 0, Errors: 0, Skipped: 0, Time elapsed: 0 sec - in org.apache.poi.ss.formula.functions.TestAverage
Running org.apache.poi.ss.formula.functions.TestIndirect
Tests run: 3, Failures: 0, Errors: 0, Skipped: 0, Time elapsed: 0.002 sec - in org.apache.poi.ss.formula.functions.TestIndirect
Running org.apache.poi.ss.formula.functions.TestDelta
Tests run: 2, Failures: 0, Errors: 0, Skipped: 0, Time elapsed: 0 sec - in org.apache.poi.ss.formula.functions.TestDelta
Running org.apache.poi.ss.formula.functions.TestFactDoubleFunctionsFromSpreadsheet
Tests run: 8, Failures: 0, Errors: 0, Skipped: 0, Time elapsed: 0.001 sec - in org.apache.poi.ss.formula.functions.TestFactDoubleFunctionsFromSpreadsheet
Running org.apache.poi.ss.formula.functions.TestIrr
Tests run: 3, Failures: 0, Errors: 0, Skipped: 0, Time elapsed: 0.001 sec - in org.apache.poi.ss.formula.functions.TestIrr
Running org.apache.poi.ss.formula.functions.TestBin2Dec
Tests run: 5, Failures: 0, Errors: 0, Skipped: 0, Time elapsed: 0.001 sec - in org.apache.poi.ss.formula.functions.TestBin2Dec
Running org.apache.poi.ss.formula.functions.TestDec2Hex
Tests run: 12, Failures: 0, Errors: 0, Skipped: 0, Time elapsed: 0.036 sec - in org.apache.poi.ss.formula.functions.TestDec2Hex
Running org.apache.poi.ss.formula.functions.TestSumif
Tests run: 3, Failures: 0, Errors: 0, Skipped: 0, Time elapsed: 0 sec - in org.apache.poi.ss.formula.functions.TestSumif
Running org.apache.poi.ss.formula.functions.TestCode
Tests run: 2, Failures: 0, Errors: 0, Skipped: 0, Time elapsed: 0 sec - in org.apache.poi.ss.formula.functions.TestCode
Running org.apache.poi.ss.formula.functions.TestAreas
Tests run: 1, Failures: 0, Errors: 0, Skipped: 0, Time elapsed: 0 sec - in org.apache.poi.ss.formula.functions.TestAreas
Running org.apache.poi.ss.formula.functions.TestTrendFunctionsFromSpreadsheet
Tests run: 41, Failures: 0, Errors: 0, Skipped: 0, Time elapsed: 0.029 sec - in org.apache.poi.ss.formula.functions.TestTrendFunctionsFromSpreadsheet
Running org.apache.poi.ss.formula.functions.TestCodeFunctionsFromSpreadsheet
Tests run: 4, Failures: 0, Errors: 0, Skipped: 0, Time elapsed: 0 sec - in org.apache.poi.ss.formula.functions.TestCodeFunctionsFromSpreadsheet
Running org.apache.poi.ss.formula.functions.TestTrim
Tests run: 3, Failures: 0, Errors: 0, Skipped: 0, Time elapsed: 0 sec - in org.apache.poi.ss.formula.functions.TestTrim
Running org.apache.poi.ss.formula.functions.TestLeftRight
Tests run: 2, Failures: 0, Errors: 0, Skipped: 0, Time elapsed: 0 sec - in org.apache.poi.ss.formula.functions.TestLeftRight
Running org.apache.poi.ss.formula.functions.TestQuotientFunctionsFromSpreadsheet
Tests run: 8, Failures: 0, Errors: 0, Skipped: 0, Time elapsed: 0 sec - in org.apache.poi.ss.formula.functions.TestQuotientFunctionsFromSpreadsheet
Running org.apache.poi.ss.formula.functions.TestComplex
Tests run: 2, Failures: 0, Errors: 0, Skipped: 0, Time elapsed: 0 sec - in org.apache.poi.ss.formula.functions.TestComplex
Running org.apache.poi.ss.formula.functions.TestFixedFunctionsFromSpreadsheet
Tests run: 20, Failures: 0, Errors: 0, Skipped: 0, Time elapsed: 0.004 sec - in org.apache.poi.ss.formula.functions.TestFixedFunctionsFromSpreadsheet
Running org.apache.poi.ss.formula.functions.TestTFunc
Tests run: 5, Failures: 0, Errors: 0, Skipped: 0, Time elapsed: 0 sec - in org.apache.poi.ss.formula.functions.TestTFunc
Running org.apache.poi.ss.formula.functions.TestFind
Tests run: 1, Failures: 0, Errors: 0, Skipped: 0, Time elapsed: 0 sec - in org.apache.poi.ss.formula.functions.TestFind
Running org.apache.poi.ss.formula.functions.TestRowCol
Tests run: 4, Failures: 0, Errors: 0, Skipped: 0, Time elapsed: 0 sec - in org.apache.poi.ss.formula.functions.TestRowCol
Running org.apache.poi.ss.formula.functions.TestAddress
Tests run: 1, Failures: 0, Errors: 0, Skipped: 0, Time elapsed: 0 sec - in org.apache.poi.ss.formula.functions.TestAddress
Running org.apache.poi.ss.formula.functions.TestReptFunctionsFromSpreadsheet
Tests run: 5, Failures: 0, Errors: 0, Skipped: 0, Time elapsed: 0.003 sec - in org.apache.poi.ss.formula.functions.TestReptFunctionsFromSpreadsheet
Running org.apache.poi.ss.formula.functions.TestXYNumericFunction
Tests run: 3, Failures: 0, Errors: 0, Skipped: 0, Time elapsed: 0.001 sec - in org.apache.poi.ss.formula.functions.TestXYNumericFunction
Running org.apache.poi.ss.formula.functions.TestIndirectFunctionFromSpreadsheet
Tests run: 11, Failures: 0, Errors: 0, Skipped: 0, Time elapsed: 0.002 sec - in org.apache.poi.ss.formula.functions.TestIndirectFunctionFromSpreadsheet
Running org.apache.poi.ss.formula.functions.TestLogicalFunction
Tests run: 2, Failures: 0, Errors: 0, Skipped: 0, Time elapsed: 0.001 sec - in org.apache.poi.ss.formula.functions.TestLogicalFunction
Running org.apache.poi.ss.formula.functions.TestMathX
Tests run: 23, Failures: 0, Errors: 0, Skipped: 0, Time elapsed: 0.007 sec - in org.apache.poi.ss.formula.functions.TestMathX
Running org.apache.poi.ss.formula.functions.TestDStarFunctionsFromSpreadsheet
Tests run: 12, Failures: 0, Errors: 0, Skipped: 0, Time elapsed: 0.002 sec - in org.apache.poi.ss.formula.functions.TestDStarFunctionsFromSpreadsheet
Running org.apache.poi.ss.formula.functions.TestQuotient
Tests run: 2, Failures: 0, Errors: 0, Skipped: 0, Time elapsed: 0 sec - in org.apache.poi.ss.formula.functions.TestQuotient
Running org.apache.poi.ss.formula.functions.TestPmt
Tests run: 2, Failures: 0, Errors: 0, Skipped: 0, Time elapsed: 0 sec - in org.apache.poi.ss.formula.functions.TestPmt
Running org.apache.poi.ss.formula.functions.TestComplexFunctionsFromSpreadsheet
Tests run: 12, Failures: 0, Errors: 0, Skipped: 0, Time elapsed: 0.001 sec - in org.apache.poi.ss.formula.functions.TestComplexFunctionsFromSpreadsheet
Running org.apache.poi.ss.formula.functions.TestDays360
Tests run: 2, Failures: 0, Errors: 0, Skipped: 0, Time elapsed: 0.013 sec - in org.apache.poi.ss.formula.functions.TestDays360
Running org.apache.poi.ss.formula.functions.TestSubtotal
Tests run: 11, Failures: 0, Errors: 0, Skipped: 0, Time elapsed: 0.012 sec - in org.apache.poi.ss.formula.functions.TestSubtotal
Running org.apache.poi.ss.formula.functions.TestDec2Bin
Tests run: 15, Failures: 0, Errors: 0, Skipped: 0, Time elapsed: 0.037 sec - in org.apache.poi.ss.formula.functions.TestDec2Bin
Running org.apache.poi.ss.formula.functions.TestIFFunctionFromSpreadsheet
Tests run: 41, Failures: 0, Errors: 0, Skipped: 0, Time elapsed: 0.006 sec - in org.apache.poi.ss.formula.functions.TestIFFunctionFromSpreadsheet
Running org.apache.poi.ss.formula.functions.TestFixed
Tests run: 2, Failures: 0, Errors: 0, Skipped: 0, Time elapsed: 0.002 sec - in org.apache.poi.ss.formula.functions.TestFixed
Running org.apache.poi.ss.formula.functions.TestProduct
Tests run: 3, Failures: 0, Errors: 0, Skipped: 0, Time elapsed: 0 sec - in org.apache.poi.ss.formula.functions.TestProduct
Running org.apache.poi.ss.formula.functions.TestWeekdayFunc
Tests run: 2, Failures: 0, Errors: 0, Skipped: 0, Time elapsed: 0 sec - in org.apache.poi.ss.formula.functions.TestWeekdayFunc
Running org.apache.poi.ss.formula.functions.TestRomanFunctionsFromSpreadsheet
Tests run: 35, Failures: 0, Errors: 0, Skipped: 0, Time elapsed: 0.003 sec - in org.apache.poi.ss.formula.functions.TestRomanFunctionsFromSpreadsheet
Running org.apache.poi.ss.formula.functions.TestNper
Tests run: 2, Failures: 0, Errors: 0, Skipped: 0, Time elapsed: 0 sec - in org.apache.poi.ss.formula.functions.TestNper
Running org.apache.poi.ss.formula.functions.TestOffset
Tests run: 3, Failures: 0, Errors: 0, Skipped: 0, Time elapsed: 0 sec - in org.apache.poi.ss.formula.functions.TestOffset
Running org.apache.poi.ss.formula.functions.TestRoundFuncs
Tests run: 5, Failures: 0, Errors: 0, Skipped: 1, Time elapsed: 0 sec - in org.apache.poi.ss.formula.functions.TestRoundFuncs
Running org.apache.poi.ss.formula.SheetRangeAndWorkbookIndexFormatterTest
Tests run: 6, Failures: 0, Errors: 0, Skipped: 0, Time elapsed: 0 sec - in org.apache.poi.ss.formula.SheetRangeAndWorkbookIndexFormatterTest
Running org.apache.poi.ss.formula.TestMissingWorkbook
Tests run: 3, Failures: 0, Errors: 0, Skipped: 0, Time elapsed: 0.001 sec - in org.apache.poi.ss.formula.TestMissingWorkbook
Running org.apache.poi.ss.formula.eval.TestFormulaBugs
Tests run: 5, Failures: 0, Errors: 0, Skipped: 0, Time elapsed: 0.002 sec - in org.apache.poi.ss.formula.eval.TestFormulaBugs
Running org.apache.poi.ss.formula.eval.TestMinusZeroResult
Tests run: 4, Failures: 0, Errors: 0, Skipped: 0, Time elapsed: 0 sec - in org.apache.poi.ss.formula.eval.TestMinusZeroResult
Running org.apache.poi.ss.formula.eval.TestMissingArgEval
Tests run: 2, Failures: 0, Errors: 0, Skipped: 0, Time elapsed: 0 sec - in org.apache.poi.ss.formula.eval.TestMissingArgEval
Running org.apache.poi.ss.formula.eval.TestAreaEval
Tests run: 1, Failures: 0, Errors: 0, Skipped: 0, Time elapsed: 0 sec - in org.apache.poi.ss.formula.eval.TestAreaEval
Running org.apache.poi.ss.formula.eval.TestDivideEval
Tests run: 3, Failures: 0, Errors: 0, Skipped: 0, Time elapsed: 0 sec - in org.apache.poi.ss.formula.eval.TestDivideEval
Running org.apache.poi.ss.formula.eval.TestRangeEval
Tests run: 2, Failures: 0, Errors: 0, Skipped: 0, Time elapsed: 0 sec - in org.apache.poi.ss.formula.eval.TestRangeEval
Running org.apache.poi.ss.formula.eval.TestExternalFunction
Tests run: 1, Failures: 0, Errors: 0, Skipped: 0, Time elapsed: 0 sec - in org.apache.poi.ss.formula.eval.TestExternalFunction
Running org.apache.poi.ss.formula.eval.TestPowerEval
Tests run: 6, Failures: 0, Errors: 0, Skipped: 0, Time elapsed: 0 sec - in org.apache.poi.ss.formula.eval.TestPowerEval
Running org.apache.poi.ss.formula.eval.TestMultiSheetEval
Warning - Row 13 has no cell 1, can't figure out test name
Tests run: 1, Failures: 0, Errors: 0, Skipped: 0, Time elapsed: 0.001 sec - in org.apache.poi.ss.formula.eval.TestMultiSheetEval
Running org.apache.poi.ss.formula.eval.TestHSSFCircularReferences
Tests run: 4, Failures: 0, Errors: 0, Skipped: 0, Time elapsed: 0 sec - in org.apache.poi.ss.formula.eval.TestHSSFCircularReferences
Running org.apache.poi.ss.formula.eval.forked.TestForkedEvaluator
Tests run: 2, Failures: 0, Errors: 0, Skipped: 0, Time elapsed: 0.004 sec - in org.apache.poi.ss.formula.eval.forked.TestForkedEvaluator
Running org.apache.poi.ss.formula.eval.TestEqualEval
Tests run: 6, Failures: 0, Errors: 0, Skipped: 0, Time elapsed: 0 sec - in org.apache.poi.ss.formula.eval.TestEqualEval
Running org.apache.poi.ss.formula.eval.TestFormulasFromSpreadsheet
Tests run: 379, Failures: 0, Errors: 0, Skipped: 0, Time elapsed: 0.11 sec - in org.apache.poi.ss.formula.eval.TestFormulasFromSpreadsheet
Running org.apache.poi.ss.formula.eval.TestPercentEval
Tests run: 3, Failures: 0, Errors: 0, Skipped: 0, Time elapsed: 0 sec - in org.apache.poi.ss.formula.eval.TestPercentEval
Running org.apache.poi.ss.formula.eval.TestOperandResolver
Tests run: 6, Failures: 0, Errors: 0, Skipped: 0, Time elapsed: 0 sec - in org.apache.poi.ss.formula.eval.TestOperandResolver
Running org.apache.poi.ss.formula.eval.TestUnaryPlusEval
Tests run: 1, Failures: 0, Errors: 0, Skipped: 0, Time elapsed: 0 sec - in org.apache.poi.ss.formula.eval.TestUnaryPlusEval
Running org.apache.poi.ss.TestSpreadsheetVersion
Tests run: 2, Failures: 0, Errors: 0, Skipped: 0, Time elapsed: 0 sec - in org.apache.poi.ss.TestSpreadsheetVersion
Running org.apache.poi.TestPOIDocumentMain
Tests run: 6, Failures: 0, Errors: 0, Skipped: 0, Time elapsed: 0.001 sec - in org.apache.poi.TestPOIDocumentMain
Running org.apache.poi.TestPOITestCase
Tests run: 10, Failures: 0, Errors: 0, Skipped: 3, Time elapsed: 0.001 sec - in org.apache.poi.TestPOITestCase

Results :

Tests run: 6896, Failures: 0, Errors: 0, Skipped: 809

[INFO]
[INFO] --- maven-jar-plugin:3.0.1:jar (default-jar) @ poi-main ---
[INFO] Building jar: <https://builds.apache.org/job/POI-DSL-Maven/ws/sonar/main/target/poi-main-4.1.1-SNAPSHOT.jar>
[INFO]
[INFO] --- maven-jar-plugin:3.0.1:test-jar (default) @ poi-main ---
[INFO] Building jar: <https://builds.apache.org/job/POI-DSL-Maven/ws/sonar/main/target/poi-main-4.1.1-SNAPSHOT-tests.jar>
[INFO]                                                                        
[INFO] ------------------------------------------------------------------------
[INFO] Building Apache POI Scratchpad package 4.1.1-SNAPSHOT
[INFO] ------------------------------------------------------------------------
[INFO]
[INFO] --- maven-resources-plugin:3.0.1:copy-resources (copy-sources) @ poi-scratchpad ---
[INFO] Using 'UTF-8' encoding to copy filtered resources.
[INFO] Copying 510 resources
[INFO]
[INFO] --- maven-resources-plugin:3.0.1:copy-resources (copy-resources) @ poi-scratchpad ---
[INFO] Using 'UTF-8' encoding to copy filtered resources.
[INFO] Copying 2 resources
[INFO]
[INFO] --- maven-resources-plugin:3.0.1:resources (default-resources) @ poi-scratchpad ---
[INFO] Using 'UTF-8' encoding to copy filtered resources.
[INFO] Copying 2 resources
[INFO]
[INFO] --- maven-compiler-plugin:3.5.1:compile (default-compile) @ poi-scratchpad ---
[INFO] Changes detected - recompiling the module!
[INFO] Compiling 510 source files to <https://builds.apache.org/job/POI-DSL-Maven/ws/sonar/scratchpad/target/classes>
[INFO] <https://builds.apache.org/job/POI-DSL-Maven/ws/sonar/scratchpad/src/main/java/org/apache/poi/hwpf/usermodel/Table.java>: Some input files use or override a deprecated API.
[INFO] <https://builds.apache.org/job/POI-DSL-Maven/ws/sonar/scratchpad/src/main/java/org/apache/poi/hwpf/usermodel/Table.java>: Recompile with -Xlint:deprecation for details.
[INFO] <https://builds.apache.org/job/POI-DSL-Maven/ws/sonar/scratchpad/src/main/java/org/apache/poi/hemf/record/emfplus/HemfPlusObject.java>: Some input files use unchecked or unsafe operations.
[INFO] <https://builds.apache.org/job/POI-DSL-Maven/ws/sonar/scratchpad/src/main/java/org/apache/poi/hemf/record/emfplus/HemfPlusObject.java>: Recompile with -Xlint:unchecked for details.
[INFO]
[INFO] --- maven-resources-plugin:3.0.1:copy-resources (copy-tests) @ poi-scratchpad ---
[INFO] Using 'UTF-8' encoding to copy filtered resources.
[INFO] Copying 206 resources
[INFO]
[INFO] --- maven-resources-plugin:3.0.1:testResources (default-testResources) @ poi-scratchpad ---
[INFO] Using 'UTF-8' encoding to copy filtered resources.
[INFO] skip non existing resourceDirectory <https://builds.apache.org/job/POI-DSL-Maven/ws/sonar/scratchpad/src/test/resources>
[INFO]
[INFO] --- maven-compiler-plugin:3.5.1:testCompile (default-testCompile) @ poi-scratchpad ---
[INFO] Changes detected - recompiling the module!
[INFO] Compiling 204 source files to <https://builds.apache.org/job/POI-DSL-Maven/ws/sonar/scratchpad/target/test-classes>
[INFO] <https://builds.apache.org/job/POI-DSL-Maven/ws/sonar/scratchpad/src/test/java/org/apache/poi/hwpf/extractor/TestWordExtractor.java>: Some input files use or override a deprecated API.
[INFO] <https://builds.apache.org/job/POI-DSL-Maven/ws/sonar/scratchpad/src/test/java/org/apache/poi/hwpf/extractor/TestWordExtractor.java>: Recompile with -Xlint:deprecation for details.
[INFO] <https://builds.apache.org/job/POI-DSL-Maven/ws/sonar/scratchpad/src/test/java/org/apache/poi/hslf/usermodel/TestBugs.java>: <https://builds.apache.org/job/POI-DSL-Maven/ws/sonar/scratchpad/src/test/java/org/apache/poi/hslf/usermodel/TestBugs.java> uses unchecked or unsafe operations.
[INFO] <https://builds.apache.org/job/POI-DSL-Maven/ws/sonar/scratchpad/src/test/java/org/apache/poi/hslf/usermodel/TestBugs.java>: Recompile with -Xlint:unchecked for details.
[INFO] -------------------------------------------------------------
[ERROR] COMPILATION ERROR :
[INFO] -------------------------------------------------------------
[ERROR] <https://builds.apache.org/job/POI-DSL-Maven/ws/sonar/scratchpad/src/test/java/org/apache/poi/hwpf/usermodel/TestBugs.java>:[49,33] package org.apache.poi.ooxml.util does not exist
[ERROR] <https://builds.apache.org/job/POI-DSL-Maven/ws/sonar/scratchpad/src/test/java/org/apache/poi/hwpf/usermodel/TestBugs.java>:[902,33] cannot find symbol
  symbol:   variable DocumentHelper
  location: class org.apache.poi.hwpf.usermodel.TestBugs
[INFO] 2 errors
[INFO] -------------------------------------------------------------
[INFO] ------------------------------------------------------------------------
[INFO] Reactor Summary:
[INFO]
[INFO] Apache POI - the Java API for Microsoft Documents . SUCCESS [  0.003 s]
[INFO] Apache POI Main package ........................... SUCCESS [01:32 min]
[INFO] Apache POI Scratchpad package ..................... FAILURE [  5.087 s]
[INFO] Apache POI - Openxmlformats Schema package ........ SKIPPED
[INFO] Apache POI - Openxmlformats Encryption Schema package  SKIPPED
[INFO] Apache POI - Openxmlformats Security-Schema package  SKIPPED
[INFO] Apache POI OOXML package .......................... SKIPPED
[INFO] Apache POI ExcelAnt package ....................... SKIPPED
[INFO] Apache POI Examples package ....................... SKIPPED
[INFO] ------------------------------------------------------------------------
[INFO] BUILD FAILURE
[INFO] ------------------------------------------------------------------------
[INFO] Total time: 01:37 min
[INFO] Finished at: 2019-08-31T08:05:57+00:00
[INFO] Final Memory: 37M/771M
[INFO] ------------------------------------------------------------------------
[ERROR] Failed to execute goal org.apache.maven.plugins:maven-compiler-plugin:3.5.1:testCompile (default-testCompile) on project poi-scratchpad: Compilation failure: Compilation failure:
[ERROR] <https://builds.apache.org/job/POI-DSL-Maven/ws/sonar/scratchpad/src/test/java/org/apache/poi/hwpf/usermodel/TestBugs.java>:[49,33] package org.apache.poi.ooxml.util does not exist
[ERROR] <https://builds.apache.org/job/POI-DSL-Maven/ws/sonar/scratchpad/src/test/java/org/apache/poi/hwpf/usermodel/TestBugs.java>:[902,33] cannot find symbol
[ERROR] symbol:   variable DocumentHelper
[ERROR] location: class org.apache.poi.hwpf.usermodel.TestBugs
[ERROR] -> [Help 1]
[ERROR]
[ERROR] To see the full stack trace of the errors, re-run Maven with the -e switch.
[ERROR] Re-run Maven using the -X switch to enable full debug logging.
[ERROR]
[ERROR] For more information about the errors and possible solutions, please read the following articles:
[ERROR] [Help 1] http://cwiki.apache.org/confluence/display/MAVEN/MojoFailureException
[ERROR]
[ERROR] After correcting the problems, you can resume the build with the command
[ERROR]   mvn <goals> -rf :poi-scratchpad
Build step 'Invoke top-level Maven targets' marked build as failure
Recording test results

---------------------------------------------------------------------
To unsubscribe, e-mail: [hidden email]
For additional commands, e-mail: [hidden email]

Reply | Threaded
Open this post in threaded view
|

Jenkins build is back to normal : POI-DSL-Maven #909

Apache Jenkins Server
See <https://builds.apache.org/job/POI-DSL-Maven/909/display/redirect?page=changes>


---------------------------------------------------------------------
To unsubscribe, e-mail: [hidden email]
For additional commands, e-mail: [hidden email]