Build failed in Jenkins: POI-DSL-Maven #787

classic Classic list List threaded Threaded
4 messages Options
Reply | Threaded
Open this post in threaded view
|

Build failed in Jenkins: POI-DSL-Maven #787

Apache Jenkins Server
See <https://builds.apache.org/job/POI-DSL-Maven/787/display/redirect>

------------------------------------------
Started by an SCM change
[EnvInject] - Loading node environment variables.
[EnvInject] - Preparing an environment for the build.
[EnvInject] - Keeping Jenkins system variables.
[EnvInject] - Keeping Jenkins build variables.
[EnvInject] - Injecting as environment variables the properties content
LANG=en_US.UTF-8
FORREST_HOME=/home/jenkins/tools/forrest/latest

[EnvInject] - Variables injected successfully.
[EnvInject] - Injecting contributions.
Building remotely on ubuntu-eu2 (ubuntu trusty) in workspace <https://builds.apache.org/job/POI-DSL-Maven/ws/>
[WS-CLEANUP] Deleting project workspace...
[WS-CLEANUP] Done
Updating https://svn.apache.org/repos/asf/poi/trunk at revision '2019-01-27T12:03:51.172 +0000'
U         src/ooxml/testcases/org/apache/poi/xssf/util/MemoryUsage.java
U         src/testcases/org/apache/poi/hpsf/basic/TestReadAllFiles.java
U         src/testcases/org/apache/poi/hssf/usermodel/TestBugs.java
U         src/testcases/org/apache/poi/hssf/extractor/TestExcelExtractor.java
A         src/testcases/org/apache/poi/ss/formula/function/ExcelCetabFunctionExtractor.java
U         src/testcases/org/apache/poi/ss/usermodel/BaseTestSheetShiftRows.java
U         src/java/org/apache/poi/hssf/extractor/OldExcelExtractor.java
U         src/java/org/apache/poi/hssf/usermodel/HSSFWorkbook.java
U         src/java/org/apache/poi/poifs/filesystem/DirectoryNode.java
U         src/java/org/apache/poi/ss/formula/function/FunctionMetadataRegistry.java
U         src/java/org/apache/poi/ss/formula/function/FunctionDataBuilder.java
U         src/java/org/apache/poi/ss/formula/function/FunctionMetadata.java
U         src/java/org/apache/poi/ss/formula/function/FunctionMetadataReader.java
U         src/java/org/apache/poi/ss/formula/ptg/FuncVarPtg.java
U         src/java/org/apache/poi/ss/formula/ptg/AbstractFunctionPtg.java
U         src/java/org/apache/poi/ss/formula/ptg/ExpPtg.java
U         src/integrationtest/org/apache/poi/BaseIntegrationTest.java
U         src/integrationtest/org/apache/poi/stress/AbstractFileHandler.java
A         src/resources/main/org/apache/poi/ss/formula/function/functionMetadataCetab.txt
U         src/resources/main/org/apache/poi/ss/formula/function/functionMetadata.txt
A         src/scratchpad/testcases/org/apache/poi/TestJDK12.java
U         build.xml
U         jenkins/create_jobs.groovy
A         test-data/spreadsheet/60405.xls
U         file-leak-detector.exclude

<-- Got one external: forrest.properties, svn url: https://svn.apache.org/repos/asf/poi/site/forrest.properties -->
Fetching 'https://svn.apache.org/repos/asf/poi/site/forrest.properties' at -1 into '<https://builds.apache.org/job/POI-DSL-Maven/ws/forrest.properties'>
At revision 1852284


<-- Got one external: documentation, svn url: https://svn.apache.org/repos/asf/poi/site/src/documentation -->
Fetching 'https://svn.apache.org/repos/asf/poi/site/src/documentation' at -1 into '<https://builds.apache.org/job/POI-DSL-Maven/ws/src/documentation'>
At revision 1852284

At revision 1852284

org.tmatesoft.svn.core.SVNException: svn: E130003: Parser configuration problem: namespace reporting is not enabled
        at org.tmatesoft.svn.core.internal.wc.SVNErrorManager.error(SVNErrorManager.java:70)
        at org.tmatesoft.svn.core.internal.wc.SVNErrorManager.error(SVNErrorManager.java:57)
        at org.tmatesoft.svn.core.internal.io.dav.http.HTTPConnection.request(HTTPConnection.java:760)
        at org.tmatesoft.svn.core.internal.io.dav.http.HTTPConnection.request(HTTPConnection.java:352)
        at org.tmatesoft.svn.core.internal.io.dav.http.HTTPConnection.request(HTTPConnection.java:340)
        at org.tmatesoft.svn.core.internal.io.dav.DAVConnection.performHttpRequest(DAVConnection.java:910)
        at org.tmatesoft.svn.core.internal.io.dav.DAVConnection.doReport(DAVConnection.java:363)
        at org.tmatesoft.svn.core.internal.io.dav.DAVConnection.doReport(DAVConnection.java:353)
        at org.tmatesoft.svn.core.internal.io.dav.DAVRepository.logImpl(DAVRepository.java:1003)
        at org.tmatesoft.svn.core.io.SVNRepository.log(SVNRepository.java:1041)
        at org.tmatesoft.svn.core.internal.wc2.remote.SvnRemoteLog.run(SvnRemoteLog.java:181)
        at org.tmatesoft.svn.core.internal.wc2.remote.SvnRemoteLog.run(SvnRemoteLog.java:35)
        at org.tmatesoft.svn.core.internal.wc2.SvnOperationRunner.run(SvnOperationRunner.java:21)
        at org.tmatesoft.svn.core.wc2.SvnOperationFactory.run(SvnOperationFactory.java:1239)
        at org.tmatesoft.svn.core.wc2.SvnOperation.run(SvnOperation.java:294)
        at org.tmatesoft.svn.core.wc.SVNLogClient.doLog(SVNLogClient.java:968)
        at org.tmatesoft.svn.core.wc.SVNLogClient.doLog(SVNLogClient.java:873)
        at hudson.scm.SubversionChangeLogBuilder.buildModule(SubversionChangeLogBuilder.java:190)
Caused: hudson.util.IOException2: revision check failed on https://svn.apache.org/repos/asf/poi/trunk
        at hudson.scm.SubversionChangeLogBuilder.buildModule(SubversionChangeLogBuilder.java:204)
        at hudson.scm.SubversionChangeLogBuilder.run(SubversionChangeLogBuilder.java:124)
        at hudson.scm.SubversionSCM.calcChangeLog(SubversionSCM.java:757)
        at hudson.scm.SubversionSCM.checkout(SubversionSCM.java:898)
        at hudson.scm.SCM.checkout(SCM.java:504)
        at hudson.model.AbstractProject.checkout(AbstractProject.java:1208)
        at hudson.model.AbstractBuild$AbstractBuildExecution.defaultCheckout(AbstractBuild.java:574)
        at jenkins.scm.SCMCheckoutStrategy.checkout(SCMCheckoutStrategy.java:86)
        at hudson.model.AbstractBuild$AbstractBuildExecution.run(AbstractBuild.java:499)
        at hudson.model.Run.execute(Run.java:1810)
        at hudson.model.FreeStyleBuild.run(FreeStyleBuild.java:43)
        at hudson.model.ResourceController.execute(ResourceController.java:97)
        at hudson.model.Executor.run(Executor.java:429)
Retrying after 10 seconds
Updating https://svn.apache.org/repos/asf/poi/trunk at revision '2019-01-27T12:03:51.172 +0000'

<-- Got one external: forrest.properties, svn url: https://svn.apache.org/repos/asf/poi/site/forrest.properties -->
Fetching 'https://svn.apache.org/repos/asf/poi/site/forrest.properties' at -1 into '<https://builds.apache.org/job/POI-DSL-Maven/ws/forrest.properties'>
At revision 1852284


<-- Got one external: documentation, svn url: https://svn.apache.org/repos/asf/poi/site/src/documentation -->
Fetching 'https://svn.apache.org/repos/asf/poi/site/src/documentation' at -1 into '<https://builds.apache.org/job/POI-DSL-Maven/ws/src/documentation'>
At revision 1852284

At revision 1852284

org.tmatesoft.svn.core.SVNException: svn: E130003: Parser configuration problem: namespace reporting is not enabled
        at org.tmatesoft.svn.core.internal.wc.SVNErrorManager.error(SVNErrorManager.java:70)
        at org.tmatesoft.svn.core.internal.wc.SVNErrorManager.error(SVNErrorManager.java:57)
        at org.tmatesoft.svn.core.internal.io.dav.http.HTTPConnection.request(HTTPConnection.java:760)
        at org.tmatesoft.svn.core.internal.io.dav.http.HTTPConnection.request(HTTPConnection.java:352)
        at org.tmatesoft.svn.core.internal.io.dav.http.HTTPConnection.request(HTTPConnection.java:340)
        at org.tmatesoft.svn.core.internal.io.dav.DAVConnection.performHttpRequest(DAVConnection.java:910)
        at org.tmatesoft.svn.core.internal.io.dav.DAVConnection.doReport(DAVConnection.java:363)
        at org.tmatesoft.svn.core.internal.io.dav.DAVConnection.doReport(DAVConnection.java:353)
        at org.tmatesoft.svn.core.internal.io.dav.DAVRepository.logImpl(DAVRepository.java:1003)
        at org.tmatesoft.svn.core.io.SVNRepository.log(SVNRepository.java:1041)
        at org.tmatesoft.svn.core.internal.wc2.remote.SvnRemoteLog.run(SvnRemoteLog.java:181)
        at org.tmatesoft.svn.core.internal.wc2.remote.SvnRemoteLog.run(SvnRemoteLog.java:35)
        at org.tmatesoft.svn.core.internal.wc2.SvnOperationRunner.run(SvnOperationRunner.java:21)
        at org.tmatesoft.svn.core.wc2.SvnOperationFactory.run(SvnOperationFactory.java:1239)
        at org.tmatesoft.svn.core.wc2.SvnOperation.run(SvnOperation.java:294)
        at org.tmatesoft.svn.core.wc.SVNLogClient.doLog(SVNLogClient.java:968)
        at org.tmatesoft.svn.core.wc.SVNLogClient.doLog(SVNLogClient.java:873)
        at hudson.scm.SubversionChangeLogBuilder.buildModule(SubversionChangeLogBuilder.java:190)
Caused: hudson.util.IOException2: revision check failed on https://svn.apache.org/repos/asf/poi/trunk
        at hudson.scm.SubversionChangeLogBuilder.buildModule(SubversionChangeLogBuilder.java:204)
        at hudson.scm.SubversionChangeLogBuilder.run(SubversionChangeLogBuilder.java:124)
        at hudson.scm.SubversionSCM.calcChangeLog(SubversionSCM.java:757)
        at hudson.scm.SubversionSCM.checkout(SubversionSCM.java:898)
        at hudson.scm.SCM.checkout(SCM.java:504)
        at hudson.model.AbstractProject.checkout(AbstractProject.java:1208)
        at hudson.model.AbstractBuild$AbstractBuildExecution.defaultCheckout(AbstractBuild.java:574)
        at jenkins.scm.SCMCheckoutStrategy.checkout(SCMCheckoutStrategy.java:86)
        at hudson.model.AbstractBuild$AbstractBuildExecution.run(AbstractBuild.java:499)
        at hudson.model.Run.execute(Run.java:1810)
        at hudson.model.FreeStyleBuild.run(FreeStyleBuild.java:43)
        at hudson.model.ResourceController.execute(ResourceController.java:97)
        at hudson.model.Executor.run(Executor.java:429)
Retrying after 10 seconds
Updating https://svn.apache.org/repos/asf/poi/trunk at revision '2019-01-27T12:03:51.172 +0000'

<-- Got one external: forrest.properties, svn url: https://svn.apache.org/repos/asf/poi/site/forrest.properties -->
Fetching 'https://svn.apache.org/repos/asf/poi/site/forrest.properties' at -1 into '<https://builds.apache.org/job/POI-DSL-Maven/ws/forrest.properties'>
At revision 1852284


<-- Got one external: documentation, svn url: https://svn.apache.org/repos/asf/poi/site/src/documentation -->
Fetching 'https://svn.apache.org/repos/asf/poi/site/src/documentation' at -1 into '<https://builds.apache.org/job/POI-DSL-Maven/ws/src/documentation'>
At revision 1852284

At revision 1852284

org.tmatesoft.svn.core.SVNException: svn: E130003: Parser configuration problem: namespace reporting is not enabled
        at org.tmatesoft.svn.core.internal.wc.SVNErrorManager.error(SVNErrorManager.java:70)
        at org.tmatesoft.svn.core.internal.wc.SVNErrorManager.error(SVNErrorManager.java:57)
        at org.tmatesoft.svn.core.internal.io.dav.http.HTTPConnection.request(HTTPConnection.java:760)
        at org.tmatesoft.svn.core.internal.io.dav.http.HTTPConnection.request(HTTPConnection.java:352)
        at org.tmatesoft.svn.core.internal.io.dav.http.HTTPConnection.request(HTTPConnection.java:340)
        at org.tmatesoft.svn.core.internal.io.dav.DAVConnection.performHttpRequest(DAVConnection.java:910)
        at org.tmatesoft.svn.core.internal.io.dav.DAVConnection.doReport(DAVConnection.java:363)
        at org.tmatesoft.svn.core.internal.io.dav.DAVConnection.doReport(DAVConnection.java:353)
        at org.tmatesoft.svn.core.internal.io.dav.DAVRepository.logImpl(DAVRepository.java:1003)
        at org.tmatesoft.svn.core.io.SVNRepository.log(SVNRepository.java:1041)
        at org.tmatesoft.svn.core.internal.wc2.remote.SvnRemoteLog.run(SvnRemoteLog.java:181)
        at org.tmatesoft.svn.core.internal.wc2.remote.SvnRemoteLog.run(SvnRemoteLog.java:35)
        at org.tmatesoft.svn.core.internal.wc2.SvnOperationRunner.run(SvnOperationRunner.java:21)
        at org.tmatesoft.svn.core.wc2.SvnOperationFactory.run(SvnOperationFactory.java:1239)
        at org.tmatesoft.svn.core.wc2.SvnOperation.run(SvnOperation.java:294)
        at org.tmatesoft.svn.core.wc.SVNLogClient.doLog(SVNLogClient.java:968)
        at org.tmatesoft.svn.core.wc.SVNLogClient.doLog(SVNLogClient.java:873)
        at hudson.scm.SubversionChangeLogBuilder.buildModule(SubversionChangeLogBuilder.java:190)
Caused: hudson.util.IOException2: revision check failed on https://svn.apache.org/repos/asf/poi/trunk
        at hudson.scm.SubversionChangeLogBuilder.buildModule(SubversionChangeLogBuilder.java:204)
        at hudson.scm.SubversionChangeLogBuilder.run(SubversionChangeLogBuilder.java:124)
        at hudson.scm.SubversionSCM.calcChangeLog(SubversionSCM.java:757)
        at hudson.scm.SubversionSCM.checkout(SubversionSCM.java:898)
        at hudson.scm.SCM.checkout(SCM.java:504)
        at hudson.model.AbstractProject.checkout(AbstractProject.java:1208)
        at hudson.model.AbstractBuild$AbstractBuildExecution.defaultCheckout(AbstractBuild.java:574)
        at jenkins.scm.SCMCheckoutStrategy.checkout(SCMCheckoutStrategy.java:86)
        at hudson.model.AbstractBuild$AbstractBuildExecution.run(AbstractBuild.java:499)
        at hudson.model.Run.execute(Run.java:1810)
        at hudson.model.FreeStyleBuild.run(FreeStyleBuild.java:43)
        at hudson.model.ResourceController.execute(ResourceController.java:97)
        at hudson.model.Executor.run(Executor.java:429)
Retrying after 10 seconds
Updating https://svn.apache.org/repos/asf/poi/trunk at revision '2019-01-27T12:03:51.172 +0000'

<-- Got one external: forrest.properties, svn url: https://svn.apache.org/repos/asf/poi/site/forrest.properties -->
Fetching 'https://svn.apache.org/repos/asf/poi/site/forrest.properties' at -1 into '<https://builds.apache.org/job/POI-DSL-Maven/ws/forrest.properties'>
At revision 1852284


<-- Got one external: documentation, svn url: https://svn.apache.org/repos/asf/poi/site/src/documentation -->
Fetching 'https://svn.apache.org/repos/asf/poi/site/src/documentation' at -1 into '<https://builds.apache.org/job/POI-DSL-Maven/ws/src/documentation'>
At revision 1852284

At revision 1852284

org.tmatesoft.svn.core.SVNException: svn: E130003: Parser configuration problem: namespace reporting is not enabled
        at org.tmatesoft.svn.core.internal.wc.SVNErrorManager.error(SVNErrorManager.java:70)
        at org.tmatesoft.svn.core.internal.wc.SVNErrorManager.error(SVNErrorManager.java:57)
        at org.tmatesoft.svn.core.internal.io.dav.http.HTTPConnection.request(HTTPConnection.java:760)
        at org.tmatesoft.svn.core.internal.io.dav.http.HTTPConnection.request(HTTPConnection.java:352)
        at org.tmatesoft.svn.core.internal.io.dav.http.HTTPConnection.request(HTTPConnection.java:340)
        at org.tmatesoft.svn.core.internal.io.dav.DAVConnection.performHttpRequest(DAVConnection.java:910)
        at org.tmatesoft.svn.core.internal.io.dav.DAVConnection.doReport(DAVConnection.java:363)
        at org.tmatesoft.svn.core.internal.io.dav.DAVConnection.doReport(DAVConnection.java:353)
        at org.tmatesoft.svn.core.internal.io.dav.DAVRepository.logImpl(DAVRepository.java:1003)
        at org.tmatesoft.svn.core.io.SVNRepository.log(SVNRepository.java:1041)
        at org.tmatesoft.svn.core.internal.wc2.remote.SvnRemoteLog.run(SvnRemoteLog.java:181)
        at org.tmatesoft.svn.core.internal.wc2.remote.SvnRemoteLog.run(SvnRemoteLog.java:35)
        at org.tmatesoft.svn.core.internal.wc2.SvnOperationRunner.run(SvnOperationRunner.java:21)
        at org.tmatesoft.svn.core.wc2.SvnOperationFactory.run(SvnOperationFactory.java:1239)
        at org.tmatesoft.svn.core.wc2.SvnOperation.run(SvnOperation.java:294)
        at org.tmatesoft.svn.core.wc.SVNLogClient.doLog(SVNLogClient.java:968)
        at org.tmatesoft.svn.core.wc.SVNLogClient.doLog(SVNLogClient.java:873)
        at hudson.scm.SubversionChangeLogBuilder.buildModule(SubversionChangeLogBuilder.java:190)
Caused: hudson.util.IOException2: revision check failed on https://svn.apache.org/repos/asf/poi/trunk
        at hudson.scm.SubversionChangeLogBuilder.buildModule(SubversionChangeLogBuilder.java:204)
        at hudson.scm.SubversionChangeLogBuilder.run(SubversionChangeLogBuilder.java:124)
        at hudson.scm.SubversionSCM.calcChangeLog(SubversionSCM.java:757)
        at hudson.scm.SubversionSCM.checkout(SubversionSCM.java:898)
        at hudson.scm.SCM.checkout(SCM.java:504)
        at hudson.model.AbstractProject.checkout(AbstractProject.java:1208)
        at hudson.model.AbstractBuild$AbstractBuildExecution.defaultCheckout(AbstractBuild.java:574)
        at jenkins.scm.SCMCheckoutStrategy.checkout(SCMCheckoutStrategy.java:86)
        at hudson.model.AbstractBuild$AbstractBuildExecution.run(AbstractBuild.java:499)
        at hudson.model.Run.execute(Run.java:1810)
        at hudson.model.FreeStyleBuild.run(FreeStyleBuild.java:43)
        at hudson.model.ResourceController.execute(ResourceController.java:97)
        at hudson.model.Executor.run(Executor.java:429)
Recording test results
ERROR: Step ‘Publish JUnit test result report’ failed: Test reports were found but none of them are new. Did leafNodes run?
For example, <https://builds.apache.org/job/POI-DSL-Maven/ws/sonar/excelant/target/surefire-reports/TEST-org.apache.poi.ss.examples.formula.TestExcelAntUserDefinedFunction.xml> is 11 hr old


---------------------------------------------------------------------
To unsubscribe, e-mail: [hidden email]
For additional commands, e-mail: [hidden email]

Reply | Threaded
Open this post in threaded view
|

failed build

Vladislav Galas
Is that because of my change with release-notes?
If so, could someone fix it properly pls? Sorry for breaking the build

---------------------------------------------------------------------
To unsubscribe, e-mail: [hidden email]
For additional commands, e-mail: [hidden email]

Reply | Threaded
Open this post in threaded view
|

Jenkins build is back to normal : POI-DSL-Maven #788

Apache Jenkins Server
In reply to this post by Apache Jenkins Server
See <https://builds.apache.org/job/POI-DSL-Maven/788/display/redirect>


---------------------------------------------------------------------
To unsubscribe, e-mail: [hidden email]
For additional commands, e-mail: [hidden email]

Reply | Threaded
Open this post in threaded view
|

Re: failed build

kiwiwings
In reply to this post by Vladislav Galas
On 27.01.19 15:15, Vladislav Galas wrote:
> Is that because of my change with release-notes?
> If so, could someone fix it properly pls? Sorry for breaking the build

Seems to work now, after removing the external & the directory and then adding the external again.

Oh well, boys and their toys :P


---------------------------------------------------------------------
To unsubscribe, e-mail: [hidden email]
For additional commands, e-mail: [hidden email]